mesos-builds mailing list archives

Site index · List index
Message view « Date » · « Thread »
Top « Date » · « Thread »
From Apache Jenkins Server <jenk...@builds.apache.org>
Subject Build failed in Jenkins: Mesos-Buildbot » autotools,gcc,--verbose,GLOG_v=1 MESOS_VERBOSE=1,centos:7,(ubuntu)&&(!ubuntu-us1)&&(!ubuntu-eu2) #4124
Date Fri, 18 Aug 2017 04:33:28 GMT
See <https://builds.apache.org/job/Mesos-Buildbot/BUILDTOOL=autotools,COMPILER=gcc,CONFIGURATION=--verbose,ENVIRONMENT=GLOG_v=1%20MESOS_VERBOSE=1,OS=centos%3A7,label_exp=(ubuntu)&&(!ubuntu-us1)&&(!ubuntu-eu2)/4124/display/redirect?page=changes>

Changes:

[mpark] Corrected the rolling upgrade versions in 1.3.1 release blog post.

[josephwu] Windows: Disabled two agent recovery tests.

[Kapil Arya] Bumped version to 1.5.0.

------------------------------------------
[...truncated 30.81 MB...]
I0818 04:33:11.039583  6600 slave.cpp:251] Flags at startup: --acls="" --appc_simple_discovery_uri_prefix="http://"
--appc_store_dir="/tmp/Endpoint_SlaveEndpointTest_AuthorizedRequest_2_QK40YN/store/appc" --authenticate_http_readonly="true"
--authenticate_http_readwrite="true" --authenticatee="crammd5" --authentication_backoff_factor="1secs"
--authorizer="local" --cgroups_cpu_enable_pids_and_tids_count="false" --cgroups_enable_cfs="false"
--cgroups_hierarchy="/sys/fs/cgroup" --cgroups_limit_swap="false" --cgroups_root="mesos" --container_disk_watch_interval="15secs"
--containerizers="mesos" --credential="/tmp/Endpoint_SlaveEndpointTest_AuthorizedRequest_2_QK40YN/credential"
--default_role="*" --disallow_sharing_agent_pid_namespace="false" --disk_watch_interval="1mins"
--docker="docker" --docker_kill_orphans="true" --docker_registry="https://registry-1.docker.io"
--docker_remove_delay="6hrs" --docker_socket="/var/run/docker.sock" --docker_stop_timeout="0ns"
--docker_store_dir="/tmp/Endpoint_SlaveEndpointTest_AuthorizedRequest_2_QK40YN/store/docker"
--docker_volume_checkpoint_dir="/var/run/mesos/isolators/docker/volume" --enforce_container_disk_quota="false"
--executor_registration_timeout="1mins" --executor_reregistration_timeout="2secs" --executor_shutdown_grace_period="5secs"
--fetcher_cache_dir="/tmp/Endpoint_SlaveEndpointTest_AuthorizedRequest_2_QK40YN/fetch" --fetcher_cache_size="2GB"
--frameworks_home="" --gc_delay="1weeks" --gc_disk_headroom="0.1" --hadoop_home="" --help="false"
--hostname_lookup="true" --http_command_executor="false" --http_credentials="/tmp/Endpoint_SlaveEndpointTest_AuthorizedRequest_2_QK40YN/http_credentials"
--http_heartbeat_interval="30secs" --initialize_driver_logging="true" --isolation="posix/cpu,posix/mem"
--launcher="posix" --launcher_dir="/mesos/mesos-1.5.0/_build/src" --logbufsecs="0" --logging_level="INFO"
--max_completed_executors_per_framework="150" --oversubscribed_resources_interval="15secs"
--perf_duration="10secs" --perf_interval="1mins" --port="5051" --qos_correction_interval_min="0ns"
--quiet="false" --recover="reconnect" --recovery_timeout="15mins" --registration_backoff_factor="10ms"
--resources="cpus:2;gpus:0;mem:1024;disk:1024;ports:[31000-32000]" --revocable_cpu_low_priority="true"
--runtime_dir="/tmp/Endpoint_SlaveEndpointTest_AuthorizedRequest_2_QK40YN" --sandbox_directory="/mnt/mesos/sandbox"
--strict="true" --switch_user="true" --systemd_enable_support="true" --systemd_runtime_directory="/run/systemd/system"
--version="false" --work_dir="/tmp/Endpoint_SlaveEndpointTest_AuthorizedRequest_2_1KbiUf"
I0818 04:33:11.040130  6600 credentials.hpp:86] Loading credential for authentication from
'/tmp/Endpoint_SlaveEndpointTest_AuthorizedRequest_2_QK40YN/credential'
I0818 04:33:11.040330  6600 slave.cpp:283] Agent using credential for: test-principal
I0818 04:33:11.040354  6600 credentials.hpp:37] Loading credentials for authentication from
'/tmp/Endpoint_SlaveEndpointTest_AuthorizedRequest_2_QK40YN/http_credentials'
I0818 04:33:11.040671  6600 http.cpp:1026] Creating default 'basic' HTTP authenticator for
realm 'mesos-agent-readonly'
I0818 04:33:11.040868  6600 http.cpp:1026] Creating default 'basic' HTTP authenticator for
realm 'mesos-agent-readwrite'
I0818 04:33:11.042699  6600 slave.cpp:565] Agent resources: [{"name":"cpus","scalar":{"value":2.0},"type":"SCALAR"},{"name":"mem","scalar":{"value":1024.0},"type":"SCALAR"},{"name":"disk","scalar":{"value":1024.0},"type":"SCALAR"},{"name":"ports","ranges":{"range":[{"begin":31000,"end":32000}]},"type":"RANGES"}]
I0818 04:33:11.043215  6600 slave.cpp:573] Agent attributes: [  ]
I0818 04:33:11.043308  6600 slave.cpp:582] Agent hostname: 0658d93e44e2
I0818 04:33:11.043602  6596 status_update_manager.cpp:177] Pausing sending status updates
I0818 04:33:11.045589  6601 state.cpp:64] Recovering state from '/tmp/Endpoint_SlaveEndpointTest_AuthorizedRequest_2_1KbiUf/meta'
I0818 04:33:11.046218  6605 status_update_manager.cpp:203] Recovering status update manager
I0818 04:33:11.046442  6595 containerizer.cpp:609] Recovering containerizer
I0818 04:33:11.048184  6584 provisioner.cpp:416] Provisioner recovery complete
I0818 04:33:11.048617  6600 slave.cpp:6210] Finished recovery
I0818 04:33:11.049134  6600 slave.cpp:6392] Querying resource estimator for oversubscribable
resources
I0818 04:33:11.049643  6585 slave.cpp:6406] Received oversubscribable resources {} from the
resource estimator
I0818 04:33:11.053129  6588 process.cpp:3933] Handling HTTP event for process 'slave(796)'
with path: '/slave(796)/containers'
I0818 04:33:11.054653  6601 http.cpp:1166] HTTP GET for /slave(796)/containers from 172.17.0.11:39602
I0818 04:33:11.054744  6601 http.cpp:957] Authorizing principal 'test-principal' to GET the
'/containers' endpoint
I0818 04:33:11.059000  6594 slave.cpp:843] Agent terminating
[       OK ] Endpoint/SlaveEndpointTest.AuthorizedRequest/2 (39 ms)
[ RUN      ] Endpoint/SlaveEndpointTest.UnauthorizedRequest/0
I0818 04:33:11.075244  6565 containerizer.cpp:246] Using isolation: posix/cpu,posix/mem,filesystem/posix,network/cni,environment_secret
W0818 04:33:11.076162  6565 backend.cpp:76] Failed to create 'aufs' backend: AufsBackend requires
root privileges
W0818 04:33:11.076330  6565 backend.cpp:76] Failed to create 'bind' backend: BindBackend requires
root privileges
I0818 04:33:11.076381  6565 provisioner.cpp:255] Using default backend 'copy'
I0818 04:33:11.080976  6584 slave.cpp:250] Mesos agent started on (797)@172.17.0.11:34116
I0818 04:33:11.081053  6584 slave.cpp:251] Flags at startup: --acls="" --appc_simple_discovery_uri_prefix="http://"
--appc_store_dir="/tmp/Endpoint_SlaveEndpointTest_UnauthorizedRequest_0_WDD7B0/store/appc"
--authenticate_http_readonly="true" --authenticate_http_readwrite="true" --authenticatee="crammd5"
--authentication_backoff_factor="1secs" --authorizer="local" --cgroups_cpu_enable_pids_and_tids_count="false"
--cgroups_enable_cfs="false" --cgroups_hierarchy="/sys/fs/cgroup" --cgroups_limit_swap="false"
--cgroups_root="mesos" --container_disk_watch_interval="15secs" --containerizers="mesos" --credential="/tmp/Endpoint_SlaveEndpointTest_UnauthorizedRequest_0_WDD7B0/credential"
--default_role="*" --disallow_sharing_agent_pid_namespace="false" --disk_watch_interval="1mins"
--docker="docker" --docker_kill_orphans="true" --docker_registry="https://registry-1.docker.io"
--docker_remove_delay="6hrs" --docker_socket="/var/run/docker.sock" --docker_stop_timeout="0ns"
--docker_store_dir="/tmp/Endpoint_SlaveEndpointTest_UnauthorizedRequest_0_WDD7B0/store/docker"
--docker_volume_checkpoint_dir="/var/run/mesos/isolators/docker/volume" --enforce_container_disk_quota="false"
--executor_registration_timeout="1mins" --executor_reregistration_timeout="2secs" --executor_shutdown_grace_period="5secs"
--fetcher_cache_dir="/tmp/Endpoint_SlaveEndpointTest_UnauthorizedRequest_0_WDD7B0/fetch" --fetcher_cache_size="2GB"
--frameworks_home="" --gc_delay="1weeks" --gc_disk_headroom="0.1" --hadoop_home="" --help="false"
--hostname_lookup="true" --http_command_executor="false" --http_credentials="/tmp/Endpoint_SlaveEndpointTest_UnauthorizedRequest_0_WDD7B0/http_credentials"
--http_heartbeat_interval="30secs" --initialize_driver_logging="true" --isolation="posix/cpu,posix/mem"
--launcher="posix" --launcher_dir="/mesos/mesos-1.5.0/_build/src" --logbufsecs="0" --logging_level="INFO"
--max_completed_executors_per_framework="150" --oversubscribed_resources_interval="15secs"
--perf_duration="10secs" --perf_interval="1mins" --port="5051" --qos_correction_interval_min="0ns"
--quiet="false" --recover="reconnect" --recovery_timeout="15mins" --registration_backoff_factor="10ms"
--resources="cpus:2;gpus:0;mem:1024;disk:1024;ports:[31000-32000]" --revocable_cpu_low_priority="true"
--runtime_dir="/tmp/Endpoint_SlaveEndpointTest_UnauthorizedRequest_0_WDD7B0" --sandbox_directory="/mnt/mesos/sandbox"
--strict="true" --switch_user="true" --systemd_enable_support="true" --systemd_runtime_directory="/run/systemd/system"
--version="false" --work_dir="/tmp/Endpoint_SlaveEndpointTest_UnauthorizedRequest_0_PM9qrs"
I0818 04:33:11.081794  6584 credentials.hpp:86] Loading credential for authentication from
'/tmp/Endpoint_SlaveEndpointTest_UnauthorizedRequest_0_WDD7B0/credential'
I0818 04:33:11.082134  6584 slave.cpp:283] Agent using credential for: test-principal
I0818 04:33:11.082167  6584 credentials.hpp:37] Loading credentials for authentication from
'/tmp/Endpoint_SlaveEndpointTest_UnauthorizedRequest_0_WDD7B0/http_credentials'
I0818 04:33:11.082525  6584 http.cpp:1026] Creating default 'basic' HTTP authenticator for
realm 'mesos-agent-readonly'
I0818 04:33:11.082825  6584 http.cpp:1026] Creating default 'basic' HTTP authenticator for
realm 'mesos-agent-readwrite'
I0818 04:33:11.084941  6584 slave.cpp:565] Agent resources: [{"name":"cpus","scalar":{"value":2.0},"type":"SCALAR"},{"name":"mem","scalar":{"value":1024.0},"type":"SCALAR"},{"name":"disk","scalar":{"value":1024.0},"type":"SCALAR"},{"name":"ports","ranges":{"range":[{"begin":31000,"end":32000}]},"type":"RANGES"}]
I0818 04:33:11.085431  6584 slave.cpp:573] Agent attributes: [  ]
I0818 04:33:11.085541  6584 slave.cpp:582] Agent hostname: 0658d93e44e2
I0818 04:33:11.085796  6601 status_update_manager.cpp:177] Pausing sending status updates
I0818 04:33:11.088126  6584 state.cpp:64] Recovering state from '/tmp/Endpoint_SlaveEndpointTest_UnauthorizedRequest_0_PM9qrs/meta'
I0818 04:33:11.089313  6595 status_update_manager.cpp:203] Recovering status update manager
I0818 04:33:11.089654  6585 containerizer.cpp:609] Recovering containerizer
I0818 04:33:11.091910  6600 provisioner.cpp:416] Provisioner recovery complete
I0818 04:33:11.092547  6584 slave.cpp:6210] Finished recovery
I0818 04:33:11.093293  6584 slave.cpp:6392] Querying resource estimator for oversubscribable
resources
I0818 04:33:11.093739  6603 slave.cpp:6406] Received oversubscribable resources {} from the
resource estimator
I0818 04:33:11.097487  6592 process.cpp:3933] Handling HTTP event for process 'slave(797)'
with path: '/slave(797)/monitor/statistics'
I0818 04:33:11.099105  6587 http.cpp:1166] HTTP GET for /slave(797)/monitor/statistics from
172.17.0.11:39606
I0818 04:33:11.099189  6587 http.cpp:957] Authorizing principal 'test-principal' to GET the
'/monitor/statistics' endpoint
I0818 04:33:11.102123  6565 slave.cpp:843] Agent terminating
[       OK ] Endpoint/SlaveEndpointTest.UnauthorizedRequest/0 (41 ms)
[ RUN      ] Endpoint/SlaveEndpointTest.UnauthorizedRequest/1
I0818 04:33:11.113952  6565 containerizer.cpp:246] Using isolation: posix/cpu,posix/mem,filesystem/posix,network/cni,environment_secret
W0818 04:33:11.114492  6565 backend.cpp:76] Failed to create 'aufs' backend: AufsBackend requires
root privileges
W0818 04:33:11.114609  6565 backend.cpp:76] Failed to create 'bind' backend: BindBackend requires
root privileges
I0818 04:33:11.114646  6565 provisioner.cpp:255] Using default backend 'copy'
I0818 04:33:11.118396  6591 slave.cpp:250] Mesos agent started on (798)@172.17.0.11:34116
I0818 04:33:11.118441  6591 slave.cpp:251] Flags at startup: --acls="" --appc_simple_discovery_uri_prefix="http://"
--appc_store_dir="/tmp/Endpoint_SlaveEndpointTest_UnauthorizedRequest_1_mbOYDd/store/appc"
--authenticate_http_readonly="true" --authenticate_http_readwrite="true" --authenticatee="crammd5"
--authentication_backoff_factor="1secs" --authorizer="local" --cgroups_cpu_enable_pids_and_tids_count="false"
--cgroups_enable_cfs="false" --cgroups_hierarchy="/sys/fs/cgroup" --cgroups_limit_swap="false"
--cgroups_root="mesos" --container_disk_watch_interval="15secs" --containerizers="mesos" --credential="/tmp/Endpoint_SlaveEndpointTest_UnauthorizedRequest_1_mbOYDd/credential"
--default_role="*" --disallow_sharing_agent_pid_namespace="false" --disk_watch_interval="1mins"
--docker="docker" --docker_kill_orphans="true" --docker_registry="https://registry-1.docker.io"
--docker_remove_delay="6hrs" --docker_socket="/var/run/docker.sock" --docker_stop_timeout="0ns"
--docker_store_dir="/tmp/Endpoint_SlaveEndpointTest_UnauthorizedRequest_1_mbOYDd/store/docker"
--docker_volume_checkpoint_dir="/var/run/mesos/isolators/docker/volume" --enforce_container_disk_quota="false"
--executor_registration_timeout="1mins" --executor_reregistration_timeout="2secs" --executor_shutdown_grace_period="5secs"
--fetcher_cache_dir="/tmp/Endpoint_SlaveEndpointTest_UnauthorizedRequest_1_mbOYDd/fetch" --fetcher_cache_size="2GB"
--frameworks_home="" --gc_delay="1weeks" --gc_disk_headroom="0.1" --hadoop_home="" --help="false"
--hostname_lookup="true" --http_command_executor="false" --http_credentials="/tmp/Endpoint_SlaveEndpointTest_UnauthorizedRequest_1_mbOYDd/http_credentials"
--http_heartbeat_interval="30secs" --initialize_driver_logging="true" --isolation="posix/cpu,posix/mem"
--launcher="posix" --launcher_dir="/mesos/mesos-1.5.0/_build/src" --logbufsecs="0" --logging_level="INFO"
--max_completed_executors_per_framework="150" --oversubscribed_resources_interval="15secs"
--perf_duration="10secs" --perf_interval="1mins" --port="5051" --qos_correction_interval_min="0ns"
--quiet="false" --recover="reconnect" --recovery_timeout="15mins" --registration_backoff_factor="10ms"
--resources="cpus:2;gpus:0;mem:1024;disk:1024;ports:[31000-32000]" --revocable_cpu_low_priority="true"
--runtime_dir="/tmp/Endpoint_SlaveEndpointTest_UnauthorizedRequest_1_mbOYDd" --sandbox_directory="/mnt/mesos/sandbox"
--strict="true" --switch_user="true" --systemd_enable_support="true" --systemd_runtime_directory="/run/systemd/system"
--version="false" --work_dir="/tmp/Endpoint_SlaveEndpointTest_UnauthorizedRequest_1_PRWfnF"
I0818 04:33:11.118963  6591 credentials.hpp:86] Loading credential for authentication from
'/tmp/Endpoint_SlaveEndpointTest_UnauthorizedRequest_1_mbOYDd/credential'
I0818 04:33:11.119223  6591 slave.cpp:283] Agent using credential for: test-principal
I0818 04:33:11.119247  6591 credentials.hpp:37] Loading credentials for authentication from
'/tmp/Endpoint_SlaveEndpointTest_UnauthorizedRequest_1_mbOYDd/http_credentials'
I0818 04:33:11.119515  6591 http.cpp:1026] Creating default 'basic' HTTP authenticator for
realm 'mesos-agent-readonly'
I0818 04:33:11.119791  6591 http.cpp:1026] Creating default 'basic' HTTP authenticator for
realm 'mesos-agent-readwrite'
I0818 04:33:11.121337  6591 slave.cpp:565] Agent resources: [{"name":"cpus","scalar":{"value":2.0},"type":"SCALAR"},{"name":"mem","scalar":{"value":1024.0},"type":"SCALAR"},{"name":"disk","scalar":{"value":1024.0},"type":"SCALAR"},{"name":"ports","ranges":{"range":[{"begin":31000,"end":32000}]},"type":"RANGES"}]
I0818 04:33:11.121603  6591 slave.cpp:573] Agent attributes: [  ]
I0818 04:33:11.121618  6591 slave.cpp:582] Agent hostname: 0658d93e44e2
I0818 04:33:11.121806  6595 status_update_manager.cpp:177] Pausing sending status updates
I0818 04:33:11.123831  6603 state.cpp:64] Recovering state from '/tmp/Endpoint_SlaveEndpointTest_UnauthorizedRequest_1_PRWfnF/meta'
I0818 04:33:11.124248  6603 status_update_manager.cpp:203] Recovering status update manager
I0818 04:33:11.124485  6597 containerizer.cpp:609] Recovering containerizer
I0818 04:33:11.126426  6606 provisioner.cpp:416] Provisioner recovery complete
I0818 04:33:11.126879  6607 slave.cpp:6210] Finished recovery
I0818 04:33:11.127315  6607 slave.cpp:6392] Querying resource estimator for oversubscribable
resources
I0818 04:33:11.127542  6590 slave.cpp:6406] Received oversubscribable resources {} from the
resource estimator
I0818 04:33:11.131093  6596 process.cpp:3933] Handling HTTP event for process 'slave(798)'
with path: '/slave(798)/monitor/statistics.json'
I0818 04:33:11.132561  6591 http.cpp:1166] HTTP GET for /slave(798)/monitor/statistics.json
from 172.17.0.11:39608
I0818 04:33:11.132683  6591 http.cpp:957] Authorizing principal 'test-principal' to GET the
'/monitor/statistics.json' endpoint
I0818 04:33:11.136167  6565 slave.cpp:843] Agent terminating
[       OK ] Endpoint/SlaveEndpointTest.UnauthorizedRequest/1 (33 ms)
[ RUN      ] Endpoint/SlaveEndpointTest.UnauthorizedRequest/2
I0818 04:33:11.147181  6565 containerizer.cpp:246] Using isolation: posix/cpu,posix/mem,filesystem/posix,network/cni,environment_secret
W0818 04:33:11.147724  6565 backend.cpp:76] Failed to create 'aufs' backend: AufsBackend requires
root privileges
W0818 04:33:11.147831  6565 backend.cpp:76] Failed to create 'bind' backend: BindBackend requires
root privileges
I0818 04:33:11.147863  6565 provisioner.cpp:255] Using default backend 'copy'
I0818 04:33:11.151396  6605 slave.cpp:250] Mesos agent started on (799)@172.17.0.11:34116
I0818 04:33:11.151453  6605 slave.cpp:251] Flags at startup: --acls="" --appc_simple_discovery_uri_prefix="http://"
--appc_store_dir="/tmp/Endpoint_SlaveEndpointTest_UnauthorizedRequest_2_0JXRZq/store/appc"
--authenticate_http_readonly="true" --authenticate_http_readwrite="true" --authenticatee="crammd5"
--authentication_backoff_factor="1secs" --authorizer="local" --cgroups_cpu_enable_pids_and_tids_count="false"
--cgroups_enable_cfs="false" --cgroups_hierarchy="/sys/fs/cgroup" --cgroups_limit_swap="false"
--cgroups_root="mesos" --container_disk_watch_interval="15secs" --containerizers="mesos" --credential="/tmp/Endpoint_SlaveEndpointTest_UnauthorizedRequest_2_0JXRZq/credential"
--default_role="*" --disallow_sharing_agent_pid_namespace="false" --disk_watch_interval="1mins"
--docker="docker" --docker_kill_orphans="true" --docker_registry="https://registry-1.docker.io"
--docker_remove_delay="6hrs" --docker_socket="/var/run/docker.sock" --docker_stop_timeout="0ns"
--docker_store_dir="/tmp/Endpoint_SlaveEndpointTest_UnauthorizedRequest_2_0JXRZq/store/docker"
--docker_volume_checkpoint_dir="/var/run/mesos/isolators/docker/volume" --enforce_container_disk_quota="false"
--executor_registration_timeout="1mins" --executor_reregistration_timeout="2secs" --executor_shutdown_grace_period="5secs"
--fetcher_cache_dir="/tmp/Endpoint_SlaveEndpointTest_UnauthorizedRequest_2_0JXRZq/fetch" --fetcher_cache_size="2GB"
--frameworks_home="" --gc_delay="1weeks" --gc_disk_headroom="0.1" --hadoop_home="" --help="false"
--hostname_lookup="true" --http_command_executor="false" --http_credentials="/tmp/Endpoint_SlaveEndpointTest_UnauthorizedRequest_2_0JXRZq/http_credentials"
--http_heartbeat_interval="30secs" --initialize_driver_logging="true" --isolation="posix/cpu,posix/mem"
--launcher="posix" --launcher_dir="/mesos/mesos-1.5.0/_build/src" --logbufsecs="0" --logging_level="INFO"
--max_completed_executors_per_framework="150" --oversubscribed_resources_interval="15secs"
--perf_duration="10secs" --perf_interval="1mins" --port="5051" --qos_correction_interval_min="0ns"
--quiet="false" --recover="reconnect" --recovery_timeout="15mins" --registration_backoff_factor="10ms"
--resources="cpus:2;gpus:0;mem:1024;disk:1024;ports:[31000-32000]" --revocable_cpu_low_priority="true"
--runtime_dir="/tmp/Endpoint_SlaveEndpointTest_UnauthorizedRequest_2_0JXRZq" --sandbox_directory="/mnt/mesos/sandbox"
--strict="true" --switch_user="true" --systemd_enable_support="true" --systemd_runtime_directory="/run/systemd/system"
--version="false" --work_dir="/tmp/Endpoint_SlaveEndpointTest_UnauthorizedRequest_2_Xs1aES"
I0818 04:33:11.152024  6605 credentials.hpp:86] Loading credential for authentication from
'/tmp/Endpoint_SlaveEndpointTest_UnauthorizedRequest_2_0JXRZq/credential'
I0818 04:33:11.152323  6605 slave.cpp:283] Agent using credential for: test-principal
I0818 04:33:11.152346  6605 credentials.hpp:37] Loading credentials for authentication from
'/tmp/Endpoint_SlaveEndpointTest_UnauthorizedRequest_2_0JXRZq/http_credentials'
I0818 04:33:11.152633  6605 http.cpp:1026] Creating default 'basic' HTTP authenticator for
realm 'mesos-agent-readonly'
I0818 04:33:11.152942  6605 http.cpp:1026] Creating default 'basic' HTTP authenticator for
realm 'mesos-agent-readwrite'
I0818 04:33:11.154536  6605 slave.cpp:565] Agent resources: [{"name":"cpus","scalar":{"value":2.0},"type":"SCALAR"},{"name":"mem","scalar":{"value":1024.0},"type":"SCALAR"},{"name":"disk","scalar":{"value":1024.0},"type":"SCALAR"},{"name":"ports","ranges":{"range":[{"begin":31000,"end":32000}]},"type":"RANGES"}]
I0818 04:33:11.154799  6605 slave.cpp:573] Agent attributes: [  ]
I0818 04:33:11.154814  6605 slave.cpp:582] Agent hostname: 0658d93e44e2
I0818 04:33:11.155014  6584 status_update_manager.cpp:177] Pausing sending status updates
I0818 04:33:11.157088  6595 state.cpp:64] Recovering state from '/tmp/Endpoint_SlaveEndpointTest_UnauthorizedRequest_2_Xs1aES/meta'
I0818 04:33:11.157377  6603 status_update_manager.cpp:203] Recovering status update manager
I0818 04:33:11.157564  6594 containerizer.cpp:609] Recovering containerizer
I0818 04:33:11.159329  6592 provisioner.cpp:416] Provisioner recovery complete
I0818 04:33:11.159850  6588 slave.cpp:6210] Finished recovery
I0818 04:33:11.160532  6588 slave.cpp:6392] Querying resource estimator for oversubscribable
resources
I0818 04:33:11.160850  6589 slave.cpp:6406] Received oversubscribable resources {} from the
resource estimator
I0818 04:33:11.164108  6587 process.cpp:3933] Handling HTTP event for process 'slave(799)'
with path: '/slave(799)/containers'
I0818 04:33:11.165716  6605 http.cpp:1166] HTTP GET for /slave(799)/containers from 172.17.0.11:39610
I0818 04:33:11.165815  6605 http.cpp:957] Authorizing principal 'test-principal' to GET the
'/containers' endpoint
I0818 04:33:11.168189  6565 slave.cpp:843] Agent terminating
[       OK ] Endpoint/SlaveEndpointTest.UnauthorizedRequest/2 (32 ms)
[ RUN      ] Endpoint/SlaveEndpointTest.NoAuthorizer/0
I0818 04:33:11.182523  6565 containerizer.cpp:246] Using isolation: posix/cpu,posix/mem,filesystem/posix,network/cni,environment_secret
W0818 04:33:11.183301  6565 backend.cpp:76] Failed to create 'aufs' backend: AufsBackend requires
root privileges
W0818 04:33:11.183440  6565 backend.cpp:76] Failed to create 'bind' backend: BindBackend requires
root privileges
I0818 04:33:11.183482  6565 provisioner.cpp:255] Using default backend 'copy'
I0818 04:33:11.186035  6565 cluster.cpp:448] Creating default 'local' authorizer
I0818 04:33:11.188567  6585 slave.cpp:250] Mesos agent started on (800)@172.17.0.11:34116
I0818 04:33:11.188601  6585 slave.cpp:251] Flags at startup: --acls="" --appc_simple_discovery_uri_prefix="http://"
--appc_store_dir="/tmp/Endpoint_SlaveEndpointTest_NoAuthorizer_0_sYJAFE/store/appc" --authenticate_http_readonly="true"
--authenticate_http_readwrite="true" --authenticatee="crammd5" --authentication_backoff_factor="1secs"
--authorizer="local" --cgroups_cpu_enable_pids_and_tids_count="false" --cgroups_enable_cfs="false"
--cgroups_hierarchy="/sys/fs/cgroup" --cgroups_limit_swap="false" --cgroups_root="mesos" --container_disk_watch_interval="15secs"
--containerizers="mesos" --credential="/tmp/Endpoint_SlaveEndpointTest_NoAuthorizer_0_sYJAFE/credential"
--default_role="*" --disallow_sharing_agent_pid_namespace="false" --disk_watch_interval="1mins"
--docker="docker" --docker_kill_orphans="true" --docker_registry="https://registry-1.docker.io"
--docker_remove_delay="6hrs" --docker_socket="/var/run/docker.sock" --docker_stop_timeout="0ns"
--docker_store_dir="/tmp/Endpoint_SlaveEndpointTest_NoAuthorizer_0_sYJAFE/store/docker" --docker_volume_checkpoint_dir="/var/run/mesos/isolators/docker/volume"
--enforce_container_disk_quota="false" --executor_registration_timeout="1mins" --executor_reregistration_timeout="2secs"
--executor_shutdown_grace_period="5secs" --fetcher_cache_dir="/tmp/Endpoint_SlaveEndpointTest_NoAuthorizer_0_sYJAFE/fetch"
--fetcher_cache_size="2GB" --frameworks_home="" --gc_delay="1weeks" --gc_disk_headroom="0.1"
--hadoop_home="" --help="false" --hostname_lookup="true" --http_command_executor="false" --http_credentials="/tmp/Endpoint_SlaveEndpointTest_NoAuthorizer_0_sYJAFE/http_credentials"
--http_heartbeat_interval="30secs" --initialize_driver_logging="true" --isolation="posix/cpu,posix/mem"
--launcher="posix" --launcher_dir="/mesos/mesos-1.5.0/_build/src" --logbufsecs="0" --logging_level="INFO"
--max_completed_executors_per_framework="150" --oversubscribed_resources_interval="15secs"
--perf_duration="10secs" --perf_interval="1mins" --port="5051" --qos_correction_interval_min="0ns"
--quiet="false" --recover="reconnect" --recovery_timeout="15mins" --registration_backoff_factor="10ms"
--resources="cpus:2;gpus:0;mem:1024;disk:1024;ports:[31000-32000]" --revocable_cpu_low_priority="true"
--runtime_dir="/tmp/Endpoint_SlaveEndpointTest_NoAuthorizer_0_sYJAFE" --sandbox_directory="/mnt/mesos/sandbox"
--strict="true" --switch_user="true" --systemd_enable_support="true" --systemd_runtime_directory="/run/systemd/system"
--version="false" --work_dir="/tmp/Endpoint_SlaveEndpointTest_NoAuthorizer_0_1rBSe6"
I0818 04:33:11.189152  6585 credentials.hpp:86] Loading credential for authentication from
'/tmp/Endpoint_SlaveEndpointTest_NoAuthorizer_0_sYJAFE/credential'
I0818 04:33:11.189357  6585 slave.cpp:283] Agent using credential for: test-principal
I0818 04:33:11.189378  6585 credentials.hpp:37] Loading credentials for authentication from
'/tmp/Endpoint_SlaveEndpointTest_NoAuthorizer_0_sYJAFE/http_credentials'
I0818 04:33:11.189687  6585 http.cpp:1026] Creating default 'basic' HTTP authenticator for
realm 'mesos-agent-readonly'
I0818 04:33:11.189887  6585 http.cpp:1026] Creating default 'basic' HTTP authenticator for
realm 'mesos-agent-readwrite'
I0818 04:33:11.191793  6585 slave.cpp:565] Agent resources: [{"name":"cpus","scalar":{"value":2.0},"type":"SCALAR"},{"name":"mem","scalar":{"value":1024.0},"type":"SCALAR"},{"name":"disk","scalar":{"value":1024.0},"type":"SCALAR"},{"name":"ports","ranges":{"range":[{"begin":31000,"end":32000}]},"type":"RANGES"}]
I0818 04:33:11.192119  6585 slave.cpp:573] Agent attributes: [  ]
I0818 04:33:11.192140  6585 slave.cpp:582] Agent hostname: 0658d93e44e2
I0818 04:33:11.192328  6606 status_update_manager.cpp:177] Pausing sending status updates
I0818 04:33:11.194244  6599 state.cpp:64] Recovering state from '/tmp/Endpoint_SlaveEndpointTest_NoAuthorizer_0_1rBSe6/meta'
I0818 04:33:11.194705  6589 status_update_manager.cpp:203] Recovering status update manager
I0818 04:33:11.194972  6597 containerizer.cpp:609] Recovering containerizer
I0818 04:33:11.197206  6605 provisioner.cpp:416] Provisioner recovery complete
I0818 04:33:11.197603  6603 slave.cpp:6210] Finished recovery
I0818 04:33:11.198329  6603 slave.cpp:6392] Querying resource estimator for oversubscribable
resources
I0818 04:33:11.198642  6596 slave.cpp:6406] Received oversubscribable resources {} from the
resource estimator
I0818 04:33:11.202404  6597 process.cpp:3933] Handling HTTP event for process 'slave(800)'
with path: '/slave(800)/monitor/statistics'
I0818 04:33:11.204129  6599 http.cpp:1166] HTTP GET for /slave(800)/monitor/statistics from
172.17.0.11:39614
I0818 04:33:11.204238  6599 http.cpp:957] Authorizing principal 'test-principal' to GET the
'/monitor/statistics' endpoint
I0818 04:33:11.208101  6584 slave.cpp:843] Agent terminating
[       OK ] Endpoint/SlaveEndpointTest.NoAuthorizer/0 (40 ms)
[ RUN      ] Endpoint/SlaveEndpointTest.NoAuthorizer/1
I0818 04:33:11.220368  6565 containerizer.cpp:246] Using isolation: posix/cpu,posix/mem,filesystem/posix,network/cni,environment_secret
W0818 04:33:11.220890  6565 backend.cpp:76] Failed to create 'aufs' backend: AufsBackend requires
root privileges
W0818 04:33:11.221002  6565 backend.cpp:76] Failed to create 'bind' backend: BindBackend requires
root privileges
I0818 04:33:11.221037  6565 provisioner.cpp:255] Using default backend 'copy'
I0818 04:33:11.222925  6565 cluster.cpp:448] Creating default 'local' authorizer
I0818 04:33:11.224798  6587 slave.cpp:250] Mesos agent started on (801)@172.17.0.11:34116
I0818 04:33:11.224827  6587 slave.cpp:251] Flags at startup: --acls="" --appc_simple_discovery_uri_prefix="http://"
--appc_store_dir="/tmp/Endpoint_SlaveEndpointTest_NoAuthorizer_1_qfYyIS/store/appc" --authenticate_http_readonly="true"
--authenticate_http_readwrite="true" --authenticatee="crammd5" --authentication_backoff_factor="1secs"
--authorizer="local" --cgroups_cpu_enable_pids_and_tids_count="false" --cgroups_enable_cfs="false"
--cgroups_hierarchy="/sys/fs/cgroup" --cgroups_limit_swap="false" --cgroups_root="mesos" --container_disk_watch_interval="15secs"
--containerizers="mesos" --credential="/tmp/Endpoint_SlaveEndpointTest_NoAuthorizer_1_qfYyIS/credential"
--default_role="*" --disallow_sharing_agent_pid_namespace="false" --disk_watch_interval="1mins"
--docker="docker" --docker_kill_orphans="true" --docker_registry="https://registry-1.docker.io"
--docker_remove_delay="6hrs" --docker_socket="/var/run/docker.sock" --docker_stop_timeout="0ns"
--docker_store_dir="/tmp/Endpoint_SlaveEndpointTest_NoAuthorizer_1_qfYyIS/store/docker" --docker_volume_checkpoint_dir="/var/run/mesos/isolators/docker/volume"
--enforce_container_disk_quota="false" --executor_registration_timeout="1mins" --executor_reregistration_timeout="2secs"
--executor_shutdown_grace_period="5secs" --fetcher_cache_dir="/tmp/Endpoint_SlaveEndpointTest_NoAuthorizer_1_qfYyIS/fetch"
--fetcher_cache_size="2GB" --frameworks_home="" --gc_delay="1weeks" --gc_disk_headroom="0.1"
--hadoop_home="" --help="false" --hostname_lookup="true" --http_command_executor="false" --http_credentials="/tmp/Endpoint_SlaveEndpointTest_NoAuthorizer_1_qfYyIS/http_credentials"
--http_heartbeat_interval="30secs" --initialize_driver_logging="true" --isolation="posix/cpu,posix/mem"
--launcher="posix" --launcher_dir="/mesos/mesos-1.5.0/_build/src" --logbufsecs="0" --logging_level="INFO"
--max_completed_executors_per_framework="150" --oversubscribed_resources_interval="15secs"
--perf_duration="10secs" --perf_interval="1mins" --port="5051" --qos_correction_interval_min="0ns"
--quiet="false" --recover="reconnect" --recovery_timeout="15mins" --registration_backoff_factor="10ms"
--resources="cpus:2;gpus:0;mem:1024;disk:1024;ports:[31000-32000]" --revocable_cpu_low_priority="true"
--runtime_dir="/tmp/Endpoint_SlaveEndpointTest_NoAuthorizer_1_qfYyIS" --sandbox_directory="/mnt/mesos/sandbox"
--strict="true" --switch_user="true" --systemd_enable_support="true" --systemd_runtime_directory="/run/systemd/system"
--version="false" --work_dir="/tmp/Endpoint_SlaveEndpointTest_NoAuthorizer_1_p7H1bk"
I0818 04:33:11.225262  6587 credentials.hpp:86] Loading credential for authentication from
'/tmp/Endpoint_SlaveEndpointTest_NoAuthorizer_1_qfYyIS/credential'
I0818 04:33:11.225450  6587 slave.cpp:283] Agent using credential for: test-principal
I0818 04:33:11.225476  6587 credentials.hpp:37] Loading credentials for authentication from
'/tmp/Endpoint_SlaveEndpointTest_NoAuthorizer_1_qfYyIS/http_credentials'
I0818 04:33:11.225728  6587 http.cpp:1026] Creating default 'basic' HTTP authenticator for
realm 'mesos-agent-readonly'
I0818 04:33:11.225913  6587 http.cpp:1026] Creating default 'basic' HTTP authenticator for
realm 'mesos-agent-readwrite'
I0818 04:33:11.227303  6587 slave.cpp:565] Agent resources: [{"name":"cpus","scalar":{"value":2.0},"type":"SCALAR"},{"name":"mem","scalar":{"value":1024.0},"type":"SCALAR"},{"name":"disk","scalar":{"value":1024.0},"type":"SCALAR"},{"name":"ports","ranges":{"range":[{"begin":31000,"end":32000}]},"type":"RANGES"}]
I0818 04:33:11.227540  6587 slave.cpp:573] Agent attributes: [  ]
I0818 04:33:11.227552  6587 slave.cpp:582] Agent hostname: 0658d93e44e2
I0818 04:33:11.227677  6584 status_update_manager.cpp:177] Pausing sending status updates
I0818 04:33:11.229229  6592 state.cpp:64] Recovering state from '/tmp/Endpoint_SlaveEndpointTest_NoAuthorizer_1_p7H1bk/meta'
I0818 04:33:11.229770  6593 status_update_manager.cpp:203] Recovering status update manager
I0818 04:33:11.230026  6605 containerizer.cpp:609] Recovering containerizer
I0818 04:33:11.231732  6607 provisioner.cpp:416] Provisioner recovery complete
I0818 04:33:11.232098  6604 slave.cpp:6210] Finished recovery
I0818 04:33:11.232579  6604 slave.cpp:6392] Querying resource estimator for oversubscribable
resources
I0818 04:33:11.232867  6595 slave.cpp:6406] Received oversubscribable resources {} from the
resource estimator
I0818 04:33:11.236136  6601 process.cpp:3933] Handling HTTP event for process 'slave(801)'
with path: '/slave(801)/monitor/statistics.json'
I0818 04:33:11.237524  6596 http.cpp:1166] HTTP GET for /slave(801)/monitor/statistics.json
from 172.17.0.11:39616
I0818 04:33:11.237602  6596 http.cpp:957] Authorizing principal 'test-principal' to GET the
'/monitor/statistics.json' endpoint
I0818 04:33:11.241902  6565 slave.cpp:843] Agent terminating
[       OK ] Endpoint/SlaveEndpointTest.NoAuthorizer/1 (33 ms)
[ RUN      ] Endpoint/SlaveEndpointTest.NoAuthorizer/2
I0818 04:33:11.256494  6565 containerizer.cpp:246] Using isolation: posix/cpu,posix/mem,filesystem/posix,network/cni,environment_secret
W0818 04:33:11.257256  6565 backend.cpp:76] Failed to create 'aufs' backend: AufsBackend requires
root privileges
W0818 04:33:11.257366  6565 backend.cpp:76] Failed to create 'bind' backend: BindBackend requires
root privileges
I0818 04:33:11.257400  6565 provisioner.cpp:255] Using default backend 'copy'
I0818 04:33:11.259798  6565 cluster.cpp:448] Creating default 'local' authorizer
I0818 04:33:11.262615  6592 slave.cpp:250] Mesos agent started on (802)@172.17.0.11:34116
I0818 04:33:11.262643  6592 slave.cpp:251] Flags at startup: --acls="" --appc_simple_discovery_uri_prefix="http://"
--appc_store_dir="/tmp/Endpoint_SlaveEndpointTest_NoAuthorizer_2_8fLM56/store/appc" --authenticate_http_readonly="true"
--authenticate_http_readwrite="true" --authenticatee="crammd5" --authentication_backoff_factor="1secs"
--authorizer="local" --cgroups_cpu_enable_pids_and_tids_count="false" --cgroups_enable_cfs="false"
--cgroups_hierarchy="/sys/fs/cgroup" --cgroups_limit_swap="false" --cgroups_root="mesos" --container_disk_watch_interval="15secs"
--containerizers="mesos" --credential="/tmp/Endpoint_SlaveEndpointTest_NoAuthorizer_2_8fLM56/credential"
--default_role="*" --disallow_sharing_agent_pid_namespace="false" --disk_watch_interval="1mins"
--docker="docker" --docker_kill_orphans="true" --docker_registry="https://registry-1.docker.io"
--docker_remove_delay="6hrs" --docker_socket="/var/run/docker.sock" --docker_stop_timeout="0ns"
--docker_store_dir="/tmp/Endpoint_SlaveEndpointTest_NoAuthorizer_2_8fLM56/store/docker" --docker_volume_checkpoint_dir="/var/run/mesos/isolators/docker/volume"
--enforce_container_disk_quota="false" --executor_registration_timeout="1mins" --executor_reregistration_timeout="2secs"
--executor_shutdown_grace_period="5secs" --fetcher_cache_dir="/tmp/Endpoint_SlaveEndpointTest_NoAuthorizer_2_8fLM56/fetch"
--fetcher_cache_size="2GB" --frameworks_home="" --gc_delay="1weeks" --gc_disk_headroom="0.1"
--hadoop_home="" --help="false" --hostname_lookup="true" --http_command_executor="false" --http_credentials="/tmp/Endpoint_SlaveEndpointTest_NoAuthorizer_2_8fLM56/http_credentials"
--http_heartbeat_interval="30secs" --initialize_driver_logging="true" --isolation="posix/cpu,posix/mem"
--launcher="posix" --launcher_dir="/mesos/mesos-1.5.0/_build/src" --logbufsecs="0" --logging_level="INFO"
--max_completed_executors_per_framework="150" --oversubscribed_resources_interval="15secs"
--perf_duration="10secs" --perf_interval="1mins" --port="5051" --qos_correction_interval_min="0ns"
--quiet="false" --recover="reconnect" --recovery_timeout="15mins" --registration_backoff_factor="10ms"
--resources="cpus:2;gpus:0;mem:1024;disk:1024;ports:[31000-32000]" --revocable_cpu_low_priority="true"
--runtime_dir="/tmp/Endpoint_SlaveEndpointTest_NoAuthorizer_2_8fLM56" --sandbox_directory="/mnt/mesos/sandbox"
--strict="true" --switch_user="true" --systemd_enable_support="true" --systemd_runtime_directory="/run/systemd/system"
--version="false" --work_dir="/tmp/Endpoint_SlaveEndpointTest_NoAuthorizer_2_NYF9ty"
I0818 04:33:11.263053  6592 credentials.hpp:86] Loading credential for authentication from
'/tmp/Endpoint_SlaveEndpointTest_NoAuthorizer_2_8fLM56/credential'
I0818 04:33:11.263211  6592 slave.cpp:283] Agent using credential for: test-principal
I0818 04:33:11.263236  6592 credentials.hpp:37] Loading credentials for authentication from
'/tmp/Endpoint_SlaveEndpointTest_NoAuthorizer_2_8fLM56/http_credentials'
I0818 04:33:11.263484  6592 http.cpp:1026] Creating default 'basic' HTTP authenticator for
realm 'mesos-agent-readonly'
I0818 04:33:11.263654  6592 http.cpp:1026] Creating default 'basic' HTTP authenticator for
realm 'mesos-agent-readwrite'
I0818 04:33:11.265038  6592 slave.cpp:565] Agent resources: [{"name":"cpus","scalar":{"value":2.0},"type":"SCALAR"},{"name":"mem","scalar":{"value":1024.0},"type":"SCALAR"},{"name":"disk","scalar":{"value":1024.0},"type":"SCALAR"},{"name":"ports","ranges":{"range":[{"begin":31000,"end":32000}]},"type":"RANGES"}]
I0818 04:33:11.265417  6592 slave.cpp:573] Agent attributes: [  ]
I0818 04:33:11.265440  6592 slave.cpp:582] Agent hostname: 0658d93e44e2
I0818 04:33:11.265616  6595 status_update_manager.cpp:177] Pausing sending status updates
I0818 04:33:11.267724  6600 state.cpp:64] Recovering state from '/tmp/Endpoint_SlaveEndpointTest_NoAuthorizer_2_NYF9ty/meta'
I0818 04:33:11.268080  6603 status_update_manager.cpp:203] Recovering status update manager
I0818 04:33:11.268326  6588 containerizer.cpp:609] Recovering containerizer
I0818 04:33:11.269742  6606 provisioner.cpp:416] Provisioner recovery complete
I0818 04:33:11.270205  6592 slave.cpp:6210] Finished recovery
I0818 04:33:11.270745  6592 slave.cpp:6392] Querying resource estimator for oversubscribable
resources
I0818 04:33:11.271004  6585 slave.cpp:6406] Received oversubscribable resources {} from the
resource estimator
I0818 04:33:11.273603  6604 process.cpp:3933] Handling HTTP event for process 'slave(802)'
with path: '/slave(802)/containers'
I0818 04:33:11.275365  6590 http.cpp:1166] HTTP GET for /slave(802)/containers from 172.17.0.11:39618
I0818 04:33:11.275460  6590 http.cpp:957] Authorizing principal 'test-principal' to GET the
'/containers' endpoint
I0818 04:33:11.279918  6565 slave.cpp:843] Agent terminating
[       OK ] Endpoint/SlaveEndpointTest.NoAuthorizer/2 (39 ms)
[----------] 9 tests from Endpoint/SlaveEndpointTest (331 ms total)

[----------] 2 tests from ContainerizerType/DefaultContainerDNSFlagTest
[ RUN      ] ContainerizerType/DefaultContainerDNSFlagTest.ValidateFlag/0
[       OK ] ContainerizerType/DefaultContainerDNSFlagTest.ValidateFlag/0 (12 ms)
[ RUN      ] ContainerizerType/DefaultContainerDNSFlagTest.ValidateFlag/1
[       OK ] ContainerizerType/DefaultContainerDNSFlagTest.ValidateFlag/1 (10 ms)
[----------] 2 tests from ContainerizerType/DefaultContainerDNSFlagTest (22 ms total)

[----------] Global test environment tear-down
[==========] 1652 tests from 182 test cases ran. (582363 ms total)
[  PASSED  ] 1651 tests.
[  FAILED  ] 1 test, listed below:
[  FAILED  ] DefaultExecutorCheckTest.CommandCheckDeliveredAndReconciled

 1 FAILED TEST
  YOU HAVE 20 DISABLED TESTS

I0818 04:33:11.373960  6608 process.cpp:1072] Failed to accept socket: future discarded
make[4]: *** [check-local] Error 1
make[4]: Leaving directory `/mesos/mesos-1.5.0/_build/src'
make[3]: *** [check-am] Error 2
make[3]: Leaving directory `/mesos/mesos-1.5.0/_build/src'
make[2]: *** [check] Error 2
make[2]: Leaving directory `/mesos/mesos-1.5.0/_build/src'
make[1]: *** [check-recursive] Error 1
make[1]: Leaving directory `/mesos/mesos-1.5.0/_build'
make: *** [distcheck] Error 1
+ docker rmi mesos-1503028131-31109
Untagged: mesos-1503028131-31109:latest
Deleted: sha256:d6b8eda6e57774ebdf2dd41c5c0f8b861e31479d135160839286f4077eda56f1
Deleted: sha256:47ac2df4ba383c265d47c0c3f7a4823470dcd6d3519b08289d6082b816386e4e
Deleted: sha256:23f1fa891bdaf3ec3539031940a2772c02ee078953cdc0c7f77941fc30bb1975
Deleted: sha256:7bde812e8b66b943a2ab92679fe23a1577e41d28fb858c62cc01f71e2dfe73c2
Deleted: sha256:2f32a625d85310ef262bfa5a7e6edee023e2d5fa20951328c305bdb36d613728
Deleted: sha256:ee6caa50acd7a45be858ce3182784f830d1ae5712108b44ac94fee08f093173d
Deleted: sha256:25084d12361668312bf17e8c9edde4efb7705f80928b34875694d1713e939ef3
Deleted: sha256:8a83ace82b8cddc29506d5efd882ef4ce4c0d77213f9827f5260e322c764afda
Deleted: sha256:cf6b8ccadab5c3afe0eb4f67e729044384ef242dc953d4b8ee2a438256d683ed
Deleted: sha256:523c10cff6cf562f0bebe47e4506f17e0f1a34ab67efaa9ce7f9844fadca4d41
Deleted: sha256:7e1bb947f2449d0bc40268c9de38957bcf59840d1931c71f187836f13c6c153c
Deleted: sha256:0de33d1a322b045c60716dbf88fc29d4b0c563d2f3cd521b96bd95ae7fd95025
Deleted: sha256:65b37c406be35eea2a5de55660cd9907ce55e80dd39dc9eba2a3ddf9211a3a7a
Deleted: sha256:e0333fe0c498d00b79dcbdc7aceb5ba3700e61a08345cd9a1ba2313c91dc6a62
Deleted: sha256:4add2fc17ab5944d55fe033be9c86c9634824e6a87657d5d11c22005329ebd86
Deleted: sha256:781157c3fb632c13765bf9bae17d3c8c5b83e4add8cbb34a72ac811d2e03a7be
Deleted: sha256:adb24db13eb37b844faeedd964ec411306714eae7dee08573b98b8d37dc901a0
Deleted: sha256:47378ad55e51f112eff71aacd4785b0a499c4ebf7f1c847d8a54e6f0aa7bb9f8
Deleted: sha256:ddae086161acd96d903fcbfdf77d84f9b3056aa25dcb1ec7703ffcc0c16d19e8
Deleted: sha256:dcd8c60d106f2edb635124a37bd5c8716af691eb0aadf71c50b03f57ee488ad5
Deleted: sha256:9e8dfe82af101e87905caf19598b4302594f441b9796a699479c7ddc2a545538
Deleted: sha256:abb06172c6d8c50073cdadd583a657eda3d5ece4e5d873d303e6b32159e8b5cf
Deleted: sha256:a3208b826cbbc3b9e2a358b1dd972e61fe0e9d673df61774a9d4ef46a170c493
Deleted: sha256:e9a37af7b7ae735b8d8275c1aec255da030a869e328692be2f40e7285141f27f
Deleted: sha256:041c2a8231d5835fc5030a2cd963f40f8c578073d1a79ddb4c6819aefc6e6b92
Build step 'Execute shell' marked build as failure

Mime
View raw message