mesos-builds mailing list archives

Site index · List index
Message view « Date » · « Thread »
Top « Date » · « Thread »
From Apache Jenkins Server <jenk...@builds.apache.org>
Subject Build failed in Jenkins: Mesos-Buildbot » autotools,gcc,--verbose --enable-libevent --enable-ssl,GLOG_v=1 MESOS_VERBOSE=1,centos:7,(ubuntu)&&(!ubuntu-us1)&&(!ubuntu-eu2) #4126
Date Fri, 18 Aug 2017 07:34:46 GMT
See <https://builds.apache.org/job/Mesos-Buildbot/BUILDTOOL=autotools,COMPILER=gcc,CONFIGURATION=--verbose%20--enable-libevent%20--enable-ssl,ENVIRONMENT=GLOG_v=1%20MESOS_VERBOSE=1,OS=centos%3A7,label_exp=(ubuntu)&&(!ubuntu-us1)&&(!ubuntu-eu2)/4126/display/redirect>

------------------------------------------
[...truncated 32.09 MB...]
I0818 07:34:32.510324 30346 credentials.hpp:86] Loading credential for authentication from
'/tmp/Endpoint_SlaveEndpointTest_UnauthorizedRequest_0_G8xdUA/credential'
I0818 07:34:32.510537 30346 slave.cpp:283] Agent using credential for: test-principal
I0818 07:34:32.510560 30346 credentials.hpp:37] Loading credentials for authentication from
'/tmp/Endpoint_SlaveEndpointTest_UnauthorizedRequest_0_G8xdUA/http_credentials'
I0818 07:34:32.510907 30346 http.cpp:1026] Creating default 'basic' HTTP authenticator for
realm 'mesos-agent-executor'
I0818 07:34:32.511065 30346 http.cpp:1047] Creating default 'jwt' HTTP authenticator for realm
'mesos-agent-executor'
I0818 07:34:32.511361 30346 http.cpp:1026] Creating default 'basic' HTTP authenticator for
realm 'mesos-agent-readonly'
I0818 07:34:32.511466 30346 http.cpp:1047] Creating default 'jwt' HTTP authenticator for realm
'mesos-agent-readonly'
I0818 07:34:32.511687 30346 http.cpp:1026] Creating default 'basic' HTTP authenticator for
realm 'mesos-agent-readwrite'
I0818 07:34:32.511814 30346 http.cpp:1047] Creating default 'jwt' HTTP authenticator for realm
'mesos-agent-readwrite'
I0818 07:34:32.513360 30346 slave.cpp:565] Agent resources: [{"name":"cpus","scalar":{"value":2.0},"type":"SCALAR"},{"name":"mem","scalar":{"value":1024.0},"type":"SCALAR"},{"name":"disk","scalar":{"value":1024.0},"type":"SCALAR"},{"name":"ports","ranges":{"range":[{"begin":31000,"end":32000}]},"type":"RANGES"}]
I0818 07:34:32.513607 30346 slave.cpp:573] Agent attributes: [  ]
I0818 07:34:32.513623 30346 slave.cpp:582] Agent hostname: 8e7fbb402c91
I0818 07:34:32.513777 30349 status_update_manager.cpp:177] Pausing sending status updates
I0818 07:34:32.515539 30339 state.cpp:64] Recovering state from '/tmp/Endpoint_SlaveEndpointTest_UnauthorizedRequest_0_6COGcL/meta'
I0818 07:34:32.515890 30348 status_update_manager.cpp:203] Recovering status update manager
I0818 07:34:32.516096 30338 containerizer.cpp:609] Recovering containerizer
I0818 07:34:32.517537 30336 provisioner.cpp:416] Provisioner recovery complete
I0818 07:34:32.517899 30341 slave.cpp:6210] Finished recovery
I0818 07:34:32.518476 30341 slave.cpp:6392] Querying resource estimator for oversubscribable
resources
I0818 07:34:32.518796 30350 slave.cpp:6406] Received oversubscribable resources {} from the
resource estimator
I0818 07:34:32.521471 30334 process.cpp:3933] Handling HTTP event for process 'slave(803)'
with path: '/slave(803)/monitor/statistics'
I0818 07:34:32.523378 30347 http.cpp:1166] HTTP GET for /slave(803)/monitor/statistics from
172.17.0.3:58706
I0818 07:34:32.523460 30347 http.cpp:957] Authorizing principal 'test-principal' to GET the
'/monitor/statistics' endpoint
I0818 07:34:32.525257 30339 slave.cpp:843] Agent terminating
[       OK ] Endpoint/SlaveEndpointTest.UnauthorizedRequest/0 (31 ms)
[ RUN      ] Endpoint/SlaveEndpointTest.UnauthorizedRequest/1
I0818 07:34:32.537160  9446 containerizer.cpp:246] Using isolation: posix/cpu,posix/mem,filesystem/posix,network/cni,environment_secret
W0818 07:34:32.537725  9446 backend.cpp:76] Failed to create 'aufs' backend: AufsBackend requires
root privileges
W0818 07:34:32.537859  9446 backend.cpp:76] Failed to create 'bind' backend: BindBackend requires
root privileges
I0818 07:34:32.537904  9446 provisioner.cpp:255] Using default backend 'copy'
I0818 07:34:32.541749 30342 slave.cpp:250] Mesos agent started on (804)@172.17.0.3:38635
I0818 07:34:32.541776 30342 slave.cpp:251] Flags at startup: --acls="" --appc_simple_discovery_uri_prefix="http://"
--appc_store_dir="/tmp/Endpoint_SlaveEndpointTest_UnauthorizedRequest_1_4k4pYV/store/appc"
--authenticate_http_executors="true" --authenticate_http_readonly="true" --authenticate_http_readwrite="true"
--authenticatee="crammd5" --authentication_backoff_factor="1secs" --authorizer="local" --cgroups_cpu_enable_pids_and_tids_count="false"
--cgroups_enable_cfs="false" --cgroups_hierarchy="/sys/fs/cgroup" --cgroups_limit_swap="false"
--cgroups_root="mesos" --container_disk_watch_interval="15secs" --containerizers="mesos" --credential="/tmp/Endpoint_SlaveEndpointTest_UnauthorizedRequest_1_4k4pYV/credential"
--default_role="*" --disallow_sharing_agent_pid_namespace="false" --disk_watch_interval="1mins"
--docker="docker" --docker_kill_orphans="true" --docker_registry="https://registry-1.docker.io"
--docker_remove_delay="6hrs" --docker_socket="/var/run/docker.sock" --docker_stop_timeout="0ns"
--docker_store_dir="/tmp/Endpoint_SlaveEndpointTest_UnauthorizedRequest_1_4k4pYV/store/docker"
--docker_volume_checkpoint_dir="/var/run/mesos/isolators/docker/volume" --enforce_container_disk_quota="false"
--executor_registration_timeout="1mins" --executor_reregistration_timeout="2secs" --executor_secret_key="/tmp/Endpoint_SlaveEndpointTest_UnauthorizedRequest_1_4k4pYV/executor_secret_key"
--executor_shutdown_grace_period="5secs" --fetcher_cache_dir="/tmp/Endpoint_SlaveEndpointTest_UnauthorizedRequest_1_4k4pYV/fetch"
--fetcher_cache_size="2GB" --frameworks_home="" --gc_delay="1weeks" --gc_disk_headroom="0.1"
--hadoop_home="" --help="false" --hostname_lookup="true" --http_command_executor="false" --http_credentials="/tmp/Endpoint_SlaveEndpointTest_UnauthorizedRequest_1_4k4pYV/http_credentials"
--http_heartbeat_interval="30secs" --initialize_driver_logging="true" --isolation="posix/cpu,posix/mem"
--launcher="posix" --launcher_dir="/mesos/mesos-1.4.0/_build/src" --logbufsecs="0" --logging_level="INFO"
--max_completed_executors_per_framework="150" --oversubscribed_resources_interval="15secs"
--perf_duration="10secs" --perf_interval="1mins" --port="5051" --qos_correction_interval_min="0ns"
--quiet="false" --recover="reconnect" --recovery_timeout="15mins" --registration_backoff_factor="10ms"
--resources="cpus:2;gpus:0;mem:1024;disk:1024;ports:[31000-32000]" --revocable_cpu_low_priority="true"
--runtime_dir="/tmp/Endpoint_SlaveEndpointTest_UnauthorizedRequest_1_4k4pYV" --sandbox_directory="/mnt/mesos/sandbox"
--strict="true" --switch_user="true" --systemd_enable_support="true" --systemd_runtime_directory="/run/systemd/system"
--version="false" --work_dir="/tmp/Endpoint_SlaveEndpointTest_UnauthorizedRequest_1_2OUbc6"
I0818 07:34:32.542358 30342 credentials.hpp:86] Loading credential for authentication from
'/tmp/Endpoint_SlaveEndpointTest_UnauthorizedRequest_1_4k4pYV/credential'
I0818 07:34:32.542588 30342 slave.cpp:283] Agent using credential for: test-principal
I0818 07:34:32.542623 30342 credentials.hpp:37] Loading credentials for authentication from
'/tmp/Endpoint_SlaveEndpointTest_UnauthorizedRequest_1_4k4pYV/http_credentials'
I0818 07:34:32.543035 30342 http.cpp:1026] Creating default 'basic' HTTP authenticator for
realm 'mesos-agent-executor'
I0818 07:34:32.543217 30342 http.cpp:1047] Creating default 'jwt' HTTP authenticator for realm
'mesos-agent-executor'
I0818 07:34:32.543511 30342 http.cpp:1026] Creating default 'basic' HTTP authenticator for
realm 'mesos-agent-readonly'
I0818 07:34:32.543627 30342 http.cpp:1047] Creating default 'jwt' HTTP authenticator for realm
'mesos-agent-readonly'
I0818 07:34:32.543853 30342 http.cpp:1026] Creating default 'basic' HTTP authenticator for
realm 'mesos-agent-readwrite'
I0818 07:34:32.543970 30342 http.cpp:1047] Creating default 'jwt' HTTP authenticator for realm
'mesos-agent-readwrite'
I0818 07:34:32.545894 30342 slave.cpp:565] Agent resources: [{"name":"cpus","scalar":{"value":2.0},"type":"SCALAR"},{"name":"mem","scalar":{"value":1024.0},"type":"SCALAR"},{"name":"disk","scalar":{"value":1024.0},"type":"SCALAR"},{"name":"ports","ranges":{"range":[{"begin":31000,"end":32000}]},"type":"RANGES"}]
I0818 07:34:32.546231 30342 slave.cpp:573] Agent attributes: [  ]
I0818 07:34:32.546252 30342 slave.cpp:582] Agent hostname: 8e7fbb402c91
I0818 07:34:32.546393 30345 status_update_manager.cpp:177] Pausing sending status updates
I0818 07:34:32.548416 30337 state.cpp:64] Recovering state from '/tmp/Endpoint_SlaveEndpointTest_UnauthorizedRequest_1_2OUbc6/meta'
I0818 07:34:32.548753 30341 status_update_manager.cpp:203] Recovering status update manager
I0818 07:34:32.548977 30344 containerizer.cpp:609] Recovering containerizer
I0818 07:34:32.550429 30347 provisioner.cpp:416] Provisioner recovery complete
I0818 07:34:32.550812 30335 slave.cpp:6210] Finished recovery
I0818 07:34:32.551473 30335 slave.cpp:6392] Querying resource estimator for oversubscribable
resources
I0818 07:34:32.551769 30350 slave.cpp:6406] Received oversubscribable resources {} from the
resource estimator
I0818 07:34:32.554355 30330 process.cpp:3933] Handling HTTP event for process 'slave(804)'
with path: '/slave(804)/monitor/statistics.json'
I0818 07:34:32.556311 30339 http.cpp:1166] HTTP GET for /slave(804)/monitor/statistics.json
from 172.17.0.3:58714
I0818 07:34:32.556396 30339 http.cpp:957] Authorizing principal 'test-principal' to GET the
'/monitor/statistics.json' endpoint
I0818 07:34:32.558161 30342 slave.cpp:843] Agent terminating
[       OK ] Endpoint/SlaveEndpointTest.UnauthorizedRequest/1 (32 ms)
[ RUN      ] Endpoint/SlaveEndpointTest.UnauthorizedRequest/2
I0818 07:34:32.570053  9446 containerizer.cpp:246] Using isolation: posix/cpu,posix/mem,filesystem/posix,network/cni,environment_secret
W0818 07:34:32.570614  9446 backend.cpp:76] Failed to create 'aufs' backend: AufsBackend requires
root privileges
W0818 07:34:32.570734  9446 backend.cpp:76] Failed to create 'bind' backend: BindBackend requires
root privileges
I0818 07:34:32.570782  9446 provisioner.cpp:255] Using default backend 'copy'
I0818 07:34:32.574589 30336 slave.cpp:250] Mesos agent started on (805)@172.17.0.3:38635
I0818 07:34:32.574614 30336 slave.cpp:251] Flags at startup: --acls="" --appc_simple_discovery_uri_prefix="http://"
--appc_store_dir="/tmp/Endpoint_SlaveEndpointTest_UnauthorizedRequest_2_ghEhmh/store/appc"
--authenticate_http_executors="true" --authenticate_http_readonly="true" --authenticate_http_readwrite="true"
--authenticatee="crammd5" --authentication_backoff_factor="1secs" --authorizer="local" --cgroups_cpu_enable_pids_and_tids_count="false"
--cgroups_enable_cfs="false" --cgroups_hierarchy="/sys/fs/cgroup" --cgroups_limit_swap="false"
--cgroups_root="mesos" --container_disk_watch_interval="15secs" --containerizers="mesos" --credential="/tmp/Endpoint_SlaveEndpointTest_UnauthorizedRequest_2_ghEhmh/credential"
--default_role="*" --disallow_sharing_agent_pid_namespace="false" --disk_watch_interval="1mins"
--docker="docker" --docker_kill_orphans="true" --docker_registry="https://registry-1.docker.io"
--docker_remove_delay="6hrs" --docker_socket="/var/run/docker.sock" --docker_stop_timeout="0ns"
--docker_store_dir="/tmp/Endpoint_SlaveEndpointTest_UnauthorizedRequest_2_ghEhmh/store/docker"
--docker_volume_checkpoint_dir="/var/run/mesos/isolators/docker/volume" --enforce_container_disk_quota="false"
--executor_registration_timeout="1mins" --executor_reregistration_timeout="2secs" --executor_secret_key="/tmp/Endpoint_SlaveEndpointTest_UnauthorizedRequest_2_ghEhmh/executor_secret_key"
--executor_shutdown_grace_period="5secs" --fetcher_cache_dir="/tmp/Endpoint_SlaveEndpointTest_UnauthorizedRequest_2_ghEhmh/fetch"
--fetcher_cache_size="2GB" --frameworks_home="" --gc_delay="1weeks" --gc_disk_headroom="0.1"
--hadoop_home="" --help="false" --hostname_lookup="true" --http_command_executor="false" --http_credentials="/tmp/Endpoint_SlaveEndpointTest_UnauthorizedRequest_2_ghEhmh/http_credentials"
--http_heartbeat_interval="30secs" --initialize_driver_logging="true" --isolation="posix/cpu,posix/mem"
--launcher="posix" --launcher_dir="/mesos/mesos-1.4.0/_build/src" --logbufsecs="0" --logging_level="INFO"
--max_completed_executors_per_framework="150" --oversubscribed_resources_interval="15secs"
--perf_duration="10secs" --perf_interval="1mins" --port="5051" --qos_correction_interval_min="0ns"
--quiet="false" --recover="reconnect" --recovery_timeout="15mins" --registration_backoff_factor="10ms"
--resources="cpus:2;gpus:0;mem:1024;disk:1024;ports:[31000-32000]" --revocable_cpu_low_priority="true"
--runtime_dir="/tmp/Endpoint_SlaveEndpointTest_UnauthorizedRequest_2_ghEhmh" --sandbox_directory="/mnt/mesos/sandbox"
--strict="true" --switch_user="true" --systemd_enable_support="true" --systemd_runtime_directory="/run/systemd/system"
--version="false" --work_dir="/tmp/Endpoint_SlaveEndpointTest_UnauthorizedRequest_2_Ymp8ur"
I0818 07:34:32.575052 30336 credentials.hpp:86] Loading credential for authentication from
'/tmp/Endpoint_SlaveEndpointTest_UnauthorizedRequest_2_ghEhmh/credential'
I0818 07:34:32.575271 30336 slave.cpp:283] Agent using credential for: test-principal
I0818 07:34:32.575295 30336 credentials.hpp:37] Loading credentials for authentication from
'/tmp/Endpoint_SlaveEndpointTest_UnauthorizedRequest_2_ghEhmh/http_credentials'
I0818 07:34:32.575629 30336 http.cpp:1026] Creating default 'basic' HTTP authenticator for
realm 'mesos-agent-executor'
I0818 07:34:32.575770 30336 http.cpp:1047] Creating default 'jwt' HTTP authenticator for realm
'mesos-agent-executor'
I0818 07:34:32.576020 30336 http.cpp:1026] Creating default 'basic' HTTP authenticator for
realm 'mesos-agent-readonly'
I0818 07:34:32.576120 30336 http.cpp:1047] Creating default 'jwt' HTTP authenticator for realm
'mesos-agent-readonly'
I0818 07:34:32.576316 30336 http.cpp:1026] Creating default 'basic' HTTP authenticator for
realm 'mesos-agent-readwrite'
I0818 07:34:32.576445 30336 http.cpp:1047] Creating default 'jwt' HTTP authenticator for realm
'mesos-agent-readwrite'
I0818 07:34:32.577987 30336 slave.cpp:565] Agent resources: [{"name":"cpus","scalar":{"value":2.0},"type":"SCALAR"},{"name":"mem","scalar":{"value":1024.0},"type":"SCALAR"},{"name":"disk","scalar":{"value":1024.0},"type":"SCALAR"},{"name":"ports","ranges":{"range":[{"begin":31000,"end":32000}]},"type":"RANGES"}]
I0818 07:34:32.578235 30336 slave.cpp:573] Agent attributes: [  ]
I0818 07:34:32.578251 30336 slave.cpp:582] Agent hostname: 8e7fbb402c91
I0818 07:34:32.578430 30330 status_update_manager.cpp:177] Pausing sending status updates
I0818 07:34:32.580198 30348 state.cpp:64] Recovering state from '/tmp/Endpoint_SlaveEndpointTest_UnauthorizedRequest_2_Ymp8ur/meta'
I0818 07:34:32.580552 30348 status_update_manager.cpp:203] Recovering status update manager
I0818 07:34:32.580768 30332 containerizer.cpp:609] Recovering containerizer
I0818 07:34:32.582233 30347 provisioner.cpp:416] Provisioner recovery complete
I0818 07:34:32.582621 30336 slave.cpp:6210] Finished recovery
I0818 07:34:32.583148 30336 slave.cpp:6392] Querying resource estimator for oversubscribable
resources
I0818 07:34:32.583451 30335 slave.cpp:6406] Received oversubscribable resources {} from the
resource estimator
I0818 07:34:32.586058 30346 process.cpp:3933] Handling HTTP event for process 'slave(805)'
with path: '/slave(805)/containers'
I0818 07:34:32.587961 30348 http.cpp:1166] HTTP GET for /slave(805)/containers from 172.17.0.3:58716
I0818 07:34:32.588045 30348 http.cpp:957] Authorizing principal 'test-principal' to GET the
'/containers' endpoint
I0818 07:34:32.590351 30342 slave.cpp:843] Agent terminating
[       OK ] Endpoint/SlaveEndpointTest.UnauthorizedRequest/2 (32 ms)
[ RUN      ] Endpoint/SlaveEndpointTest.NoAuthorizer/0
I0818 07:34:32.602358  9446 containerizer.cpp:246] Using isolation: posix/cpu,posix/mem,filesystem/posix,network/cni,environment_secret
W0818 07:34:32.602911  9446 backend.cpp:76] Failed to create 'aufs' backend: AufsBackend requires
root privileges
W0818 07:34:32.603030  9446 backend.cpp:76] Failed to create 'bind' backend: BindBackend requires
root privileges
I0818 07:34:32.603078  9446 provisioner.cpp:255] Using default backend 'copy'
I0818 07:34:32.605006  9446 cluster.cpp:448] Creating default 'local' authorizer
I0818 07:34:32.607013 30334 slave.cpp:250] Mesos agent started on (806)@172.17.0.3:38635
I0818 07:34:32.607035 30334 slave.cpp:251] Flags at startup: --acls="" --appc_simple_discovery_uri_prefix="http://"
--appc_store_dir="/tmp/Endpoint_SlaveEndpointTest_NoAuthorizer_0_c1fa3C/store/appc" --authenticate_http_executors="true"
--authenticate_http_readonly="true" --authenticate_http_readwrite="true" --authenticatee="crammd5"
--authentication_backoff_factor="1secs" --authorizer="local" --cgroups_cpu_enable_pids_and_tids_count="false"
--cgroups_enable_cfs="false" --cgroups_hierarchy="/sys/fs/cgroup" --cgroups_limit_swap="false"
--cgroups_root="mesos" --container_disk_watch_interval="15secs" --containerizers="mesos" --credential="/tmp/Endpoint_SlaveEndpointTest_NoAuthorizer_0_c1fa3C/credential"
--default_role="*" --disallow_sharing_agent_pid_namespace="false" --disk_watch_interval="1mins"
--docker="docker" --docker_kill_orphans="true" --docker_registry="https://registry-1.docker.io"
--docker_remove_delay="6hrs" --docker_socket="/var/run/docker.sock" --docker_stop_timeout="0ns"
--docker_store_dir="/tmp/Endpoint_SlaveEndpointTest_NoAuthorizer_0_c1fa3C/store/docker" --docker_volume_checkpoint_dir="/var/run/mesos/isolators/docker/volume"
--enforce_container_disk_quota="false" --executor_registration_timeout="1mins" --executor_reregistration_timeout="2secs"
--executor_secret_key="/tmp/Endpoint_SlaveEndpointTest_NoAuthorizer_0_c1fa3C/executor_secret_key"
--executor_shutdown_grace_period="5secs" --fetcher_cache_dir="/tmp/Endpoint_SlaveEndpointTest_NoAuthorizer_0_c1fa3C/fetch"
--fetcher_cache_size="2GB" --frameworks_home="" --gc_delay="1weeks" --gc_disk_headroom="0.1"
--hadoop_home="" --help="false" --hostname_lookup="true" --http_command_executor="false" --http_credentials="/tmp/Endpoint_SlaveEndpointTest_NoAuthorizer_0_c1fa3C/http_credentials"
--http_heartbeat_interval="30secs" --initialize_driver_logging="true" --isolation="posix/cpu,posix/mem"
--launcher="posix" --launcher_dir="/mesos/mesos-1.4.0/_build/src" --logbufsecs="0" --logging_level="INFO"
--max_completed_executors_per_framework="150" --oversubscribed_resources_interval="15secs"
--perf_duration="10secs" --perf_interval="1mins" --port="5051" --qos_correction_interval_min="0ns"
--quiet="false" --recover="reconnect" --recovery_timeout="15mins" --registration_backoff_factor="10ms"
--resources="cpus:2;gpus:0;mem:1024;disk:1024;ports:[31000-32000]" --revocable_cpu_low_priority="true"
--runtime_dir="/tmp/Endpoint_SlaveEndpointTest_NoAuthorizer_0_c1fa3C" --sandbox_directory="/mnt/mesos/sandbox"
--strict="true" --switch_user="true" --systemd_enable_support="true" --systemd_runtime_directory="/run/systemd/system"
--version="false" --work_dir="/tmp/Endpoint_SlaveEndpointTest_NoAuthorizer_0_GZ4f7M"
I0818 07:34:32.607472 30334 credentials.hpp:86] Loading credential for authentication from
'/tmp/Endpoint_SlaveEndpointTest_NoAuthorizer_0_c1fa3C/credential'
I0818 07:34:32.607663 30334 slave.cpp:283] Agent using credential for: test-principal
I0818 07:34:32.607686 30334 credentials.hpp:37] Loading credentials for authentication from
'/tmp/Endpoint_SlaveEndpointTest_NoAuthorizer_0_c1fa3C/http_credentials'
I0818 07:34:32.607998 30334 http.cpp:1026] Creating default 'basic' HTTP authenticator for
realm 'mesos-agent-executor'
I0818 07:34:32.608139 30334 http.cpp:1047] Creating default 'jwt' HTTP authenticator for realm
'mesos-agent-executor'
I0818 07:34:32.608359 30334 http.cpp:1026] Creating default 'basic' HTTP authenticator for
realm 'mesos-agent-readonly'
I0818 07:34:32.608458 30334 http.cpp:1047] Creating default 'jwt' HTTP authenticator for realm
'mesos-agent-readonly'
I0818 07:34:32.608640 30334 http.cpp:1026] Creating default 'basic' HTTP authenticator for
realm 'mesos-agent-readwrite'
I0818 07:34:32.608745 30334 http.cpp:1047] Creating default 'jwt' HTTP authenticator for realm
'mesos-agent-readwrite'
I0818 07:34:32.610247 30334 slave.cpp:565] Agent resources: [{"name":"cpus","scalar":{"value":2.0},"type":"SCALAR"},{"name":"mem","scalar":{"value":1024.0},"type":"SCALAR"},{"name":"disk","scalar":{"value":1024.0},"type":"SCALAR"},{"name":"ports","ranges":{"range":[{"begin":31000,"end":32000}]},"type":"RANGES"}]
I0818 07:34:32.610493 30334 slave.cpp:573] Agent attributes: [  ]
I0818 07:34:32.610509 30334 slave.cpp:582] Agent hostname: 8e7fbb402c91
I0818 07:34:32.610649 30341 status_update_manager.cpp:177] Pausing sending status updates
I0818 07:34:32.612354 30339 state.cpp:64] Recovering state from '/tmp/Endpoint_SlaveEndpointTest_NoAuthorizer_0_GZ4f7M/meta'
I0818 07:34:32.612701 30336 status_update_manager.cpp:203] Recovering status update manager
I0818 07:34:32.612924 30353 containerizer.cpp:609] Recovering containerizer
I0818 07:34:32.614403 30340 provisioner.cpp:416] Provisioner recovery complete
I0818 07:34:32.614748 30334 slave.cpp:6210] Finished recovery
I0818 07:34:32.615298 30334 slave.cpp:6392] Querying resource estimator for oversubscribable
resources
I0818 07:34:32.615600 30331 slave.cpp:6406] Received oversubscribable resources {} from the
resource estimator
I0818 07:34:32.618336 30346 process.cpp:3933] Handling HTTP event for process 'slave(806)'
with path: '/slave(806)/monitor/statistics'
I0818 07:34:32.620280 30336 http.cpp:1166] HTTP GET for /slave(806)/monitor/statistics from
172.17.0.3:58720
I0818 07:34:32.620357 30336 http.cpp:957] Authorizing principal 'test-principal' to GET the
'/monitor/statistics' endpoint
I0818 07:34:32.623116 30353 slave.cpp:843] Agent terminating
[       OK ] Endpoint/SlaveEndpointTest.NoAuthorizer/0 (33 ms)
[ RUN      ] Endpoint/SlaveEndpointTest.NoAuthorizer/1
I0818 07:34:32.635560  9446 containerizer.cpp:246] Using isolation: posix/cpu,posix/mem,filesystem/posix,network/cni,environment_secret
W0818 07:34:32.636123  9446 backend.cpp:76] Failed to create 'aufs' backend: AufsBackend requires
root privileges
W0818 07:34:32.636248  9446 backend.cpp:76] Failed to create 'bind' backend: BindBackend requires
root privileges
I0818 07:34:32.636294  9446 provisioner.cpp:255] Using default backend 'copy'
I0818 07:34:32.638319  9446 cluster.cpp:448] Creating default 'local' authorizer
I0818 07:34:32.640339 30335 slave.cpp:250] Mesos agent started on (807)@172.17.0.3:38635
I0818 07:34:32.640372 30335 slave.cpp:251] Flags at startup: --acls="" --appc_simple_discovery_uri_prefix="http://"
--appc_store_dir="/tmp/Endpoint_SlaveEndpointTest_NoAuthorizer_1_o8tF3Y/store/appc" --authenticate_http_executors="true"
--authenticate_http_readonly="true" --authenticate_http_readwrite="true" --authenticatee="crammd5"
--authentication_backoff_factor="1secs" --authorizer="local" --cgroups_cpu_enable_pids_and_tids_count="false"
--cgroups_enable_cfs="false" --cgroups_hierarchy="/sys/fs/cgroup" --cgroups_limit_swap="false"
--cgroups_root="mesos" --container_disk_watch_interval="15secs" --containerizers="mesos" --credential="/tmp/Endpoint_SlaveEndpointTest_NoAuthorizer_1_o8tF3Y/credential"
--default_role="*" --disallow_sharing_agent_pid_namespace="false" --disk_watch_interval="1mins"
--docker="docker" --docker_kill_orphans="true" --docker_registry="https://registry-1.docker.io"
--docker_remove_delay="6hrs" --docker_socket="/var/run/docker.sock" --docker_stop_timeout="0ns"
--docker_store_dir="/tmp/Endpoint_SlaveEndpointTest_NoAuthorizer_1_o8tF3Y/store/docker" --docker_volume_checkpoint_dir="/var/run/mesos/isolators/docker/volume"
--enforce_container_disk_quota="false" --executor_registration_timeout="1mins" --executor_reregistration_timeout="2secs"
--executor_secret_key="/tmp/Endpoint_SlaveEndpointTest_NoAuthorizer_1_o8tF3Y/executor_secret_key"
--executor_shutdown_grace_period="5secs" --fetcher_cache_dir="/tmp/Endpoint_SlaveEndpointTest_NoAuthorizer_1_o8tF3Y/fetch"
--fetcher_cache_size="2GB" --frameworks_home="" --gc_delay="1weeks" --gc_disk_headroom="0.1"
--hadoop_home="" --help="false" --hostname_lookup="true" --http_command_executor="false" --http_credentials="/tmp/Endpoint_SlaveEndpointTest_NoAuthorizer_1_o8tF3Y/http_credentials"
--http_heartbeat_interval="30secs" --initialize_driver_logging="true" --isolation="posix/cpu,posix/mem"
--launcher="posix" --launcher_dir="/mesos/mesos-1.4.0/_build/src" --logbufsecs="0" --logging_level="INFO"
--max_completed_executors_per_framework="150" --oversubscribed_resources_interval="15secs"
--perf_duration="10secs" --perf_interval="1mins" --port="5051" --qos_correction_interval_min="0ns"
--quiet="false" --recover="reconnect" --recovery_timeout="15mins" --registration_backoff_factor="10ms"
--resources="cpus:2;gpus:0;mem:1024;disk:1024;ports:[31000-32000]" --revocable_cpu_low_priority="true"
--runtime_dir="/tmp/Endpoint_SlaveEndpointTest_NoAuthorizer_1_o8tF3Y" --sandbox_directory="/mnt/mesos/sandbox"
--strict="true" --switch_user="true" --systemd_enable_support="true" --systemd_runtime_directory="/run/systemd/system"
--version="false" --work_dir="/tmp/Endpoint_SlaveEndpointTest_NoAuthorizer_1_WMkO28"
I0818 07:34:32.641075 30335 credentials.hpp:86] Loading credential for authentication from
'/tmp/Endpoint_SlaveEndpointTest_NoAuthorizer_1_o8tF3Y/credential'
I0818 07:34:32.641367 30335 slave.cpp:283] Agent using credential for: test-principal
I0818 07:34:32.641397 30335 credentials.hpp:37] Loading credentials for authentication from
'/tmp/Endpoint_SlaveEndpointTest_NoAuthorizer_1_o8tF3Y/http_credentials'
I0818 07:34:32.641775 30335 http.cpp:1026] Creating default 'basic' HTTP authenticator for
realm 'mesos-agent-executor'
I0818 07:34:32.641932 30335 http.cpp:1047] Creating default 'jwt' HTTP authenticator for realm
'mesos-agent-executor'
I0818 07:34:32.642186 30335 http.cpp:1026] Creating default 'basic' HTTP authenticator for
realm 'mesos-agent-readonly'
I0818 07:34:32.642310 30335 http.cpp:1047] Creating default 'jwt' HTTP authenticator for realm
'mesos-agent-readonly'
I0818 07:34:32.642510 30335 http.cpp:1026] Creating default 'basic' HTTP authenticator for
realm 'mesos-agent-readwrite'
I0818 07:34:32.642612 30335 http.cpp:1047] Creating default 'jwt' HTTP authenticator for realm
'mesos-agent-readwrite'
I0818 07:34:32.644227 30335 slave.cpp:565] Agent resources: [{"name":"cpus","scalar":{"value":2.0},"type":"SCALAR"},{"name":"mem","scalar":{"value":1024.0},"type":"SCALAR"},{"name":"disk","scalar":{"value":1024.0},"type":"SCALAR"},{"name":"ports","ranges":{"range":[{"begin":31000,"end":32000}]},"type":"RANGES"}]
I0818 07:34:32.644493 30335 slave.cpp:573] Agent attributes: [  ]
I0818 07:34:32.644510 30335 slave.cpp:582] Agent hostname: 8e7fbb402c91
I0818 07:34:32.644665 30344 status_update_manager.cpp:177] Pausing sending status updates
I0818 07:34:32.646405 30339 state.cpp:64] Recovering state from '/tmp/Endpoint_SlaveEndpointTest_NoAuthorizer_1_WMkO28/meta'
I0818 07:34:32.646735 30353 status_update_manager.cpp:203] Recovering status update manager
I0818 07:34:32.646960 30330 containerizer.cpp:609] Recovering containerizer
I0818 07:34:32.648488 30352 provisioner.cpp:416] Provisioner recovery complete
I0818 07:34:32.648864 30335 slave.cpp:6210] Finished recovery
I0818 07:34:32.649466 30335 slave.cpp:6392] Querying resource estimator for oversubscribable
resources
I0818 07:34:32.649756 30341 slave.cpp:6406] Received oversubscribable resources {} from the
resource estimator
I0818 07:34:32.652570 30332 process.cpp:3933] Handling HTTP event for process 'slave(807)'
with path: '/slave(807)/monitor/statistics.json'
I0818 07:34:32.654479 30347 http.cpp:1166] HTTP GET for /slave(807)/monitor/statistics.json
from 172.17.0.3:58728
I0818 07:34:32.654562 30347 http.cpp:957] Authorizing principal 'test-principal' to GET the
'/monitor/statistics.json' endpoint
I0818 07:34:32.657706 30345 slave.cpp:843] Agent terminating
[       OK ] Endpoint/SlaveEndpointTest.NoAuthorizer/1 (35 ms)
[ RUN      ] Endpoint/SlaveEndpointTest.NoAuthorizer/2
I0818 07:34:32.670595  9446 containerizer.cpp:246] Using isolation: posix/cpu,posix/mem,filesystem/posix,network/cni,environment_secret
W0818 07:34:32.671236  9446 backend.cpp:76] Failed to create 'aufs' backend: AufsBackend requires
root privileges
W0818 07:34:32.671382  9446 backend.cpp:76] Failed to create 'bind' backend: BindBackend requires
root privileges
I0818 07:34:32.671428  9446 provisioner.cpp:255] Using default backend 'copy'
I0818 07:34:32.674389  9446 cluster.cpp:448] Creating default 'local' authorizer
I0818 07:34:32.677309 30330 slave.cpp:250] Mesos agent started on (808)@172.17.0.3:38635
I0818 07:34:32.677336 30330 slave.cpp:251] Flags at startup: --acls="" --appc_simple_discovery_uri_prefix="http://"
--appc_store_dir="/tmp/Endpoint_SlaveEndpointTest_NoAuthorizer_2_iMjSol/store/appc" --authenticate_http_executors="true"
--authenticate_http_readonly="true" --authenticate_http_readwrite="true" --authenticatee="crammd5"
--authentication_backoff_factor="1secs" --authorizer="local" --cgroups_cpu_enable_pids_and_tids_count="false"
--cgroups_enable_cfs="false" --cgroups_hierarchy="/sys/fs/cgroup" --cgroups_limit_swap="false"
--cgroups_root="mesos" --container_disk_watch_interval="15secs" --containerizers="mesos" --credential="/tmp/Endpoint_SlaveEndpointTest_NoAuthorizer_2_iMjSol/credential"
--default_role="*" --disallow_sharing_agent_pid_namespace="false" --disk_watch_interval="1mins"
--docker="docker" --docker_kill_orphans="true" --docker_registry="https://registry-1.docker.io"
--docker_remove_delay="6hrs" --docker_socket="/var/run/docker.sock" --docker_stop_timeout="0ns"
--docker_store_dir="/tmp/Endpoint_SlaveEndpointTest_NoAuthorizer_2_iMjSol/store/docker" --docker_volume_checkpoint_dir="/var/run/mesos/isolators/docker/volume"
--enforce_container_disk_quota="false" --executor_registration_timeout="1mins" --executor_reregistration_timeout="2secs"
--executor_secret_key="/tmp/Endpoint_SlaveEndpointTest_NoAuthorizer_2_iMjSol/executor_secret_key"
--executor_shutdown_grace_period="5secs" --fetcher_cache_dir="/tmp/Endpoint_SlaveEndpointTest_NoAuthorizer_2_iMjSol/fetch"
--fetcher_cache_size="2GB" --frameworks_home="" --gc_delay="1weeks" --gc_disk_headroom="0.1"
--hadoop_home="" --help="false" --hostname_lookup="true" --http_command_executor="false" --http_credentials="/tmp/Endpoint_SlaveEndpointTest_NoAuthorizer_2_iMjSol/http_credentials"
--http_heartbeat_interval="30secs" --initialize_driver_logging="true" --isolation="posix/cpu,posix/mem"
--launcher="posix" --launcher_dir="/mesos/mesos-1.4.0/_build/src" --logbufsecs="0" --logging_level="INFO"
--max_completed_executors_per_framework="150" --oversubscribed_resources_interval="15secs"
--perf_duration="10secs" --perf_interval="1mins" --port="5051" --qos_correction_interval_min="0ns"
--quiet="false" --recover="reconnect" --recovery_timeout="15mins" --registration_backoff_factor="10ms"
--resources="cpus:2;gpus:0;mem:1024;disk:1024;ports:[31000-32000]" --revocable_cpu_low_priority="true"
--runtime_dir="/tmp/Endpoint_SlaveEndpointTest_NoAuthorizer_2_iMjSol" --sandbox_directory="/mnt/mesos/sandbox"
--strict="true" --switch_user="true" --systemd_enable_support="true" --systemd_runtime_directory="/run/systemd/system"
--version="false" --work_dir="/tmp/Endpoint_SlaveEndpointTest_NoAuthorizer_2_wItOiv"
I0818 07:34:32.677808 30330 credentials.hpp:86] Loading credential for authentication from
'/tmp/Endpoint_SlaveEndpointTest_NoAuthorizer_2_iMjSol/credential'
I0818 07:34:32.678045 30330 slave.cpp:283] Agent using credential for: test-principal
I0818 07:34:32.678068 30330 credentials.hpp:37] Loading credentials for authentication from
'/tmp/Endpoint_SlaveEndpointTest_NoAuthorizer_2_iMjSol/http_credentials'
I0818 07:34:32.678414 30330 http.cpp:1026] Creating default 'basic' HTTP authenticator for
realm 'mesos-agent-executor'
I0818 07:34:32.678578 30330 http.cpp:1047] Creating default 'jwt' HTTP authenticator for realm
'mesos-agent-executor'
I0818 07:34:32.678834 30330 http.cpp:1026] Creating default 'basic' HTTP authenticator for
realm 'mesos-agent-readonly'
I0818 07:34:32.678959 30330 http.cpp:1047] Creating default 'jwt' HTTP authenticator for realm
'mesos-agent-readonly'
I0818 07:34:32.679172 30330 http.cpp:1026] Creating default 'basic' HTTP authenticator for
realm 'mesos-agent-readwrite'
I0818 07:34:32.679303 30330 http.cpp:1047] Creating default 'jwt' HTTP authenticator for realm
'mesos-agent-readwrite'
I0818 07:34:32.680924 30330 slave.cpp:565] Agent resources: [{"name":"cpus","scalar":{"value":2.0},"type":"SCALAR"},{"name":"mem","scalar":{"value":1024.0},"type":"SCALAR"},{"name":"disk","scalar":{"value":1024.0},"type":"SCALAR"},{"name":"ports","ranges":{"range":[{"begin":31000,"end":32000}]},"type":"RANGES"}]
I0818 07:34:32.681180 30330 slave.cpp:573] Agent attributes: [  ]
I0818 07:34:32.681195 30330 slave.cpp:582] Agent hostname: 8e7fbb402c91
I0818 07:34:32.681350 30348 status_update_manager.cpp:177] Pausing sending status updates
I0818 07:34:32.683069 30340 state.cpp:64] Recovering state from '/tmp/Endpoint_SlaveEndpointTest_NoAuthorizer_2_wItOiv/meta'
I0818 07:34:32.683447 30336 status_update_manager.cpp:203] Recovering status update manager
I0818 07:34:32.683671 30332 containerizer.cpp:609] Recovering containerizer
I0818 07:34:32.685120 30345 provisioner.cpp:416] Provisioner recovery complete
I0818 07:34:32.685490 30346 slave.cpp:6210] Finished recovery
I0818 07:34:32.686077 30346 slave.cpp:6392] Querying resource estimator for oversubscribable
resources
I0818 07:34:32.686347 30353 slave.cpp:6406] Received oversubscribable resources {} from the
resource estimator
I0818 07:34:32.688835 30331 process.cpp:3933] Handling HTTP event for process 'slave(808)'
with path: '/slave(808)/containers'
I0818 07:34:32.690701 30334 http.cpp:1166] HTTP GET for /slave(808)/containers from 172.17.0.3:58732
I0818 07:34:32.690788 30334 http.cpp:957] Authorizing principal 'test-principal' to GET the
'/containers' endpoint
I0818 07:34:32.694234 30332 slave.cpp:843] Agent terminating
[       OK ] Endpoint/SlaveEndpointTest.NoAuthorizer/2 (36 ms)
[----------] 9 tests from Endpoint/SlaveEndpointTest (303 ms total)

[----------] 2 tests from ContainerizerType/DefaultContainerDNSFlagTest
[ RUN      ] ContainerizerType/DefaultContainerDNSFlagTest.ValidateFlag/0
[       OK ] ContainerizerType/DefaultContainerDNSFlagTest.ValidateFlag/0 (10 ms)
[ RUN      ] ContainerizerType/DefaultContainerDNSFlagTest.ValidateFlag/1
[       OK ] ContainerizerType/DefaultContainerDNSFlagTest.ValidateFlag/1 (10 ms)
[----------] 2 tests from ContainerizerType/DefaultContainerDNSFlagTest (20 ms total)

[----------] Global test environment tear-down
[==========] 1660 tests from 184 test cases ran. (643962 ms total)
[  PASSED  ] 1654 tests.
[  FAILED  ] 6 tests, listed below:
[  FAILED  ] CommandExecutorCheckTest.CommandCheckDeliveredAndReconciled
[  FAILED  ] DefaultExecutorCheckTest.CommandCheckDeliveredAndReconciled
[  FAILED  ] DefaultExecutorCheckTest.CommandCheckStatusChange
[  FAILED  ] DefaultExecutorCheckTest.CommandCheckSeesParentsEnv
[  FAILED  ] DefaultExecutorCheckTest.CommandCheckSharesWorkDirWithTask
[  FAILED  ] MasterTest.IgnoreOldAgentReregistration

 6 FAILED TESTS
  YOU HAVE 20 DISABLED TESTS

I0818 07:34:32.784682 30354 process.cpp:1072] Failed to accept socket: future discarded
make[4]: *** [check-local] Error 1
make[4]: Leaving directory `/mesos/mesos-1.4.0/_build/src'
make[3]: *** [check-am] Error 2
make[3]: Leaving directory `/mesos/mesos-1.4.0/_build/src'
make[2]: *** [check] Error 2
make[2]: Leaving directory `/mesos/mesos-1.4.0/_build/src'
make[1]: *** [check-recursive] Error 1
make[1]: Leaving directory `/mesos/mesos-1.4.0/_build'
make: *** [distcheck] Error 1
+ docker rmi mesos-1503038952-14967
Untagged: mesos-1503038952-14967:latest
Deleted: sha256:6dca28bd65da28e46668e1de041c22893bded56d6b9f8ada73df87e4f315aac3
Deleted: sha256:f7fca412c65fe76272a818e320bd10ec656f53dedb4458c27da4422783ec9fd2
Deleted: sha256:0cec90bd80e2ffc154561e8970bacebc357d01e083c870ca1330022811ac07e2
Deleted: sha256:23dd7eb9d41ac73df47f14ea3c144c5c82e02c7c8a130a4def5881820923724c
Deleted: sha256:da614be6fd2754efd4cdf1c03c376fe2ba160a7fed915d9d9b5b8d99d852e7a9
Deleted: sha256:fb884ccb108ada6860381efb82c9724165711feb3ca8259259316e0a83396da5
Deleted: sha256:f59da7d6e5a907dc5888de518ba3312afa9d0d7c42def86794eeaff18dade1ee
Deleted: sha256:cd9cf9d35c535b86f7591c3474e080137ca840b0bff5eb6c1b1c2c0b3311d999
Deleted: sha256:d9bb17b3ea9ae32d989a7353a39b74650631e37b7d8f616de50f44171edb1fd3
Deleted: sha256:5d63c76fcdba8d5859075adc402c48283d55f9743716f8db513778719c788b96
Deleted: sha256:90e1e97beb962077a549e4d2039736d228f4e7b615d1def74838ba8d93d04673
Deleted: sha256:dea6be44aa8f0a8ab26ef5c388d2f067f656fe466fb4438c6f7f1393cf8a89fe
Deleted: sha256:445720f818ecf4501ba10f890d30de3292e037746dd9d3e37ad5f0ec27f258a4
Deleted: sha256:c1b52939104be7755eab7e1c6c1878a04e0a561815201812342087e47b03afae
Deleted: sha256:a4e12ef1d9939bec45f311691a271f404a34483ffa91c5d1b2f22be181272801
Deleted: sha256:6183173f3ba8f319a3d3e0581d4bacb59aeedb581ac43c52617b76fcc45b16d2
Deleted: sha256:999db4736b6c325dad02566cc00b9e25471a1428b6d7c32dbcf39b6f960f7553
Deleted: sha256:2f75839c1a3c181653305dc422283e30e167e65c08a4f3f2c38b2e0048f21b52
Deleted: sha256:62339ea8ae2756177cb6f97914bb0636fd2359d5158ce070240afea5723e4b0f
Deleted: sha256:16443afb3407073f8715c1616339e13f97c8898a9042ba7829c46bf1fdc39207
Deleted: sha256:2a64b4fc6db9f9daf1502520431475ee59f37f7f63fb33e7a436d204fc427bc8
Deleted: sha256:40c76203168394db4139215ae89922142b589213b047b5ce16f5275b3672469f
Deleted: sha256:be435482608e4b09741f9b4a8964d74b8e93f23c64434eed48c4f64981cbdb6e
Deleted: sha256:395f980e732f618b0f1514830a1be2e583539f0602c22d6ea21618f3e93a8c06
Deleted: sha256:d589b009d4b70b02c57bb476d1f79accd18efc3a48caa3d3d2d83569c24ce81d
Build step 'Execute shell' marked build as failure

Mime
View raw message