mesos-builds mailing list archives

Site index · List index
Message view « Date » · « Thread »
Top « Date » · « Thread »
From Apache Jenkins Server <jenk...@builds.apache.org>
Subject Build failed in Jenkins: Mesos-Buildbot » cmake,gcc,--verbose --enable-libevent --enable-ssl,GLOG_v=1 MESOS_VERBOSE=1,centos:7,(ubuntu)&&(!ubuntu-us1)&&(!ubuntu-eu2) #4163
Date Mon, 28 Aug 2017 21:46:36 GMT
See <https://builds.apache.org/job/Mesos-Buildbot/BUILDTOOL=cmake,COMPILER=gcc,CONFIGURATION=--verbose%20--enable-libevent%20--enable-ssl,ENVIRONMENT=GLOG_v=1%20MESOS_VERBOSE=1,OS=centos%3A7,label_exp=(ubuntu)&&(!ubuntu-us1)&&(!ubuntu-eu2)/4163/display/redirect?page=changes>

Changes:

[Kapil Arya] Updated CHANGELOG for 1.4.0-rc3.

------------------------------------------
[...truncated 29.79 MB...]
I0828 21:46:29.165711  6649 slave.cpp:6453] Querying resource estimator for oversubscribable
resources
I0828 21:46:29.166013  6637 slave.cpp:6467] Received oversubscribable resources {} from the
resource estimator
I0828 21:46:29.168040  6644 process.cpp:3933] Handling HTTP event for process 'slave(799)'
with path: '/slave(799)/containers'
I0828 21:46:29.169909  6642 http.cpp:1166] HTTP GET for /slave(799)/containers from 172.17.0.4:46580
I0828 21:46:29.169989  6642 http.cpp:957] Authorizing principal 'test-principal' to GET the
'/containers' endpoint
I0828 21:46:29.174350   950 slave.cpp:843] Agent terminating
[       OK ] Endpoint/SlaveEndpointTest.AuthorizedRequest/2 (34 ms)
[ RUN      ] Endpoint/SlaveEndpointTest.UnauthorizedRequest/0
I0828 21:46:29.186982   950 containerizer.cpp:246] Using isolation: posix/cpu,posix/mem,filesystem/posix,network/cni,environment_secret
W0828 21:46:29.187614   950 backend.cpp:76] Failed to create 'aufs' backend: AufsBackend requires
root privileges
W0828 21:46:29.187736   950 backend.cpp:76] Failed to create 'bind' backend: BindBackend requires
root privileges
I0828 21:46:29.187770   950 provisioner.cpp:255] Using default backend 'copy'
I0828 21:46:29.191382  6642 slave.cpp:250] Mesos agent started on (800)@172.17.0.4:46775
I0828 21:46:29.191401  6642 slave.cpp:251] Flags at startup: --acls="" --appc_simple_discovery_uri_prefix="http://"
--appc_store_dir="/tmp/Endpoint_SlaveEndpointTest_UnauthorizedRequest_0_m5vVb6/store/appc"
--authenticate_http_executors="true" --authenticate_http_readonly="true" --authenticate_http_readwrite="true"
--authenticatee="crammd5" --authentication_backoff_factor="1secs" --authorizer="local" --cgroups_cpu_enable_pids_and_tids_count="false"
--cgroups_enable_cfs="false" --cgroups_hierarchy="/sys/fs/cgroup" --cgroups_limit_swap="false"
--cgroups_root="mesos" --container_disk_watch_interval="15secs" --containerizers="mesos" --credential="/tmp/Endpoint_SlaveEndpointTest_UnauthorizedRequest_0_m5vVb6/credential"
--default_role="*" --disallow_sharing_agent_pid_namespace="false" --disk_watch_interval="1mins"
--docker="docker" --docker_kill_orphans="true" --docker_registry="https://registry-1.docker.io"
--docker_remove_delay="6hrs" --docker_socket="/var/run/docker.sock" --docker_stop_timeout="0ns"
--docker_store_dir="/tmp/Endpoint_SlaveEndpointTest_UnauthorizedRequest_0_m5vVb6/store/docker"
--docker_volume_checkpoint_dir="/var/run/mesos/isolators/docker/volume" --enforce_container_disk_quota="false"
--executor_registration_timeout="1mins" --executor_reregistration_timeout="2secs" --executor_secret_key="/tmp/Endpoint_SlaveEndpointTest_UnauthorizedRequest_0_m5vVb6/executor_secret_key"
--executor_shutdown_grace_period="5secs" --fetcher_cache_dir="/tmp/Endpoint_SlaveEndpointTest_UnauthorizedRequest_0_m5vVb6/fetch"
--fetcher_cache_size="2GB" --frameworks_home="" --gc_delay="1weeks" --gc_disk_headroom="0.1"
--hadoop_home="" --help="false" --hostname_lookup="true" --http_command_executor="false" --http_credentials="/tmp/Endpoint_SlaveEndpointTest_UnauthorizedRequest_0_m5vVb6/http_credentials"
--http_heartbeat_interval="30secs" --initialize_driver_logging="true" --isolation="posix/cpu,posix/mem"
--launcher="posix" --launcher_dir="/mesos/build/src" --logbufsecs="0" --logging_level="INFO"
--max_completed_executors_per_framework="150" --oversubscribed_resources_interval="15secs"
--perf_duration="10secs" --perf_interval="1mins" --port="5051" --qos_correction_interval_min="0ns"
--quiet="false" --recover="reconnect" --recovery_timeout="15mins" --registration_backoff_factor="10ms"
--resources="cpus:2;gpus:0;mem:1024;disk:1024;ports:[31000-32000]" --revocable_cpu_low_priority="true"
--runtime_dir="/tmp/Endpoint_SlaveEndpointTest_UnauthorizedRequest_0_m5vVb6" --sandbox_directory="/mnt/mesos/sandbox"
--strict="true" --switch_user="true" --systemd_enable_support="true" --systemd_runtime_directory="/run/systemd/system"
--version="false" --work_dir="/tmp/Endpoint_SlaveEndpointTest_UnauthorizedRequest_0_wTMHaB"
I0828 21:46:29.191875  6642 credentials.hpp:86] Loading credential for authentication from
'/tmp/Endpoint_SlaveEndpointTest_UnauthorizedRequest_0_m5vVb6/credential'
I0828 21:46:29.192039  6642 slave.cpp:283] Agent using credential for: test-principal
I0828 21:46:29.192103  6642 credentials.hpp:37] Loading credentials for authentication from
'/tmp/Endpoint_SlaveEndpointTest_UnauthorizedRequest_0_m5vVb6/http_credentials'
I0828 21:46:29.192411  6642 http.cpp:1026] Creating default 'basic' HTTP authenticator for
realm 'mesos-agent-executor'
I0828 21:46:29.192543  6642 http.cpp:1047] Creating default 'jwt' HTTP authenticator for realm
'mesos-agent-executor'
I0828 21:46:29.192826  6642 http.cpp:1026] Creating default 'basic' HTTP authenticator for
realm 'mesos-agent-readonly'
I0828 21:46:29.192960  6642 http.cpp:1047] Creating default 'jwt' HTTP authenticator for realm
'mesos-agent-readonly'
I0828 21:46:29.193207  6642 http.cpp:1026] Creating default 'basic' HTTP authenticator for
realm 'mesos-agent-readwrite'
I0828 21:46:29.193334  6642 http.cpp:1047] Creating default 'jwt' HTTP authenticator for realm
'mesos-agent-readwrite'
I0828 21:46:29.195053  6642 slave.cpp:565] Agent resources: [{"name":"cpus","scalar":{"value":2.0},"type":"SCALAR"},{"name":"mem","scalar":{"value":1024.0},"type":"SCALAR"},{"name":"disk","scalar":{"value":1024.0},"type":"SCALAR"},{"name":"ports","ranges":{"range":[{"begin":31000,"end":32000}]},"type":"RANGES"}]
I0828 21:46:29.195302  6642 slave.cpp:573] Agent attributes: [  ]
I0828 21:46:29.195322  6642 slave.cpp:582] Agent hostname: c3ac1e6873d7
I0828 21:46:29.195490  6640 status_update_manager.cpp:177] Pausing sending status updates
I0828 21:46:29.197017  6650 state.cpp:64] Recovering state from '/tmp/Endpoint_SlaveEndpointTest_UnauthorizedRequest_0_wTMHaB/meta'
I0828 21:46:29.197408  6649 status_update_manager.cpp:203] Recovering status update manager
I0828 21:46:29.197659  6639 containerizer.cpp:609] Recovering containerizer
I0828 21:46:29.199324  6647 provisioner.cpp:416] Provisioner recovery complete
I0828 21:46:29.199805  6648 slave.cpp:6271] Finished recovery
I0828 21:46:29.200387  6648 slave.cpp:6453] Querying resource estimator for oversubscribable
resources
I0828 21:46:29.200664  6642 slave.cpp:6467] Received oversubscribable resources {} from the
resource estimator
I0828 21:46:29.203004  6646 process.cpp:3933] Handling HTTP event for process 'slave(800)'
with path: '/slave(800)/monitor/statistics'
I0828 21:46:29.204871  6637 http.cpp:1166] HTTP GET for /slave(800)/monitor/statistics from
172.17.0.4:46581
I0828 21:46:29.204947  6637 http.cpp:957] Authorizing principal 'test-principal' to GET the
'/monitor/statistics' endpoint
I0828 21:46:29.207594  6642 slave.cpp:843] Agent terminating
[       OK ] Endpoint/SlaveEndpointTest.UnauthorizedRequest/0 (33 ms)
[ RUN      ] Endpoint/SlaveEndpointTest.UnauthorizedRequest/1
I0828 21:46:29.221737   950 containerizer.cpp:246] Using isolation: posix/cpu,posix/mem,filesystem/posix,network/cni,environment_secret
W0828 21:46:29.222337   950 backend.cpp:76] Failed to create 'aufs' backend: AufsBackend requires
root privileges
W0828 21:46:29.222460   950 backend.cpp:76] Failed to create 'bind' backend: BindBackend requires
root privileges
I0828 21:46:29.222494   950 provisioner.cpp:255] Using default backend 'copy'
I0828 21:46:29.226553  6642 slave.cpp:250] Mesos agent started on (801)@172.17.0.4:46775
I0828 21:46:29.226570  6642 slave.cpp:251] Flags at startup: --acls="" --appc_simple_discovery_uri_prefix="http://"
--appc_store_dir="/tmp/Endpoint_SlaveEndpointTest_UnauthorizedRequest_1_QUAWz6/store/appc"
--authenticate_http_executors="true" --authenticate_http_readonly="true" --authenticate_http_readwrite="true"
--authenticatee="crammd5" --authentication_backoff_factor="1secs" --authorizer="local" --cgroups_cpu_enable_pids_and_tids_count="false"
--cgroups_enable_cfs="false" --cgroups_hierarchy="/sys/fs/cgroup" --cgroups_limit_swap="false"
--cgroups_root="mesos" --container_disk_watch_interval="15secs" --containerizers="mesos" --credential="/tmp/Endpoint_SlaveEndpointTest_UnauthorizedRequest_1_QUAWz6/credential"
--default_role="*" --disallow_sharing_agent_pid_namespace="false" --disk_watch_interval="1mins"
--docker="docker" --docker_kill_orphans="true" --docker_registry="https://registry-1.docker.io"
--docker_remove_delay="6hrs" --docker_socket="/var/run/docker.sock" --docker_stop_timeout="0ns"
--docker_store_dir="/tmp/Endpoint_SlaveEndpointTest_UnauthorizedRequest_1_QUAWz6/store/docker"
--docker_volume_checkpoint_dir="/var/run/mesos/isolators/docker/volume" --enforce_container_disk_quota="false"
--executor_registration_timeout="1mins" --executor_reregistration_timeout="2secs" --executor_secret_key="/tmp/Endpoint_SlaveEndpointTest_UnauthorizedRequest_1_QUAWz6/executor_secret_key"
--executor_shutdown_grace_period="5secs" --fetcher_cache_dir="/tmp/Endpoint_SlaveEndpointTest_UnauthorizedRequest_1_QUAWz6/fetch"
--fetcher_cache_size="2GB" --frameworks_home="" --gc_delay="1weeks" --gc_disk_headroom="0.1"
--hadoop_home="" --help="false" --hostname_lookup="true" --http_command_executor="false" --http_credentials="/tmp/Endpoint_SlaveEndpointTest_UnauthorizedRequest_1_QUAWz6/http_credentials"
--http_heartbeat_interval="30secs" --initialize_driver_logging="true" --isolation="posix/cpu,posix/mem"
--launcher="posix" --launcher_dir="/mesos/build/src" --logbufsecs="0" --logging_level="INFO"
--max_completed_executors_per_framework="150" --oversubscribed_resources_interval="15secs"
--perf_duration="10secs" --perf_interval="1mins" --port="5051" --qos_correction_interval_min="0ns"
--quiet="false" --recover="reconnect" --recovery_timeout="15mins" --registration_backoff_factor="10ms"
--resources="cpus:2;gpus:0;mem:1024;disk:1024;ports:[31000-32000]" --revocable_cpu_low_priority="true"
--runtime_dir="/tmp/Endpoint_SlaveEndpointTest_UnauthorizedRequest_1_QUAWz6" --sandbox_directory="/mnt/mesos/sandbox"
--strict="true" --switch_user="true" --systemd_enable_support="true" --systemd_runtime_directory="/run/systemd/system"
--version="false" --work_dir="/tmp/Endpoint_SlaveEndpointTest_UnauthorizedRequest_1_GTb7sB"
I0828 21:46:29.226897  6642 credentials.hpp:86] Loading credential for authentication from
'/tmp/Endpoint_SlaveEndpointTest_UnauthorizedRequest_1_QUAWz6/credential'
I0828 21:46:29.227007  6642 slave.cpp:283] Agent using credential for: test-principal
I0828 21:46:29.227023  6642 credentials.hpp:37] Loading credentials for authentication from
'/tmp/Endpoint_SlaveEndpointTest_UnauthorizedRequest_1_QUAWz6/http_credentials'
I0828 21:46:29.227301  6642 http.cpp:1026] Creating default 'basic' HTTP authenticator for
realm 'mesos-agent-executor'
I0828 21:46:29.227399  6642 http.cpp:1047] Creating default 'jwt' HTTP authenticator for realm
'mesos-agent-executor'
I0828 21:46:29.227640  6642 http.cpp:1026] Creating default 'basic' HTTP authenticator for
realm 'mesos-agent-readonly'
I0828 21:46:29.227733  6642 http.cpp:1047] Creating default 'jwt' HTTP authenticator for realm
'mesos-agent-readonly'
I0828 21:46:29.227919  6642 http.cpp:1026] Creating default 'basic' HTTP authenticator for
realm 'mesos-agent-readwrite'
I0828 21:46:29.228005  6642 http.cpp:1047] Creating default 'jwt' HTTP authenticator for realm
'mesos-agent-readwrite'
I0828 21:46:29.229341  6642 slave.cpp:565] Agent resources: [{"name":"cpus","scalar":{"value":2.0},"type":"SCALAR"},{"name":"mem","scalar":{"value":1024.0},"type":"SCALAR"},{"name":"disk","scalar":{"value":1024.0},"type":"SCALAR"},{"name":"ports","ranges":{"range":[{"begin":31000,"end":32000}]},"type":"RANGES"}]
I0828 21:46:29.229509  6642 slave.cpp:573] Agent attributes: [  ]
I0828 21:46:29.229521  6642 slave.cpp:582] Agent hostname: c3ac1e6873d7
I0828 21:46:29.229634  6649 status_update_manager.cpp:177] Pausing sending status updates
I0828 21:46:29.230794  6641 state.cpp:64] Recovering state from '/tmp/Endpoint_SlaveEndpointTest_UnauthorizedRequest_1_GTb7sB/meta'
I0828 21:46:29.231029  6641 status_update_manager.cpp:203] Recovering status update manager
I0828 21:46:29.231189  6648 containerizer.cpp:609] Recovering containerizer
I0828 21:46:29.232419  6641 provisioner.cpp:416] Provisioner recovery complete
I0828 21:46:29.232827  6646 slave.cpp:6271] Finished recovery
I0828 21:46:29.233414  6646 slave.cpp:6453] Querying resource estimator for oversubscribable
resources
I0828 21:46:29.233726  6650 slave.cpp:6467] Received oversubscribable resources {} from the
resource estimator
I0828 21:46:29.236270  6647 process.cpp:3933] Handling HTTP event for process 'slave(801)'
with path: '/slave(801)/monitor/statistics.json'
I0828 21:46:29.238101  6645 http.cpp:1166] HTTP GET for /slave(801)/monitor/statistics.json
from 172.17.0.4:46582
I0828 21:46:29.238153  6645 http.cpp:957] Authorizing principal 'test-principal' to GET the
'/monitor/statistics.json' endpoint
I0828 21:46:29.240489  6650 slave.cpp:843] Agent terminating
[       OK ] Endpoint/SlaveEndpointTest.UnauthorizedRequest/1 (31 ms)
[ RUN      ] Endpoint/SlaveEndpointTest.UnauthorizedRequest/2
I0828 21:46:29.252493   950 containerizer.cpp:246] Using isolation: posix/cpu,posix/mem,filesystem/posix,network/cni,environment_secret
W0828 21:46:29.253020   950 backend.cpp:76] Failed to create 'aufs' backend: AufsBackend requires
root privileges
W0828 21:46:29.253139   950 backend.cpp:76] Failed to create 'bind' backend: BindBackend requires
root privileges
I0828 21:46:29.253178   950 provisioner.cpp:255] Using default backend 'copy'
I0828 21:46:29.256678  6638 slave.cpp:250] Mesos agent started on (802)@172.17.0.4:46775
I0828 21:46:29.256701  6638 slave.cpp:251] Flags at startup: --acls="" --appc_simple_discovery_uri_prefix="http://"
--appc_store_dir="/tmp/Endpoint_SlaveEndpointTest_UnauthorizedRequest_2_OIXOi7/store/appc"
--authenticate_http_executors="true" --authenticate_http_readonly="true" --authenticate_http_readwrite="true"
--authenticatee="crammd5" --authentication_backoff_factor="1secs" --authorizer="local" --cgroups_cpu_enable_pids_and_tids_count="false"
--cgroups_enable_cfs="false" --cgroups_hierarchy="/sys/fs/cgroup" --cgroups_limit_swap="false"
--cgroups_root="mesos" --container_disk_watch_interval="15secs" --containerizers="mesos" --credential="/tmp/Endpoint_SlaveEndpointTest_UnauthorizedRequest_2_OIXOi7/credential"
--default_role="*" --disallow_sharing_agent_pid_namespace="false" --disk_watch_interval="1mins"
--docker="docker" --docker_kill_orphans="true" --docker_registry="https://registry-1.docker.io"
--docker_remove_delay="6hrs" --docker_socket="/var/run/docker.sock" --docker_stop_timeout="0ns"
--docker_store_dir="/tmp/Endpoint_SlaveEndpointTest_UnauthorizedRequest_2_OIXOi7/store/docker"
--docker_volume_checkpoint_dir="/var/run/mesos/isolators/docker/volume" --enforce_container_disk_quota="false"
--executor_registration_timeout="1mins" --executor_reregistration_timeout="2secs" --executor_secret_key="/tmp/Endpoint_SlaveEndpointTest_UnauthorizedRequest_2_OIXOi7/executor_secret_key"
--executor_shutdown_grace_period="5secs" --fetcher_cache_dir="/tmp/Endpoint_SlaveEndpointTest_UnauthorizedRequest_2_OIXOi7/fetch"
--fetcher_cache_size="2GB" --frameworks_home="" --gc_delay="1weeks" --gc_disk_headroom="0.1"
--hadoop_home="" --help="false" --hostname_lookup="true" --http_command_executor="false" --http_credentials="/tmp/Endpoint_SlaveEndpointTest_UnauthorizedRequest_2_OIXOi7/http_credentials"
--http_heartbeat_interval="30secs" --initialize_driver_logging="true" --isolation="posix/cpu,posix/mem"
--launcher="posix" --launcher_dir="/mesos/build/src" --logbufsecs="0" --logging_level="INFO"
--max_completed_executors_per_framework="150" --oversubscribed_resources_interval="15secs"
--perf_duration="10secs" --perf_interval="1mins" --port="5051" --qos_correction_interval_min="0ns"
--quiet="false" --recover="reconnect" --recovery_timeout="15mins" --registration_backoff_factor="10ms"
--resources="cpus:2;gpus:0;mem:1024;disk:1024;ports:[31000-32000]" --revocable_cpu_low_priority="true"
--runtime_dir="/tmp/Endpoint_SlaveEndpointTest_UnauthorizedRequest_2_OIXOi7" --sandbox_directory="/mnt/mesos/sandbox"
--strict="true" --switch_user="true" --systemd_enable_support="true" --systemd_runtime_directory="/run/systemd/system"
--version="false" --work_dir="/tmp/Endpoint_SlaveEndpointTest_UnauthorizedRequest_2_SMsQ6B"
I0828 21:46:29.257328  6638 credentials.hpp:86] Loading credential for authentication from
'/tmp/Endpoint_SlaveEndpointTest_UnauthorizedRequest_2_OIXOi7/credential'
I0828 21:46:29.257520  6638 slave.cpp:283] Agent using credential for: test-principal
I0828 21:46:29.257550  6638 credentials.hpp:37] Loading credentials for authentication from
'/tmp/Endpoint_SlaveEndpointTest_UnauthorizedRequest_2_OIXOi7/http_credentials'
I0828 21:46:29.257979  6638 http.cpp:1026] Creating default 'basic' HTTP authenticator for
realm 'mesos-agent-executor'
I0828 21:46:29.258136  6638 http.cpp:1047] Creating default 'jwt' HTTP authenticator for realm
'mesos-agent-executor'
I0828 21:46:29.258421  6638 http.cpp:1026] Creating default 'basic' HTTP authenticator for
realm 'mesos-agent-readonly'
I0828 21:46:29.258569  6638 http.cpp:1047] Creating default 'jwt' HTTP authenticator for realm
'mesos-agent-readonly'
I0828 21:46:29.258795  6638 http.cpp:1026] Creating default 'basic' HTTP authenticator for
realm 'mesos-agent-readwrite'
I0828 21:46:29.258898  6638 http.cpp:1047] Creating default 'jwt' HTTP authenticator for realm
'mesos-agent-readwrite'
I0828 21:46:29.260066  6638 slave.cpp:565] Agent resources: [{"name":"cpus","scalar":{"value":2.0},"type":"SCALAR"},{"name":"mem","scalar":{"value":1024.0},"type":"SCALAR"},{"name":"disk","scalar":{"value":1024.0},"type":"SCALAR"},{"name":"ports","ranges":{"range":[{"begin":31000,"end":32000}]},"type":"RANGES"}]
I0828 21:46:29.260236  6638 slave.cpp:573] Agent attributes: [  ]
I0828 21:46:29.260246  6638 slave.cpp:582] Agent hostname: c3ac1e6873d7
I0828 21:46:29.260356  6652 status_update_manager.cpp:177] Pausing sending status updates
I0828 21:46:29.261437  6643 state.cpp:64] Recovering state from '/tmp/Endpoint_SlaveEndpointTest_UnauthorizedRequest_2_SMsQ6B/meta'
I0828 21:46:29.261709  6647 status_update_manager.cpp:203] Recovering status update manager
I0828 21:46:29.261942  6649 containerizer.cpp:609] Recovering containerizer
I0828 21:46:29.263262  6647 provisioner.cpp:416] Provisioner recovery complete
I0828 21:46:29.263586  6639 slave.cpp:6271] Finished recovery
I0828 21:46:29.264087  6639 slave.cpp:6453] Querying resource estimator for oversubscribable
resources
I0828 21:46:29.264358  6645 slave.cpp:6467] Received oversubscribable resources {} from the
resource estimator
I0828 21:46:29.266435  6652 process.cpp:3933] Handling HTTP event for process 'slave(802)'
with path: '/slave(802)/containers'
I0828 21:46:29.268326  6646 http.cpp:1166] HTTP GET for /slave(802)/containers from 172.17.0.4:46583
I0828 21:46:29.268402  6646 http.cpp:957] Authorizing principal 'test-principal' to GET the
'/containers' endpoint
I0828 21:46:29.270707   950 slave.cpp:843] Agent terminating
[       OK ] Endpoint/SlaveEndpointTest.UnauthorizedRequest/2 (29 ms)
[ RUN      ] Endpoint/SlaveEndpointTest.NoAuthorizer/0
I0828 21:46:29.283686   950 containerizer.cpp:246] Using isolation: posix/cpu,posix/mem,filesystem/posix,network/cni,environment_secret
W0828 21:46:29.284327   950 backend.cpp:76] Failed to create 'aufs' backend: AufsBackend requires
root privileges
W0828 21:46:29.284428   950 backend.cpp:76] Failed to create 'bind' backend: BindBackend requires
root privileges
I0828 21:46:29.284457   950 provisioner.cpp:255] Using default backend 'copy'
I0828 21:46:29.286087   950 cluster.cpp:448] Creating default 'local' authorizer
I0828 21:46:29.288414  6641 slave.cpp:250] Mesos agent started on (803)@172.17.0.4:46775
I0828 21:46:29.288432  6641 slave.cpp:251] Flags at startup: --acls="" --appc_simple_discovery_uri_prefix="http://"
--appc_store_dir="/tmp/Endpoint_SlaveEndpointTest_NoAuthorizer_0_0XMkl8/store/appc" --authenticate_http_executors="true"
--authenticate_http_readonly="true" --authenticate_http_readwrite="true" --authenticatee="crammd5"
--authentication_backoff_factor="1secs" --authorizer="local" --cgroups_cpu_enable_pids_and_tids_count="false"
--cgroups_enable_cfs="false" --cgroups_hierarchy="/sys/fs/cgroup" --cgroups_limit_swap="false"
--cgroups_root="mesos" --container_disk_watch_interval="15secs" --containerizers="mesos" --credential="/tmp/Endpoint_SlaveEndpointTest_NoAuthorizer_0_0XMkl8/credential"
--default_role="*" --disallow_sharing_agent_pid_namespace="false" --disk_watch_interval="1mins"
--docker="docker" --docker_kill_orphans="true" --docker_registry="https://registry-1.docker.io"
--docker_remove_delay="6hrs" --docker_socket="/var/run/docker.sock" --docker_stop_timeout="0ns"
--docker_store_dir="/tmp/Endpoint_SlaveEndpointTest_NoAuthorizer_0_0XMkl8/store/docker" --docker_volume_checkpoint_dir="/var/run/mesos/isolators/docker/volume"
--enforce_container_disk_quota="false" --executor_registration_timeout="1mins" --executor_reregistration_timeout="2secs"
--executor_secret_key="/tmp/Endpoint_SlaveEndpointTest_NoAuthorizer_0_0XMkl8/executor_secret_key"
--executor_shutdown_grace_period="5secs" --fetcher_cache_dir="/tmp/Endpoint_SlaveEndpointTest_NoAuthorizer_0_0XMkl8/fetch"
--fetcher_cache_size="2GB" --frameworks_home="" --gc_delay="1weeks" --gc_disk_headroom="0.1"
--hadoop_home="" --help="false" --hostname_lookup="true" --http_command_executor="false" --http_credentials="/tmp/Endpoint_SlaveEndpointTest_NoAuthorizer_0_0XMkl8/http_credentials"
--http_heartbeat_interval="30secs" --initialize_driver_logging="true" --isolation="posix/cpu,posix/mem"
--launcher="posix" --launcher_dir="/mesos/build/src" --logbufsecs="0" --logging_level="INFO"
--max_completed_executors_per_framework="150" --oversubscribed_resources_interval="15secs"
--perf_duration="10secs" --perf_interval="1mins" --port="5051" --qos_correction_interval_min="0ns"
--quiet="false" --recover="reconnect" --recovery_timeout="15mins" --registration_backoff_factor="10ms"
--resources="cpus:2;gpus:0;mem:1024;disk:1024;ports:[31000-32000]" --revocable_cpu_low_priority="true"
--runtime_dir="/tmp/Endpoint_SlaveEndpointTest_NoAuthorizer_0_0XMkl8" --sandbox_directory="/mnt/mesos/sandbox"
--strict="true" --switch_user="true" --systemd_enable_support="true" --systemd_runtime_directory="/run/systemd/system"
--version="false" --work_dir="/tmp/Endpoint_SlaveEndpointTest_NoAuthorizer_0_4hvs4C"
I0828 21:46:29.288810  6641 credentials.hpp:86] Loading credential for authentication from
'/tmp/Endpoint_SlaveEndpointTest_NoAuthorizer_0_0XMkl8/credential'
I0828 21:46:29.288964  6641 slave.cpp:283] Agent using credential for: test-principal
I0828 21:46:29.288985  6641 credentials.hpp:37] Loading credentials for authentication from
'/tmp/Endpoint_SlaveEndpointTest_NoAuthorizer_0_0XMkl8/http_credentials'
I0828 21:46:29.289275  6641 http.cpp:1026] Creating default 'basic' HTTP authenticator for
realm 'mesos-agent-executor'
I0828 21:46:29.289378  6641 http.cpp:1047] Creating default 'jwt' HTTP authenticator for realm
'mesos-agent-executor'
I0828 21:46:29.289580  6641 http.cpp:1026] Creating default 'basic' HTTP authenticator for
realm 'mesos-agent-readonly'
I0828 21:46:29.289667  6641 http.cpp:1047] Creating default 'jwt' HTTP authenticator for realm
'mesos-agent-readonly'
I0828 21:46:29.289863  6641 http.cpp:1026] Creating default 'basic' HTTP authenticator for
realm 'mesos-agent-readwrite'
I0828 21:46:29.289957  6641 http.cpp:1047] Creating default 'jwt' HTTP authenticator for realm
'mesos-agent-readwrite'
I0828 21:46:29.291128  6641 slave.cpp:565] Agent resources: [{"name":"cpus","scalar":{"value":2.0},"type":"SCALAR"},{"name":"mem","scalar":{"value":1024.0},"type":"SCALAR"},{"name":"disk","scalar":{"value":1024.0},"type":"SCALAR"},{"name":"ports","ranges":{"range":[{"begin":31000,"end":32000}]},"type":"RANGES"}]
I0828 21:46:29.291296  6641 slave.cpp:573] Agent attributes: [  ]
I0828 21:46:29.291306  6641 slave.cpp:582] Agent hostname: c3ac1e6873d7
I0828 21:46:29.291425  6649 status_update_manager.cpp:177] Pausing sending status updates
I0828 21:46:29.292628  6643 state.cpp:64] Recovering state from '/tmp/Endpoint_SlaveEndpointTest_NoAuthorizer_0_4hvs4C/meta'
I0828 21:46:29.292845  6642 status_update_manager.cpp:203] Recovering status update manager
I0828 21:46:29.293020  6639 containerizer.cpp:609] Recovering containerizer
I0828 21:46:29.294406  6648 provisioner.cpp:416] Provisioner recovery complete
I0828 21:46:29.294823  6644 slave.cpp:6271] Finished recovery
I0828 21:46:29.295222  6644 slave.cpp:6453] Querying resource estimator for oversubscribable
resources
I0828 21:46:29.295408  6651 slave.cpp:6467] Received oversubscribable resources {} from the
resource estimator
I0828 21:46:29.297341  6649 process.cpp:3933] Handling HTTP event for process 'slave(803)'
with path: '/slave(803)/monitor/statistics'
I0828 21:46:29.299178  6642 http.cpp:1166] HTTP GET for /slave(803)/monitor/statistics from
172.17.0.4:46584
I0828 21:46:29.299253  6642 http.cpp:957] Authorizing principal 'test-principal' to GET the
'/monitor/statistics' endpoint
I0828 21:46:29.302750  6646 slave.cpp:843] Agent terminating
[       OK ] Endpoint/SlaveEndpointTest.NoAuthorizer/0 (32 ms)
[ RUN      ] Endpoint/SlaveEndpointTest.NoAuthorizer/1
I0828 21:46:29.316845   950 containerizer.cpp:246] Using isolation: posix/cpu,posix/mem,filesystem/posix,network/cni,environment_secret
W0828 21:46:29.317492   950 backend.cpp:76] Failed to create 'aufs' backend: AufsBackend requires
root privileges
W0828 21:46:29.317629   950 backend.cpp:76] Failed to create 'bind' backend: BindBackend requires
root privileges
I0828 21:46:29.317675   950 provisioner.cpp:255] Using default backend 'copy'
I0828 21:46:29.319818   950 cluster.cpp:448] Creating default 'local' authorizer
I0828 21:46:29.321450  6648 slave.cpp:250] Mesos agent started on (804)@172.17.0.4:46775
I0828 21:46:29.321470  6648 slave.cpp:251] Flags at startup: --acls="" --appc_simple_discovery_uri_prefix="http://"
--appc_store_dir="/tmp/Endpoint_SlaveEndpointTest_NoAuthorizer_1_UQN6I9/store/appc" --authenticate_http_executors="true"
--authenticate_http_readonly="true" --authenticate_http_readwrite="true" --authenticatee="crammd5"
--authentication_backoff_factor="1secs" --authorizer="local" --cgroups_cpu_enable_pids_and_tids_count="false"
--cgroups_enable_cfs="false" --cgroups_hierarchy="/sys/fs/cgroup" --cgroups_limit_swap="false"
--cgroups_root="mesos" --container_disk_watch_interval="15secs" --containerizers="mesos" --credential="/tmp/Endpoint_SlaveEndpointTest_NoAuthorizer_1_UQN6I9/credential"
--default_role="*" --disallow_sharing_agent_pid_namespace="false" --disk_watch_interval="1mins"
--docker="docker" --docker_kill_orphans="true" --docker_registry="https://registry-1.docker.io"
--docker_remove_delay="6hrs" --docker_socket="/var/run/docker.sock" --docker_stop_timeout="0ns"
--docker_store_dir="/tmp/Endpoint_SlaveEndpointTest_NoAuthorizer_1_UQN6I9/store/docker" --docker_volume_checkpoint_dir="/var/run/mesos/isolators/docker/volume"
--enforce_container_disk_quota="false" --executor_registration_timeout="1mins" --executor_reregistration_timeout="2secs"
--executor_secret_key="/tmp/Endpoint_SlaveEndpointTest_NoAuthorizer_1_UQN6I9/executor_secret_key"
--executor_shutdown_grace_period="5secs" --fetcher_cache_dir="/tmp/Endpoint_SlaveEndpointTest_NoAuthorizer_1_UQN6I9/fetch"
--fetcher_cache_size="2GB" --frameworks_home="" --gc_delay="1weeks" --gc_disk_headroom="0.1"
--hadoop_home="" --help="false" --hostname_lookup="true" --http_command_executor="false" --http_credentials="/tmp/Endpoint_SlaveEndpointTest_NoAuthorizer_1_UQN6I9/http_credentials"
--http_heartbeat_interval="30secs" --initialize_driver_logging="true" --isolation="posix/cpu,posix/mem"
--launcher="posix" --launcher_dir="/mesos/build/src" --logbufsecs="0" --logging_level="INFO"
--max_completed_executors_per_framework="150" --oversubscribed_resources_interval="15secs"
--perf_duration="10secs" --perf_interval="1mins" --port="5051" --qos_correction_interval_min="0ns"
--quiet="false" --recover="reconnect" --recovery_timeout="15mins" --registration_backoff_factor="10ms"
--resources="cpus:2;gpus:0;mem:1024;disk:1024;ports:[31000-32000]" --revocable_cpu_low_priority="true"
--runtime_dir="/tmp/Endpoint_SlaveEndpointTest_NoAuthorizer_1_UQN6I9" --sandbox_directory="/mnt/mesos/sandbox"
--strict="true" --switch_user="true" --systemd_enable_support="true" --systemd_runtime_directory="/run/systemd/system"
--version="false" --work_dir="/tmp/Endpoint_SlaveEndpointTest_NoAuthorizer_1_0xNPmE"
I0828 21:46:29.321976  6648 credentials.hpp:86] Loading credential for authentication from
'/tmp/Endpoint_SlaveEndpointTest_NoAuthorizer_1_UQN6I9/credential'
I0828 21:46:29.322171  6648 slave.cpp:283] Agent using credential for: test-principal
I0828 21:46:29.322223  6648 credentials.hpp:37] Loading credentials for authentication from
'/tmp/Endpoint_SlaveEndpointTest_NoAuthorizer_1_UQN6I9/http_credentials'
I0828 21:46:29.322676  6648 http.cpp:1026] Creating default 'basic' HTTP authenticator for
realm 'mesos-agent-executor'
I0828 21:46:29.322835  6648 http.cpp:1047] Creating default 'jwt' HTTP authenticator for realm
'mesos-agent-executor'
I0828 21:46:29.323144  6648 http.cpp:1026] Creating default 'basic' HTTP authenticator for
realm 'mesos-agent-readonly'
I0828 21:46:29.323282  6648 http.cpp:1047] Creating default 'jwt' HTTP authenticator for realm
'mesos-agent-readonly'
I0828 21:46:29.323498  6648 http.cpp:1026] Creating default 'basic' HTTP authenticator for
realm 'mesos-agent-readwrite'
I0828 21:46:29.323638  6648 http.cpp:1047] Creating default 'jwt' HTTP authenticator for realm
'mesos-agent-readwrite'
I0828 21:46:29.325281  6648 slave.cpp:565] Agent resources: [{"name":"cpus","scalar":{"value":2.0},"type":"SCALAR"},{"name":"mem","scalar":{"value":1024.0},"type":"SCALAR"},{"name":"disk","scalar":{"value":1024.0},"type":"SCALAR"},{"name":"ports","ranges":{"range":[{"begin":31000,"end":32000}]},"type":"RANGES"}]
I0828 21:46:29.325526  6648 slave.cpp:573] Agent attributes: [  ]
I0828 21:46:29.325537  6648 slave.cpp:582] Agent hostname: c3ac1e6873d7
I0828 21:46:29.325745  6652 status_update_manager.cpp:177] Pausing sending status updates
I0828 21:46:29.327332  6638 state.cpp:64] Recovering state from '/tmp/Endpoint_SlaveEndpointTest_NoAuthorizer_1_0xNPmE/meta'
I0828 21:46:29.327636  6643 status_update_manager.cpp:203] Recovering status update manager
I0828 21:46:29.327863  6639 containerizer.cpp:609] Recovering containerizer
I0828 21:46:29.329418  6641 provisioner.cpp:416] Provisioner recovery complete
I0828 21:46:29.329798  6645 slave.cpp:6271] Finished recovery
I0828 21:46:29.330195  6645 slave.cpp:6453] Querying resource estimator for oversubscribable
resources
I0828 21:46:29.330384  6644 slave.cpp:6467] Received oversubscribable resources {} from the
resource estimator
I0828 21:46:29.335871  6648 process.cpp:3933] Handling HTTP event for process 'slave(804)'
with path: '/slave(804)/monitor/statistics.json'
I0828 21:46:29.337851  6643 http.cpp:1166] HTTP GET for /slave(804)/monitor/statistics.json
from 172.17.0.4:46585
I0828 21:46:29.337924  6643 http.cpp:957] Authorizing principal 'test-principal' to GET the
'/monitor/statistics.json' endpoint
I0828 21:46:29.341065  6642 slave.cpp:843] Agent terminating
[       OK ] Endpoint/SlaveEndpointTest.NoAuthorizer/1 (38 ms)
[ RUN      ] Endpoint/SlaveEndpointTest.NoAuthorizer/2
I0828 21:46:29.355406   950 containerizer.cpp:246] Using isolation: posix/cpu,posix/mem,filesystem/posix,network/cni,environment_secret
W0828 21:46:29.356006   950 backend.cpp:76] Failed to create 'aufs' backend: AufsBackend requires
root privileges
W0828 21:46:29.356170   950 backend.cpp:76] Failed to create 'bind' backend: BindBackend requires
root privileges
I0828 21:46:29.356202   950 provisioner.cpp:255] Using default backend 'copy'
I0828 21:46:29.357810   950 cluster.cpp:448] Creating default 'local' authorizer
I0828 21:46:29.359442  6644 slave.cpp:250] Mesos agent started on (805)@172.17.0.4:46775
I0828 21:46:29.359462  6644 slave.cpp:251] Flags at startup: --acls="" --appc_simple_discovery_uri_prefix="http://"
--appc_store_dir="/tmp/Endpoint_SlaveEndpointTest_NoAuthorizer_2_erLnvb/store/appc" --authenticate_http_executors="true"
--authenticate_http_readonly="true" --authenticate_http_readwrite="true" --authenticatee="crammd5"
--authentication_backoff_factor="1secs" --authorizer="local" --cgroups_cpu_enable_pids_and_tids_count="false"
--cgroups_enable_cfs="false" --cgroups_hierarchy="/sys/fs/cgroup" --cgroups_limit_swap="false"
--cgroups_root="mesos" --container_disk_watch_interval="15secs" --containerizers="mesos" --credential="/tmp/Endpoint_SlaveEndpointTest_NoAuthorizer_2_erLnvb/credential"
--default_role="*" --disallow_sharing_agent_pid_namespace="false" --disk_watch_interval="1mins"
--docker="docker" --docker_kill_orphans="true" --docker_registry="https://registry-1.docker.io"
--docker_remove_delay="6hrs" --docker_socket="/var/run/docker.sock" --docker_stop_timeout="0ns"
--docker_store_dir="/tmp/Endpoint_SlaveEndpointTest_NoAuthorizer_2_erLnvb/store/docker" --docker_volume_checkpoint_dir="/var/run/mesos/isolators/docker/volume"
--enforce_container_disk_quota="false" --executor_registration_timeout="1mins" --executor_reregistration_timeout="2secs"
--executor_secret_key="/tmp/Endpoint_SlaveEndpointTest_NoAuthorizer_2_erLnvb/executor_secret_key"
--executor_shutdown_grace_period="5secs" --fetcher_cache_dir="/tmp/Endpoint_SlaveEndpointTest_NoAuthorizer_2_erLnvb/fetch"
--fetcher_cache_size="2GB" --frameworks_home="" --gc_delay="1weeks" --gc_disk_headroom="0.1"
--hadoop_home="" --help="false" --hostname_lookup="true" --http_command_executor="false" --http_credentials="/tmp/Endpoint_SlaveEndpointTest_NoAuthorizer_2_erLnvb/http_credentials"
--http_heartbeat_interval="30secs" --initialize_driver_logging="true" --isolation="posix/cpu,posix/mem"
--launcher="posix" --launcher_dir="/mesos/build/src" --logbufsecs="0" --logging_level="INFO"
--max_completed_executors_per_framework="150" --oversubscribed_resources_interval="15secs"
--perf_duration="10secs" --perf_interval="1mins" --port="5051" --qos_correction_interval_min="0ns"
--quiet="false" --recover="reconnect" --recovery_timeout="15mins" --registration_backoff_factor="10ms"
--resources="cpus:2;gpus:0;mem:1024;disk:1024;ports:[31000-32000]" --revocable_cpu_low_priority="true"
--runtime_dir="/tmp/Endpoint_SlaveEndpointTest_NoAuthorizer_2_erLnvb" --sandbox_directory="/mnt/mesos/sandbox"
--strict="true" --switch_user="true" --systemd_enable_support="true" --systemd_runtime_directory="/run/systemd/system"
--version="false" --work_dir="/tmp/Endpoint_SlaveEndpointTest_NoAuthorizer_2_Y0nQ2F"
I0828 21:46:29.359999  6644 credentials.hpp:86] Loading credential for authentication from
'/tmp/Endpoint_SlaveEndpointTest_NoAuthorizer_2_erLnvb/credential'
I0828 21:46:29.360260  6644 slave.cpp:283] Agent using credential for: test-principal
I0828 21:46:29.360288  6644 credentials.hpp:37] Loading credentials for authentication from
'/tmp/Endpoint_SlaveEndpointTest_NoAuthorizer_2_erLnvb/http_credentials'
I0828 21:46:29.360716  6644 http.cpp:1026] Creating default 'basic' HTTP authenticator for
realm 'mesos-agent-executor'
I0828 21:46:29.360874  6644 http.cpp:1047] Creating default 'jwt' HTTP authenticator for realm
'mesos-agent-executor'
I0828 21:46:29.361166  6644 http.cpp:1026] Creating default 'basic' HTTP authenticator for
realm 'mesos-agent-readonly'
I0828 21:46:29.361299  6644 http.cpp:1047] Creating default 'jwt' HTTP authenticator for realm
'mesos-agent-readonly'
I0828 21:46:29.361466  6644 http.cpp:1026] Creating default 'basic' HTTP authenticator for
realm 'mesos-agent-readwrite'
I0828 21:46:29.361553  6644 http.cpp:1047] Creating default 'jwt' HTTP authenticator for realm
'mesos-agent-readwrite'
I0828 21:46:29.362746  6644 slave.cpp:565] Agent resources: [{"name":"cpus","scalar":{"value":2.0},"type":"SCALAR"},{"name":"mem","scalar":{"value":1024.0},"type":"SCALAR"},{"name":"disk","scalar":{"value":1024.0},"type":"SCALAR"},{"name":"ports","ranges":{"range":[{"begin":31000,"end":32000}]},"type":"RANGES"}]
I0828 21:46:29.362924  6644 slave.cpp:573] Agent attributes: [  ]
I0828 21:46:29.362933  6644 slave.cpp:582] Agent hostname: c3ac1e6873d7
I0828 21:46:29.363054  6637 status_update_manager.cpp:177] Pausing sending status updates
I0828 21:46:29.364193  6643 state.cpp:64] Recovering state from '/tmp/Endpoint_SlaveEndpointTest_NoAuthorizer_2_Y0nQ2F/meta'
I0828 21:46:29.364514  6652 status_update_manager.cpp:203] Recovering status update manager
I0828 21:46:29.364687  6647 containerizer.cpp:609] Recovering containerizer
I0828 21:46:29.365943  6652 provisioner.cpp:416] Provisioner recovery complete
I0828 21:46:29.366303  6642 slave.cpp:6271] Finished recovery
I0828 21:46:29.366803  6642 slave.cpp:6453] Querying resource estimator for oversubscribable
resources
I0828 21:46:29.367030  6649 slave.cpp:6467] Received oversubscribable resources {} from the
resource estimator
I0828 21:46:29.368841  6652 process.cpp:3933] Handling HTTP event for process 'slave(805)'
with path: '/slave(805)/containers'
I0828 21:46:29.370666  6648 http.cpp:1166] HTTP GET for /slave(805)/containers from 172.17.0.4:46586
I0828 21:46:29.370743  6648 http.cpp:957] Authorizing principal 'test-principal' to GET the
'/containers' endpoint
I0828 21:46:29.374498  6638 slave.cpp:843] Agent terminating
[       OK ] Endpoint/SlaveEndpointTest.NoAuthorizer/2 (32 ms)
[----------] 9 tests from Endpoint/SlaveEndpointTest (303 ms total)

[----------] Global test environment tear-down
[==========] 1609 tests from 176 test cases ran. (278623 ms total)
[  PASSED  ] 1608 tests.
[  FAILED  ] 1 test, listed below:
[  FAILED  ] DefaultExecutorCheckTest.HTTPCheckDelivered

 1 FAILED TEST
  YOU HAVE 20 DISABLED TESTS

I0828 21:46:29.440249  6653 process.cpp:1072] Failed to accept socket: future discarded
make[3]: *** [CMakeFiles/check] Error 1
make[3]: Leaving directory `/mesos/build'
make[2]: *** [CMakeFiles/check.dir/all] Error 2
make[2]: Leaving directory `/mesos/build'
make[1]: *** [CMakeFiles/check.dir/rule] Error 2
make[1]: Leaving directory `/mesos/build'
make: *** [check] Error 2
+ docker rmi mesos-1503953997-13308
Untagged: mesos-1503953997-13308:latest
Deleted: sha256:ff903e32ed221f7a84ad47b124112f636e2f6a095e062f2b346a5cb151c9868d
Deleted: sha256:212e7aef2ff1737e1ab6414d68352fe748e30bccb994784842839172fd35b7b7
Deleted: sha256:ee17989a707661e963909874ed74f702a10da64a67ea8f4b1a801c7309d2b324
Deleted: sha256:278c74c4d0fe26724fc92b049b1c91af2c043df3b2610b1ff62e970a2620d3fe
Deleted: sha256:5b9b83f66e8aed375d7c7f0740a6b714ab93bcffcbf8605abbcb414d3b959484
Deleted: sha256:a0782d18cd9224c4abbbbb830ec8d62034cd80e4da96b852f28c34c6ef686c21
Deleted: sha256:d35cfec5f9318130c6a1f0913820186903ad9c8a065a6646423a4d03fc47e017
Deleted: sha256:31bb29866867bc3fae621ef471b0b9b5fee7b3c2d41aaf67ad2932889b84ca2f
Deleted: sha256:06126948fff1e3927223b06ca9b25dd7754200687feade56ff24c1adefe9cac6
Deleted: sha256:cfa10e5d8d02a11dad1f6a129bb9399be9e9236e1f7b96037f9d7d644cbbebf6
Deleted: sha256:44a0fa5107dccf66857d046ef7a5eefa50b78274897b087515d0b2c72df2e8ff
Deleted: sha256:b23439b04e7bcf41793566b5eee80f84b3dfa8e86c5cdf161252e2cc123b801c
Deleted: sha256:a84e616c941fee7830de6687a4349000444efc41a345337e1100d3f1807d3ec8
Deleted: sha256:a2f544a8a5b3f877e275778a30028a9b034999ec9347b8f1fb00953b688862ea
Deleted: sha256:335358498c7ad4bfa45b2ac52da0f4d86e8303a681101aafb3b2b5388bba26fe
Deleted: sha256:c4dfaa0d3b12e09f452326e6a6758505249a7da14e8019a1f8b9b9d02813804a
Deleted: sha256:ce015c244bfd153c1349d4f2301c988ec1bf596157732b95c988fdd847c94d35
Deleted: sha256:656e856b3236855d77d9361466ca1cd0f2aa379791c0480246be38b47470a4af
Deleted: sha256:4ce033788cba2ab984e4138b4e692929b8e7f98b9f4e21a51a021a57f01ba8a8
Deleted: sha256:54797aa2fce74ea71e02111c83e0e2e195f5c7898ee15129eef908413943efec
Deleted: sha256:0568de158b5022c4fdd6e9d3838b1e277c6c8d04e42a8db10ab22f1d923e17b4
Deleted: sha256:55756e06203ee36cbf82558c838e83d74e48c5266fbb1cf34f3d4d9551fc996b
Deleted: sha256:6483d82442a6f1b0b096fcfd2dfbaa1d09a7c8083cb4436a7ac5dbf98a4421ed
Deleted: sha256:3b8fdf4e9a354fc3400e14adafb914f20dfe3da18cb011922331632daed7de04
Deleted: sha256:6567818283c1e6a0aa57303a26d414adf29849c49e9403b999c6f3063c8610cc
Build step 'Execute shell' marked build as failure

Mime
View raw message