mesos-builds mailing list archives

Site index · List index
Message view « Date » · « Thread »
Top « Date » · « Thread »
From Apache Jenkins Server <jenk...@builds.apache.org>
Subject Build failed in Jenkins: Mesos-Buildbot » autotools,clang,--verbose --enable-libevent --enable-ssl,GLOG_v=1 MESOS_VERBOSE=1,ubuntu:14.04,(ubuntu)&&(!ubuntu-us1)&&(!ubuntu-eu2) #4134
Date Mon, 21 Aug 2017 18:56:23 GMT
See <https://builds.apache.org/job/Mesos-Buildbot/BUILDTOOL=autotools,COMPILER=clang,CONFIGURATION=--verbose%20--enable-libevent%20--enable-ssl,ENVIRONMENT=GLOG_v=1%20MESOS_VERBOSE=1,OS=ubuntu%3A14.04,label_exp=(ubuntu)&&(!ubuntu-us1)&&(!ubuntu-eu2)/4134/display/redirect?page=changes>

Changes:

[xujyan] Added MESOS-5116 to the CHANGELOG.

------------------------------------------
[...truncated 31.99 MB...]
W0821 18:56:16.990110  6770 backend.cpp:76] Failed to create 'aufs' backend: AufsBackend requires
root privileges
W0821 18:56:16.990219  6770 backend.cpp:76] Failed to create 'bind' backend: BindBackend requires
root privileges
I0821 18:56:16.990252  6770 provisioner.cpp:255] Using default backend 'copy'
I0821 18:56:16.993643 27487 slave.cpp:252] Mesos agent started on (808)@172.17.0.8:38570
I0821 18:56:16.993679 27487 slave.cpp:253] Flags at startup: --acls="" --appc_simple_discovery_uri_prefix="http://"
--appc_store_dir="/tmp/Endpoint_SlaveEndpointTest_UnauthorizedRequest_0_mvNhTm/store/appc"
--authenticate_http_executors="true" --authenticate_http_readonly="true" --authenticate_http_readwrite="true"
--authenticatee="crammd5" --authentication_backoff_factor="1secs" --authorizer="local" --cgroups_cpu_enable_pids_and_tids_count="false"
--cgroups_enable_cfs="false" --cgroups_hierarchy="/sys/fs/cgroup" --cgroups_limit_swap="false"
--cgroups_root="mesos" --container_disk_watch_interval="15secs" --containerizers="mesos" --credential="/tmp/Endpoint_SlaveEndpointTest_UnauthorizedRequest_0_mvNhTm/credential"
--default_role="*" --disallow_sharing_agent_pid_namespace="false" --disk_watch_interval="1mins"
--docker="docker" --docker_kill_orphans="true" --docker_registry="https://registry-1.docker.io"
--docker_remove_delay="6hrs" --docker_socket="/var/run/docker.sock" --docker_stop_timeout="0ns"
--docker_store_dir="/tmp/Endpoint_SlaveEndpointTest_UnauthorizedRequest_0_mvNhTm/store/docker"
--docker_volume_checkpoint_dir="/var/run/mesos/isolators/docker/volume" --enforce_container_disk_quota="false"
--executor_registration_timeout="1mins" --executor_reregistration_timeout="2secs" --executor_secret_key="/tmp/Endpoint_SlaveEndpointTest_UnauthorizedRequest_0_mvNhTm/executor_secret_key"
--executor_shutdown_grace_period="5secs" --fetcher_cache_dir="/tmp/Endpoint_SlaveEndpointTest_UnauthorizedRequest_0_mvNhTm/fetch"
--fetcher_cache_size="2GB" --frameworks_home="" --gc_delay="1weeks" --gc_disk_headroom="0.1"
--hadoop_home="" --help="false" --hostname_lookup="true" --http_command_executor="false" --http_credentials="/tmp/Endpoint_SlaveEndpointTest_UnauthorizedRequest_0_mvNhTm/http_credentials"
--http_heartbeat_interval="30secs" --initialize_driver_logging="true" --isolation="posix/cpu,posix/mem"
--launcher="posix" --launcher_dir="/mesos/mesos-1.5.0/_build/src" --logbufsecs="0" --logging_level="INFO"
--max_completed_executors_per_framework="150" --oversubscribed_resources_interval="15secs"
--perf_duration="10secs" --perf_interval="1mins" --port="5051" --qos_correction_interval_min="0ns"
--quiet="false" --recover="reconnect" --recovery_timeout="15mins" --registration_backoff_factor="10ms"
--resources="cpus:2;gpus:0;mem:1024;disk:1024;ports:[31000-32000]" --revocable_cpu_low_priority="true"
--runtime_dir="/tmp/Endpoint_SlaveEndpointTest_UnauthorizedRequest_0_mvNhTm" --sandbox_directory="/mnt/mesos/sandbox"
--strict="true" --switch_user="true" --systemd_enable_support="true" --systemd_runtime_directory="/run/systemd/system"
--version="false" --work_dir="/tmp/Endpoint_SlaveEndpointTest_UnauthorizedRequest_0_CkGrpR"
I0821 18:56:16.994094 27487 credentials.hpp:86] Loading credential for authentication from
'/tmp/Endpoint_SlaveEndpointTest_UnauthorizedRequest_0_mvNhTm/credential'
I0821 18:56:16.994246 27487 slave.cpp:285] Agent using credential for: test-principal
I0821 18:56:16.994268 27487 credentials.hpp:37] Loading credentials for authentication from
'/tmp/Endpoint_SlaveEndpointTest_UnauthorizedRequest_0_mvNhTm/http_credentials'
I0821 18:56:16.994588 27487 http.cpp:1026] Creating default 'basic' HTTP authenticator for
realm 'mesos-agent-executor'
I0821 18:56:16.994727 27487 http.cpp:1047] Creating default 'jwt' HTTP authenticator for realm
'mesos-agent-executor'
I0821 18:56:16.995005 27487 http.cpp:1026] Creating default 'basic' HTTP authenticator for
realm 'mesos-agent-readonly'
I0821 18:56:16.995111 27487 http.cpp:1047] Creating default 'jwt' HTTP authenticator for realm
'mesos-agent-readonly'
I0821 18:56:16.995342 27487 http.cpp:1026] Creating default 'basic' HTTP authenticator for
realm 'mesos-agent-readwrite'
I0821 18:56:16.995450 27487 http.cpp:1047] Creating default 'jwt' HTTP authenticator for realm
'mesos-agent-readwrite'
I0821 18:56:16.996986 27487 slave.cpp:581] Agent resources: [{"name":"cpus","scalar":{"value":2.0},"type":"SCALAR"},{"name":"mem","scalar":{"value":1024.0},"type":"SCALAR"},{"name":"disk","scalar":{"value":1024.0},"type":"SCALAR"},{"name":"ports","ranges":{"range":[{"begin":31000,"end":32000}]},"type":"RANGES"}]
I0821 18:56:16.997390 27487 slave.cpp:589] Agent attributes: [  ]
I0821 18:56:16.997426 27487 slave.cpp:598] Agent hostname: 50e32a07ff51
I0821 18:56:16.997578 27490 status_update_manager.cpp:177] Pausing sending status updates
I0821 18:56:16.999461 27492 state.cpp:64] Recovering state from '/tmp/Endpoint_SlaveEndpointTest_UnauthorizedRequest_0_CkGrpR/meta'
I0821 18:56:16.999812 27496 status_update_manager.cpp:203] Recovering status update manager
I0821 18:56:17.000001 27502 containerizer.cpp:609] Recovering containerizer
I0821 18:56:17.001238 27499 provisioner.cpp:416] Provisioner recovery complete
I0821 18:56:17.001632 27501 slave.cpp:6226] Finished recovery
I0821 18:56:17.002182 27501 slave.cpp:6408] Querying resource estimator for oversubscribable
resources
I0821 18:56:17.002388 27505 slave.cpp:6422] Received oversubscribable resources {} from the
resource estimator
I0821 18:56:17.004612 27498 process.cpp:3933] Handling HTTP event for process 'slave(808)'
with path: '/slave(808)/monitor/statistics'
I0821 18:56:17.006459 27492 http.cpp:1166] HTTP GET for /slave(808)/monitor/statistics from
172.17.0.8:46910
I0821 18:56:17.006587 27492 http.cpp:957] Authorizing principal 'test-principal' to GET the
'/monitor/statistics' endpoint
I0821 18:56:17.008523 27492 slave.cpp:859] Agent terminating
[       OK ] Endpoint/SlaveEndpointTest.UnauthorizedRequest/0 (29 ms)
[ RUN      ] Endpoint/SlaveEndpointTest.UnauthorizedRequest/1
I0821 18:56:17.019086  6770 containerizer.cpp:246] Using isolation: posix/cpu,posix/mem,filesystem/posix,network/cni,environment_secret
W0821 18:56:17.019590  6770 backend.cpp:76] Failed to create 'aufs' backend: AufsBackend requires
root privileges
W0821 18:56:17.019701  6770 backend.cpp:76] Failed to create 'bind' backend: BindBackend requires
root privileges
I0821 18:56:17.019734  6770 provisioner.cpp:255] Using default backend 'copy'
I0821 18:56:17.023152 27486 slave.cpp:252] Mesos agent started on (809)@172.17.0.8:38570
I0821 18:56:17.023187 27486 slave.cpp:253] Flags at startup: --acls="" --appc_simple_discovery_uri_prefix="http://"
--appc_store_dir="/tmp/Endpoint_SlaveEndpointTest_UnauthorizedRequest_1_ub5G3o/store/appc"
--authenticate_http_executors="true" --authenticate_http_readonly="true" --authenticate_http_readwrite="true"
--authenticatee="crammd5" --authentication_backoff_factor="1secs" --authorizer="local" --cgroups_cpu_enable_pids_and_tids_count="false"
--cgroups_enable_cfs="false" --cgroups_hierarchy="/sys/fs/cgroup" --cgroups_limit_swap="false"
--cgroups_root="mesos" --container_disk_watch_interval="15secs" --containerizers="mesos" --credential="/tmp/Endpoint_SlaveEndpointTest_UnauthorizedRequest_1_ub5G3o/credential"
--default_role="*" --disallow_sharing_agent_pid_namespace="false" --disk_watch_interval="1mins"
--docker="docker" --docker_kill_orphans="true" --docker_registry="https://registry-1.docker.io"
--docker_remove_delay="6hrs" --docker_socket="/var/run/docker.sock" --docker_stop_timeout="0ns"
--docker_store_dir="/tmp/Endpoint_SlaveEndpointTest_UnauthorizedRequest_1_ub5G3o/store/docker"
--docker_volume_checkpoint_dir="/var/run/mesos/isolators/docker/volume" --enforce_container_disk_quota="false"
--executor_registration_timeout="1mins" --executor_reregistration_timeout="2secs" --executor_secret_key="/tmp/Endpoint_SlaveEndpointTest_UnauthorizedRequest_1_ub5G3o/executor_secret_key"
--executor_shutdown_grace_period="5secs" --fetcher_cache_dir="/tmp/Endpoint_SlaveEndpointTest_UnauthorizedRequest_1_ub5G3o/fetch"
--fetcher_cache_size="2GB" --frameworks_home="" --gc_delay="1weeks" --gc_disk_headroom="0.1"
--hadoop_home="" --help="false" --hostname_lookup="true" --http_command_executor="false" --http_credentials="/tmp/Endpoint_SlaveEndpointTest_UnauthorizedRequest_1_ub5G3o/http_credentials"
--http_heartbeat_interval="30secs" --initialize_driver_logging="true" --isolation="posix/cpu,posix/mem"
--launcher="posix" --launcher_dir="/mesos/mesos-1.5.0/_build/src" --logbufsecs="0" --logging_level="INFO"
--max_completed_executors_per_framework="150" --oversubscribed_resources_interval="15secs"
--perf_duration="10secs" --perf_interval="1mins" --port="5051" --qos_correction_interval_min="0ns"
--quiet="false" --recover="reconnect" --recovery_timeout="15mins" --registration_backoff_factor="10ms"
--resources="cpus:2;gpus:0;mem:1024;disk:1024;ports:[31000-32000]" --revocable_cpu_low_priority="true"
--runtime_dir="/tmp/Endpoint_SlaveEndpointTest_UnauthorizedRequest_1_ub5G3o" --sandbox_directory="/mnt/mesos/sandbox"
--strict="true" --switch_user="true" --systemd_enable_support="true" --systemd_runtime_directory="/run/systemd/system"
--version="false" --work_dir="/tmp/Endpoint_SlaveEndpointTest_UnauthorizedRequest_1_0UnuvT"
I0821 18:56:17.023576 27486 credentials.hpp:86] Loading credential for authentication from
'/tmp/Endpoint_SlaveEndpointTest_UnauthorizedRequest_1_ub5G3o/credential'
I0821 18:56:17.023728 27486 slave.cpp:285] Agent using credential for: test-principal
I0821 18:56:17.023759 27486 credentials.hpp:37] Loading credentials for authentication from
'/tmp/Endpoint_SlaveEndpointTest_UnauthorizedRequest_1_ub5G3o/http_credentials'
I0821 18:56:17.024049 27486 http.cpp:1026] Creating default 'basic' HTTP authenticator for
realm 'mesos-agent-executor'
I0821 18:56:17.024171 27486 http.cpp:1047] Creating default 'jwt' HTTP authenticator for realm
'mesos-agent-executor'
I0821 18:56:17.024384 27486 http.cpp:1026] Creating default 'basic' HTTP authenticator for
realm 'mesos-agent-readonly'
I0821 18:56:17.024485 27486 http.cpp:1047] Creating default 'jwt' HTTP authenticator for realm
'mesos-agent-readonly'
I0821 18:56:17.024673 27486 http.cpp:1026] Creating default 'basic' HTTP authenticator for
realm 'mesos-agent-readwrite'
I0821 18:56:17.024776 27486 http.cpp:1047] Creating default 'jwt' HTTP authenticator for realm
'mesos-agent-readwrite'
I0821 18:56:17.026229 27486 slave.cpp:581] Agent resources: [{"name":"cpus","scalar":{"value":2.0},"type":"SCALAR"},{"name":"mem","scalar":{"value":1024.0},"type":"SCALAR"},{"name":"disk","scalar":{"value":1024.0},"type":"SCALAR"},{"name":"ports","ranges":{"range":[{"begin":31000,"end":32000}]},"type":"RANGES"}]
I0821 18:56:17.026446 27486 slave.cpp:589] Agent attributes: [  ]
I0821 18:56:17.026460 27486 slave.cpp:598] Agent hostname: 50e32a07ff51
I0821 18:56:17.026590 27498 status_update_manager.cpp:177] Pausing sending status updates
I0821 18:56:17.028003 27504 state.cpp:64] Recovering state from '/tmp/Endpoint_SlaveEndpointTest_UnauthorizedRequest_1_0UnuvT/meta'
I0821 18:56:17.028352 27492 status_update_manager.cpp:203] Recovering status update manager
I0821 18:56:17.028606 27488 containerizer.cpp:609] Recovering containerizer
I0821 18:56:17.029932 27496 provisioner.cpp:416] Provisioner recovery complete
I0821 18:56:17.030231 27486 slave.cpp:6226] Finished recovery
I0821 18:56:17.030689 27486 slave.cpp:6408] Querying resource estimator for oversubscribable
resources
I0821 18:56:17.030918 27494 slave.cpp:6422] Received oversubscribable resources {} from the
resource estimator
I0821 18:56:17.032817 27499 process.cpp:3933] Handling HTTP event for process 'slave(809)'
with path: '/slave(809)/monitor/statistics.json'
I0821 18:56:17.034483 27506 http.cpp:1166] HTTP GET for /slave(809)/monitor/statistics.json
from 172.17.0.8:46912
I0821 18:56:17.034562 27506 http.cpp:957] Authorizing principal 'test-principal' to GET the
'/monitor/statistics.json' endpoint
I0821 18:56:17.036025  6770 slave.cpp:859] Agent terminating
[       OK ] Endpoint/SlaveEndpointTest.UnauthorizedRequest/1 (28 ms)
[ RUN      ] Endpoint/SlaveEndpointTest.UnauthorizedRequest/2
I0821 18:56:17.046679  6770 containerizer.cpp:246] Using isolation: posix/cpu,posix/mem,filesystem/posix,network/cni,environment_secret
W0821 18:56:17.047186  6770 backend.cpp:76] Failed to create 'aufs' backend: AufsBackend requires
root privileges
W0821 18:56:17.047298  6770 backend.cpp:76] Failed to create 'bind' backend: BindBackend requires
root privileges
I0821 18:56:17.047333  6770 provisioner.cpp:255] Using default backend 'copy'
I0821 18:56:17.050798 27499 slave.cpp:252] Mesos agent started on (810)@172.17.0.8:38570
I0821 18:56:17.050832 27499 slave.cpp:253] Flags at startup: --acls="" --appc_simple_discovery_uri_prefix="http://"
--appc_store_dir="/tmp/Endpoint_SlaveEndpointTest_UnauthorizedRequest_2_WcILur/store/appc"
--authenticate_http_executors="true" --authenticate_http_readonly="true" --authenticate_http_readwrite="true"
--authenticatee="crammd5" --authentication_backoff_factor="1secs" --authorizer="local" --cgroups_cpu_enable_pids_and_tids_count="false"
--cgroups_enable_cfs="false" --cgroups_hierarchy="/sys/fs/cgroup" --cgroups_limit_swap="false"
--cgroups_root="mesos" --container_disk_watch_interval="15secs" --containerizers="mesos" --credential="/tmp/Endpoint_SlaveEndpointTest_UnauthorizedRequest_2_WcILur/credential"
--default_role="*" --disallow_sharing_agent_pid_namespace="false" --disk_watch_interval="1mins"
--docker="docker" --docker_kill_orphans="true" --docker_registry="https://registry-1.docker.io"
--docker_remove_delay="6hrs" --docker_socket="/var/run/docker.sock" --docker_stop_timeout="0ns"
--docker_store_dir="/tmp/Endpoint_SlaveEndpointTest_UnauthorizedRequest_2_WcILur/store/docker"
--docker_volume_checkpoint_dir="/var/run/mesos/isolators/docker/volume" --enforce_container_disk_quota="false"
--executor_registration_timeout="1mins" --executor_reregistration_timeout="2secs" --executor_secret_key="/tmp/Endpoint_SlaveEndpointTest_UnauthorizedRequest_2_WcILur/executor_secret_key"
--executor_shutdown_grace_period="5secs" --fetcher_cache_dir="/tmp/Endpoint_SlaveEndpointTest_UnauthorizedRequest_2_WcILur/fetch"
--fetcher_cache_size="2GB" --frameworks_home="" --gc_delay="1weeks" --gc_disk_headroom="0.1"
--hadoop_home="" --help="false" --hostname_lookup="true" --http_command_executor="false" --http_credentials="/tmp/Endpoint_SlaveEndpointTest_UnauthorizedRequest_2_WcILur/http_credentials"
--http_heartbeat_interval="30secs" --initialize_driver_logging="true" --isolation="posix/cpu,posix/mem"
--launcher="posix" --launcher_dir="/mesos/mesos-1.5.0/_build/src" --logbufsecs="0" --logging_level="INFO"
--max_completed_executors_per_framework="150" --oversubscribed_resources_interval="15secs"
--perf_duration="10secs" --perf_interval="1mins" --port="5051" --qos_correction_interval_min="0ns"
--quiet="false" --recover="reconnect" --recovery_timeout="15mins" --registration_backoff_factor="10ms"
--resources="cpus:2;gpus:0;mem:1024;disk:1024;ports:[31000-32000]" --revocable_cpu_low_priority="true"
--runtime_dir="/tmp/Endpoint_SlaveEndpointTest_UnauthorizedRequest_2_WcILur" --sandbox_directory="/mnt/mesos/sandbox"
--strict="true" --switch_user="true" --systemd_enable_support="true" --systemd_runtime_directory="/run/systemd/system"
--version="false" --work_dir="/tmp/Endpoint_SlaveEndpointTest_UnauthorizedRequest_2_aEcqSV"
I0821 18:56:17.051249 27499 credentials.hpp:86] Loading credential for authentication from
'/tmp/Endpoint_SlaveEndpointTest_UnauthorizedRequest_2_WcILur/credential'
I0821 18:56:17.051404 27499 slave.cpp:285] Agent using credential for: test-principal
I0821 18:56:17.051429 27499 credentials.hpp:37] Loading credentials for authentication from
'/tmp/Endpoint_SlaveEndpointTest_UnauthorizedRequest_2_WcILur/http_credentials'
I0821 18:56:17.051712 27499 http.cpp:1026] Creating default 'basic' HTTP authenticator for
realm 'mesos-agent-executor'
I0821 18:56:17.051829 27499 http.cpp:1047] Creating default 'jwt' HTTP authenticator for realm
'mesos-agent-executor'
I0821 18:56:17.052021 27499 http.cpp:1026] Creating default 'basic' HTTP authenticator for
realm 'mesos-agent-readonly'
I0821 18:56:17.052116 27499 http.cpp:1047] Creating default 'jwt' HTTP authenticator for realm
'mesos-agent-readonly'
I0821 18:56:17.052289 27499 http.cpp:1026] Creating default 'basic' HTTP authenticator for
realm 'mesos-agent-readwrite'
I0821 18:56:17.052386 27499 http.cpp:1047] Creating default 'jwt' HTTP authenticator for realm
'mesos-agent-readwrite'
I0821 18:56:17.053807 27499 slave.cpp:581] Agent resources: [{"name":"cpus","scalar":{"value":2.0},"type":"SCALAR"},{"name":"mem","scalar":{"value":1024.0},"type":"SCALAR"},{"name":"disk","scalar":{"value":1024.0},"type":"SCALAR"},{"name":"ports","ranges":{"range":[{"begin":31000,"end":32000}]},"type":"RANGES"}]
I0821 18:56:17.054023 27499 slave.cpp:589] Agent attributes: [  ]
I0821 18:56:17.054038 27499 slave.cpp:598] Agent hostname: 50e32a07ff51
I0821 18:56:17.054168 27488 status_update_manager.cpp:177] Pausing sending status updates
I0821 18:56:17.055619 27504 state.cpp:64] Recovering state from '/tmp/Endpoint_SlaveEndpointTest_UnauthorizedRequest_2_aEcqSV/meta'
I0821 18:56:17.055920 27489 status_update_manager.cpp:203] Recovering status update manager
I0821 18:56:17.056104 27484 containerizer.cpp:609] Recovering containerizer
I0821 18:56:17.057358 27487 provisioner.cpp:416] Provisioner recovery complete
I0821 18:56:17.057731 27499 slave.cpp:6226] Finished recovery
I0821 18:56:17.058190 27499 slave.cpp:6408] Querying resource estimator for oversubscribable
resources
I0821 18:56:17.058414 27502 slave.cpp:6422] Received oversubscribable resources {} from the
resource estimator
I0821 18:56:17.060202 27490 process.cpp:3933] Handling HTTP event for process 'slave(810)'
with path: '/slave(810)/containers'
I0821 18:56:17.061792 27489 http.cpp:1166] HTTP GET for /slave(810)/containers from 172.17.0.8:46914
I0821 18:56:17.061918 27489 http.cpp:957] Authorizing principal 'test-principal' to GET the
'/containers' endpoint
I0821 18:56:17.063594 27489 slave.cpp:859] Agent terminating
[       OK ] Endpoint/SlaveEndpointTest.UnauthorizedRequest/2 (27 ms)
[ RUN      ] Endpoint/SlaveEndpointTest.NoAuthorizer/0
I0821 18:56:17.076452  6770 containerizer.cpp:246] Using isolation: posix/cpu,posix/mem,filesystem/posix,network/cni,environment_secret
W0821 18:56:17.077020  6770 backend.cpp:76] Failed to create 'aufs' backend: AufsBackend requires
root privileges
W0821 18:56:17.077173  6770 backend.cpp:76] Failed to create 'bind' backend: BindBackend requires
root privileges
I0821 18:56:17.077208  6770 provisioner.cpp:255] Using default backend 'copy'
I0821 18:56:17.079236  6770 cluster.cpp:448] Creating default 'local' authorizer
I0821 18:56:17.081277 27499 slave.cpp:252] Mesos agent started on (811)@172.17.0.8:38570
I0821 18:56:17.081318 27499 slave.cpp:253] Flags at startup: --acls="" --appc_simple_discovery_uri_prefix="http://"
--appc_store_dir="/tmp/Endpoint_SlaveEndpointTest_NoAuthorizer_0_s8hNcu/store/appc" --authenticate_http_executors="true"
--authenticate_http_readonly="true" --authenticate_http_readwrite="true" --authenticatee="crammd5"
--authentication_backoff_factor="1secs" --authorizer="local" --cgroups_cpu_enable_pids_and_tids_count="false"
--cgroups_enable_cfs="false" --cgroups_hierarchy="/sys/fs/cgroup" --cgroups_limit_swap="false"
--cgroups_root="mesos" --container_disk_watch_interval="15secs" --containerizers="mesos" --credential="/tmp/Endpoint_SlaveEndpointTest_NoAuthorizer_0_s8hNcu/credential"
--default_role="*" --disallow_sharing_agent_pid_namespace="false" --disk_watch_interval="1mins"
--docker="docker" --docker_kill_orphans="true" --docker_registry="https://registry-1.docker.io"
--docker_remove_delay="6hrs" --docker_socket="/var/run/docker.sock" --docker_stop_timeout="0ns"
--docker_store_dir="/tmp/Endpoint_SlaveEndpointTest_NoAuthorizer_0_s8hNcu/store/docker" --docker_volume_checkpoint_dir="/var/run/mesos/isolators/docker/volume"
--enforce_container_disk_quota="false" --executor_registration_timeout="1mins" --executor_reregistration_timeout="2secs"
--executor_secret_key="/tmp/Endpoint_SlaveEndpointTest_NoAuthorizer_0_s8hNcu/executor_secret_key"
--executor_shutdown_grace_period="5secs" --fetcher_cache_dir="/tmp/Endpoint_SlaveEndpointTest_NoAuthorizer_0_s8hNcu/fetch"
--fetcher_cache_size="2GB" --frameworks_home="" --gc_delay="1weeks" --gc_disk_headroom="0.1"
--hadoop_home="" --help="false" --hostname_lookup="true" --http_command_executor="false" --http_credentials="/tmp/Endpoint_SlaveEndpointTest_NoAuthorizer_0_s8hNcu/http_credentials"
--http_heartbeat_interval="30secs" --initialize_driver_logging="true" --isolation="posix/cpu,posix/mem"
--launcher="posix" --launcher_dir="/mesos/mesos-1.5.0/_build/src" --logbufsecs="0" --logging_level="INFO"
--max_completed_executors_per_framework="150" --oversubscribed_resources_interval="15secs"
--perf_duration="10secs" --perf_interval="1mins" --port="5051" --qos_correction_interval_min="0ns"
--quiet="false" --recover="reconnect" --recovery_timeout="15mins" --registration_backoff_factor="10ms"
--resources="cpus:2;gpus:0;mem:1024;disk:1024;ports:[31000-32000]" --revocable_cpu_low_priority="true"
--runtime_dir="/tmp/Endpoint_SlaveEndpointTest_NoAuthorizer_0_s8hNcu" --sandbox_directory="/mnt/mesos/sandbox"
--strict="true" --switch_user="true" --systemd_enable_support="true" --systemd_runtime_directory="/run/systemd/system"
--version="false" --work_dir="/tmp/Endpoint_SlaveEndpointTest_NoAuthorizer_0_bY45vY"
I0821 18:56:17.081735 27499 credentials.hpp:86] Loading credential for authentication from
'/tmp/Endpoint_SlaveEndpointTest_NoAuthorizer_0_s8hNcu/credential'
I0821 18:56:17.081895 27499 slave.cpp:285] Agent using credential for: test-principal
I0821 18:56:17.081926 27499 credentials.hpp:37] Loading credentials for authentication from
'/tmp/Endpoint_SlaveEndpointTest_NoAuthorizer_0_s8hNcu/http_credentials'
I0821 18:56:17.082231 27499 http.cpp:1026] Creating default 'basic' HTTP authenticator for
realm 'mesos-agent-executor'
I0821 18:56:17.082360 27499 http.cpp:1047] Creating default 'jwt' HTTP authenticator for realm
'mesos-agent-executor'
I0821 18:56:17.082589 27499 http.cpp:1026] Creating default 'basic' HTTP authenticator for
realm 'mesos-agent-readonly'
I0821 18:56:17.082703 27499 http.cpp:1047] Creating default 'jwt' HTTP authenticator for realm
'mesos-agent-readonly'
I0821 18:56:17.082911 27499 http.cpp:1026] Creating default 'basic' HTTP authenticator for
realm 'mesos-agent-readwrite'
I0821 18:56:17.083012 27499 http.cpp:1047] Creating default 'jwt' HTTP authenticator for realm
'mesos-agent-readwrite'
I0821 18:56:17.084404 27499 slave.cpp:581] Agent resources: [{"name":"cpus","scalar":{"value":2.0},"type":"SCALAR"},{"name":"mem","scalar":{"value":1024.0},"type":"SCALAR"},{"name":"disk","scalar":{"value":1024.0},"type":"SCALAR"},{"name":"ports","ranges":{"range":[{"begin":31000,"end":32000}]},"type":"RANGES"}]
I0821 18:56:17.084620 27499 slave.cpp:589] Agent attributes: [  ]
I0821 18:56:17.084635 27499 slave.cpp:598] Agent hostname: 50e32a07ff51
I0821 18:56:17.084784 27506 status_update_manager.cpp:177] Pausing sending status updates
I0821 18:56:17.086200 27491 state.cpp:64] Recovering state from '/tmp/Endpoint_SlaveEndpointTest_NoAuthorizer_0_bY45vY/meta'
I0821 18:56:17.086577 27492 status_update_manager.cpp:203] Recovering status update manager
I0821 18:56:17.086856 27486 containerizer.cpp:609] Recovering containerizer
I0821 18:56:17.087997 27497 provisioner.cpp:416] Provisioner recovery complete
I0821 18:56:17.088366 27494 slave.cpp:6226] Finished recovery
I0821 18:56:17.088816 27494 slave.cpp:6408] Querying resource estimator for oversubscribable
resources
I0821 18:56:17.089064 27493 slave.cpp:6422] Received oversubscribable resources {} from the
resource estimator
I0821 18:56:17.090921 27506 process.cpp:3933] Handling HTTP event for process 'slave(811)'
with path: '/slave(811)/monitor/statistics'
I0821 18:56:17.092476 27489 http.cpp:1166] HTTP GET for /slave(811)/monitor/statistics from
172.17.0.8:46916
I0821 18:56:17.092593 27489 http.cpp:957] Authorizing principal 'test-principal' to GET the
'/monitor/statistics' endpoint
I0821 18:56:17.095683  6770 slave.cpp:859] Agent terminating
[       OK ] Endpoint/SlaveEndpointTest.NoAuthorizer/0 (31 ms)
[ RUN      ] Endpoint/SlaveEndpointTest.NoAuthorizer/1
I0821 18:56:17.106230  6770 containerizer.cpp:246] Using isolation: posix/cpu,posix/mem,filesystem/posix,network/cni,environment_secret
W0821 18:56:17.106756  6770 backend.cpp:76] Failed to create 'aufs' backend: AufsBackend requires
root privileges
W0821 18:56:17.106886  6770 backend.cpp:76] Failed to create 'bind' backend: BindBackend requires
root privileges
I0821 18:56:17.106931  6770 provisioner.cpp:255] Using default backend 'copy'
I0821 18:56:17.108666  6770 cluster.cpp:448] Creating default 'local' authorizer
I0821 18:56:17.110447 27502 slave.cpp:252] Mesos agent started on (812)@172.17.0.8:38570
I0821 18:56:17.110493 27502 slave.cpp:253] Flags at startup: --acls="" --appc_simple_discovery_uri_prefix="http://"
--appc_store_dir="/tmp/Endpoint_SlaveEndpointTest_NoAuthorizer_1_6Tj1cx/store/appc" --authenticate_http_executors="true"
--authenticate_http_readonly="true" --authenticate_http_readwrite="true" --authenticatee="crammd5"
--authentication_backoff_factor="1secs" --authorizer="local" --cgroups_cpu_enable_pids_and_tids_count="false"
--cgroups_enable_cfs="false" --cgroups_hierarchy="/sys/fs/cgroup" --cgroups_limit_swap="false"
--cgroups_root="mesos" --container_disk_watch_interval="15secs" --containerizers="mesos" --credential="/tmp/Endpoint_SlaveEndpointTest_NoAuthorizer_1_6Tj1cx/credential"
--default_role="*" --disallow_sharing_agent_pid_namespace="false" --disk_watch_interval="1mins"
--docker="docker" --docker_kill_orphans="true" --docker_registry="https://registry-1.docker.io"
--docker_remove_delay="6hrs" --docker_socket="/var/run/docker.sock" --docker_stop_timeout="0ns"
--docker_store_dir="/tmp/Endpoint_SlaveEndpointTest_NoAuthorizer_1_6Tj1cx/store/docker" --docker_volume_checkpoint_dir="/var/run/mesos/isolators/docker/volume"
--enforce_container_disk_quota="false" --executor_registration_timeout="1mins" --executor_reregistration_timeout="2secs"
--executor_secret_key="/tmp/Endpoint_SlaveEndpointTest_NoAuthorizer_1_6Tj1cx/executor_secret_key"
--executor_shutdown_grace_period="5secs" --fetcher_cache_dir="/tmp/Endpoint_SlaveEndpointTest_NoAuthorizer_1_6Tj1cx/fetch"
--fetcher_cache_size="2GB" --frameworks_home="" --gc_delay="1weeks" --gc_disk_headroom="0.1"
--hadoop_home="" --help="false" --hostname_lookup="true" --http_command_executor="false" --http_credentials="/tmp/Endpoint_SlaveEndpointTest_NoAuthorizer_1_6Tj1cx/http_credentials"
--http_heartbeat_interval="30secs" --initialize_driver_logging="true" --isolation="posix/cpu,posix/mem"
--launcher="posix" --launcher_dir="/mesos/mesos-1.5.0/_build/src" --logbufsecs="0" --logging_level="INFO"
--max_completed_executors_per_framework="150" --oversubscribed_resources_interval="15secs"
--perf_duration="10secs" --perf_interval="1mins" --port="5051" --qos_correction_interval_min="0ns"
--quiet="false" --recover="reconnect" --recovery_timeout="15mins" --registration_backoff_factor="10ms"
--resources="cpus:2;gpus:0;mem:1024;disk:1024;ports:[31000-32000]" --revocable_cpu_low_priority="true"
--runtime_dir="/tmp/Endpoint_SlaveEndpointTest_NoAuthorizer_1_6Tj1cx" --sandbox_directory="/mnt/mesos/sandbox"
--strict="true" --switch_user="true" --systemd_enable_support="true" --systemd_runtime_directory="/run/systemd/system"
--version="false" --work_dir="/tmp/Endpoint_SlaveEndpointTest_NoAuthorizer_1_SYnQr1"
I0821 18:56:17.110858 27502 credentials.hpp:86] Loading credential for authentication from
'/tmp/Endpoint_SlaveEndpointTest_NoAuthorizer_1_6Tj1cx/credential'
I0821 18:56:17.111002 27502 slave.cpp:285] Agent using credential for: test-principal
I0821 18:56:17.111026 27502 credentials.hpp:37] Loading credentials for authentication from
'/tmp/Endpoint_SlaveEndpointTest_NoAuthorizer_1_6Tj1cx/http_credentials'
I0821 18:56:17.111287 27502 http.cpp:1026] Creating default 'basic' HTTP authenticator for
realm 'mesos-agent-executor'
I0821 18:56:17.111414 27502 http.cpp:1047] Creating default 'jwt' HTTP authenticator for realm
'mesos-agent-executor'
I0821 18:56:17.111603 27502 http.cpp:1026] Creating default 'basic' HTTP authenticator for
realm 'mesos-agent-readonly'
I0821 18:56:17.111709 27502 http.cpp:1047] Creating default 'jwt' HTTP authenticator for realm
'mesos-agent-readonly'
I0821 18:56:17.111886 27502 http.cpp:1026] Creating default 'basic' HTTP authenticator for
realm 'mesos-agent-readwrite'
I0821 18:56:17.111985 27502 http.cpp:1047] Creating default 'jwt' HTTP authenticator for realm
'mesos-agent-readwrite'
I0821 18:56:17.113412 27502 slave.cpp:581] Agent resources: [{"name":"cpus","scalar":{"value":2.0},"type":"SCALAR"},{"name":"mem","scalar":{"value":1024.0},"type":"SCALAR"},{"name":"disk","scalar":{"value":1024.0},"type":"SCALAR"},{"name":"ports","ranges":{"range":[{"begin":31000,"end":32000}]},"type":"RANGES"}]
I0821 18:56:17.113639 27502 slave.cpp:589] Agent attributes: [  ]
I0821 18:56:17.113654 27502 slave.cpp:598] Agent hostname: 50e32a07ff51
I0821 18:56:17.113791 27503 status_update_manager.cpp:177] Pausing sending status updates
I0821 18:56:17.115216 27487 state.cpp:64] Recovering state from '/tmp/Endpoint_SlaveEndpointTest_NoAuthorizer_1_SYnQr1/meta'
I0821 18:56:17.115470 27498 status_update_manager.cpp:203] Recovering status update manager
I0821 18:56:17.115662 27504 containerizer.cpp:609] Recovering containerizer
I0821 18:56:17.117112 27493 provisioner.cpp:416] Provisioner recovery complete
I0821 18:56:17.117404 27500 slave.cpp:6226] Finished recovery
I0821 18:56:17.117816 27500 slave.cpp:6408] Querying resource estimator for oversubscribable
resources
I0821 18:56:17.118016 27501 slave.cpp:6422] Received oversubscribable resources {} from the
resource estimator
I0821 18:56:17.119882 27499 process.cpp:3933] Handling HTTP event for process 'slave(812)'
with path: '/slave(812)/monitor/statistics.json'
I0821 18:56:17.121495 27487 http.cpp:1166] HTTP GET for /slave(812)/monitor/statistics.json
from 172.17.0.8:46918
I0821 18:56:17.121620 27487 http.cpp:957] Authorizing principal 'test-principal' to GET the
'/monitor/statistics.json' endpoint
I0821 18:56:17.124297 27500 slave.cpp:859] Agent terminating
[       OK ] Endpoint/SlaveEndpointTest.NoAuthorizer/1 (29 ms)
[ RUN      ] Endpoint/SlaveEndpointTest.NoAuthorizer/2
I0821 18:56:17.135022  6770 containerizer.cpp:246] Using isolation: posix/cpu,posix/mem,filesystem/posix,network/cni,environment_secret
W0821 18:56:17.135515  6770 backend.cpp:76] Failed to create 'aufs' backend: AufsBackend requires
root privileges
W0821 18:56:17.135634  6770 backend.cpp:76] Failed to create 'bind' backend: BindBackend requires
root privileges
I0821 18:56:17.135674  6770 provisioner.cpp:255] Using default backend 'copy'
I0821 18:56:17.137459  6770 cluster.cpp:448] Creating default 'local' authorizer
I0821 18:56:17.139230 27501 slave.cpp:252] Mesos agent started on (813)@172.17.0.8:38570
I0821 18:56:17.139273 27501 slave.cpp:253] Flags at startup: --acls="" --appc_simple_discovery_uri_prefix="http://"
--appc_store_dir="/tmp/Endpoint_SlaveEndpointTest_NoAuthorizer_2_WfRpuA/store/appc" --authenticate_http_executors="true"
--authenticate_http_readonly="true" --authenticate_http_readwrite="true" --authenticatee="crammd5"
--authentication_backoff_factor="1secs" --authorizer="local" --cgroups_cpu_enable_pids_and_tids_count="false"
--cgroups_enable_cfs="false" --cgroups_hierarchy="/sys/fs/cgroup" --cgroups_limit_swap="false"
--cgroups_root="mesos" --container_disk_watch_interval="15secs" --containerizers="mesos" --credential="/tmp/Endpoint_SlaveEndpointTest_NoAuthorizer_2_WfRpuA/credential"
--default_role="*" --disallow_sharing_agent_pid_namespace="false" --disk_watch_interval="1mins"
--docker="docker" --docker_kill_orphans="true" --docker_registry="https://registry-1.docker.io"
--docker_remove_delay="6hrs" --docker_socket="/var/run/docker.sock" --docker_stop_timeout="0ns"
--docker_store_dir="/tmp/Endpoint_SlaveEndpointTest_NoAuthorizer_2_WfRpuA/store/docker" --docker_volume_checkpoint_dir="/var/run/mesos/isolators/docker/volume"
--enforce_container_disk_quota="false" --executor_registration_timeout="1mins" --executor_reregistration_timeout="2secs"
--executor_secret_key="/tmp/Endpoint_SlaveEndpointTest_NoAuthorizer_2_WfRpuA/executor_secret_key"
--executor_shutdown_grace_period="5secs" --fetcher_cache_dir="/tmp/Endpoint_SlaveEndpointTest_NoAuthorizer_2_WfRpuA/fetch"
--fetcher_cache_size="2GB" --frameworks_home="" --gc_delay="1weeks" --gc_disk_headroom="0.1"
--hadoop_home="" --help="false" --hostname_lookup="true" --http_command_executor="false" --http_credentials="/tmp/Endpoint_SlaveEndpointTest_NoAuthorizer_2_WfRpuA/http_credentials"
--http_heartbeat_interval="30secs" --initialize_driver_logging="true" --isolation="posix/cpu,posix/mem"
--launcher="posix" --launcher_dir="/mesos/mesos-1.5.0/_build/src" --logbufsecs="0" --logging_level="INFO"
--max_completed_executors_per_framework="150" --oversubscribed_resources_interval="15secs"
--perf_duration="10secs" --perf_interval="1mins" --port="5051" --qos_correction_interval_min="0ns"
--quiet="false" --recover="reconnect" --recovery_timeout="15mins" --registration_backoff_factor="10ms"
--resources="cpus:2;gpus:0;mem:1024;disk:1024;ports:[31000-32000]" --revocable_cpu_low_priority="true"
--runtime_dir="/tmp/Endpoint_SlaveEndpointTest_NoAuthorizer_2_WfRpuA" --sandbox_directory="/mnt/mesos/sandbox"
--strict="true" --switch_user="true" --systemd_enable_support="true" --systemd_runtime_directory="/run/systemd/system"
--version="false" --work_dir="/tmp/Endpoint_SlaveEndpointTest_NoAuthorizer_2_qgxXE4"
I0821 18:56:17.139883 27501 credentials.hpp:86] Loading credential for authentication from
'/tmp/Endpoint_SlaveEndpointTest_NoAuthorizer_2_WfRpuA/credential'
I0821 18:56:17.140072 27501 slave.cpp:285] Agent using credential for: test-principal
I0821 18:56:17.140110 27501 credentials.hpp:37] Loading credentials for authentication from
'/tmp/Endpoint_SlaveEndpointTest_NoAuthorizer_2_WfRpuA/http_credentials'
I0821 18:56:17.140497 27501 http.cpp:1026] Creating default 'basic' HTTP authenticator for
realm 'mesos-agent-executor'
I0821 18:56:17.140617 27501 http.cpp:1047] Creating default 'jwt' HTTP authenticator for realm
'mesos-agent-executor'
I0821 18:56:17.140815 27501 http.cpp:1026] Creating default 'basic' HTTP authenticator for
realm 'mesos-agent-readonly'
I0821 18:56:17.140911 27501 http.cpp:1047] Creating default 'jwt' HTTP authenticator for realm
'mesos-agent-readonly'
I0821 18:56:17.141118 27501 http.cpp:1026] Creating default 'basic' HTTP authenticator for
realm 'mesos-agent-readwrite'
I0821 18:56:17.141216 27501 http.cpp:1047] Creating default 'jwt' HTTP authenticator for realm
'mesos-agent-readwrite'
I0821 18:56:17.142606 27501 slave.cpp:581] Agent resources: [{"name":"cpus","scalar":{"value":2.0},"type":"SCALAR"},{"name":"mem","scalar":{"value":1024.0},"type":"SCALAR"},{"name":"disk","scalar":{"value":1024.0},"type":"SCALAR"},{"name":"ports","ranges":{"range":[{"begin":31000,"end":32000}]},"type":"RANGES"}]
I0821 18:56:17.142818 27501 slave.cpp:589] Agent attributes: [  ]
I0821 18:56:17.142834 27501 slave.cpp:598] Agent hostname: 50e32a07ff51
I0821 18:56:17.142989 27487 status_update_manager.cpp:177] Pausing sending status updates
I0821 18:56:17.144371 27489 state.cpp:64] Recovering state from '/tmp/Endpoint_SlaveEndpointTest_NoAuthorizer_2_qgxXE4/meta'
I0821 18:56:17.144665 27486 status_update_manager.cpp:203] Recovering status update manager
I0821 18:56:17.144847 27500 containerizer.cpp:609] Recovering containerizer
I0821 18:56:17.146379 27504 provisioner.cpp:416] Provisioner recovery complete
I0821 18:56:17.146737 27501 slave.cpp:6226] Finished recovery
I0821 18:56:17.147178 27501 slave.cpp:6408] Querying resource estimator for oversubscribable
resources
I0821 18:56:17.147395 27503 slave.cpp:6422] Received oversubscribable resources {} from the
resource estimator
I0821 18:56:17.149230 27496 process.cpp:3933] Handling HTTP event for process 'slave(813)'
with path: '/slave(813)/containers'
I0821 18:56:17.150831 27483 http.cpp:1166] HTTP GET for /slave(813)/containers from 172.17.0.8:46920
I0821 18:56:17.150912 27483 http.cpp:957] Authorizing principal 'test-principal' to GET the
'/containers' endpoint
I0821 18:56:17.154600 27489 slave.cpp:859] Agent terminating
[       OK ] Endpoint/SlaveEndpointTest.NoAuthorizer/2 (31 ms)
[----------] 9 tests from Endpoint/SlaveEndpointTest (295 ms total)

[----------] 2 tests from ContainerizerType/DefaultContainerDNSFlagTest
[ RUN      ] ContainerizerType/DefaultContainerDNSFlagTest.ValidateFlag/0
[       OK ] ContainerizerType/DefaultContainerDNSFlagTest.ValidateFlag/0 (10 ms)
[ RUN      ] ContainerizerType/DefaultContainerDNSFlagTest.ValidateFlag/1
[       OK ] ContainerizerType/DefaultContainerDNSFlagTest.ValidateFlag/1 (10 ms)
[----------] 2 tests from ContainerizerType/DefaultContainerDNSFlagTest (20 ms total)

[----------] Global test environment tear-down
[==========] 1667 tests from 184 test cases ran. (482305 ms total)
[  PASSED  ] 1666 tests.
[  FAILED  ] 1 test, listed below:
[  FAILED  ] ExamplesTest.PersistentVolumeFramework

 1 FAILED TEST
  YOU HAVE 20 DISABLED TESTS

I0821 18:56:17.242746 27507 process.cpp:1072] Failed to accept socket: future discarded
make[4]: *** [check-local] Error 1
make[4]: Leaving directory `/mesos/mesos-1.5.0/_build/src'
make[3]: *** [check-am] Error 2
make[3]: Leaving directory `/mesos/mesos-1.5.0/_build/src'
make[2]: *** [check] Error 2
make[2]: Leaving directory `/mesos/mesos-1.5.0/_build/src'
make[1]: *** [check-recursive] Error 1
make[1]: Leaving directory `/mesos/mesos-1.5.0/_build'
make: *** [distcheck] Error 1
+ docker rmi mesos-1503338938-15489
Untagged: mesos-1503338938-15489:latest
Deleted: sha256:ee50c7f6f641ca5d21c2246502e8ddb3aac0ef455dfbda10c29135cb7a5f3ca1
Deleted: sha256:4643bd8d3b39e60856d0f3223ba42d7a34beca68b91c423de2993dec2621ef85
Deleted: sha256:e82d0c0604a33e15adbf8446fd60c56bbf9d8433069195be74ebef40f20d162c
Deleted: sha256:91ae00300642062fe8981efa322785d237d2e41e104a3cd358c53ede079b0084
Deleted: sha256:c8fbb3b667a13e2d527f36ffc2eb29a13d7bb4d29e0fd4d553aab26523cba588
Deleted: sha256:c90be24dcfd201035279b5f6fdc81a8eaf2efaf7a817b046606a0bd722166486
Deleted: sha256:3ed27d3503a26c94bdae2084ba058d6b5e7e2da2c9ef05de90e50d6284c19fe0
Deleted: sha256:b6b8d23a34abee259a7b9f31e8ae90819200cea88d733140d1ddf08cee6b8230
Deleted: sha256:ff82c3c73ea75d872b61ceeaf6cf4111f0566d2f174f27bc706054a33e198183
Deleted: sha256:8e4e25cce51dcc33e6ad128d323c76bab547250605db530947ed41b9be0631c0
Deleted: sha256:29c5848e5abc1733935afc806dada71a74fccde058517288d8b02868facb877e
Deleted: sha256:ac899e8e85e31ce5afc5a299647495d50bf16ea84590eda6fd289713fae21dc6
Deleted: sha256:1f083a9d1f5860749060870639692af8ccce5d710f63cc95959b597f302bf090
Deleted: sha256:f86c0a08e7e15e7d25bc5ec31d26455a1ac6d8526f3686d06150381e5318e73f
Deleted: sha256:a175678bbd45a1a60fdf8a1d12df71a0259e6adf8f4ce6e5494610bb5e898e57
Deleted: sha256:fa88d742ebb31b9419c409a36a51565b961487395f1c382217476afbc3b776a2
Deleted: sha256:f4955abffa16f5809af0d189acc298c2243bb39118af4859287dace8ff9d35df
Deleted: sha256:61664a612ad96a4efef09f29bd03244f3c5c299291f7985dee5a9f8db0cd3945
Deleted: sha256:ce425b9418849dbc108d75f4856427ccdaeffca63bc3fde4a6f7d642234049d2
Deleted: sha256:e9b891cb7a6ee25c09d45bc43198927a9f82ca1ba85d146fbb65a352dfaf3b47
Deleted: sha256:2475d351de3617afd401f9b4e7e03c6b80947b99549565313f54dfb30e8fd0f1
Deleted: sha256:7197cdbfa20e60cc47b2ca02e0c67d2590863ad44502487f2cd360d906002e2f
Deleted: sha256:02daf6b132ad5607cc52d540ca8963dc56be351b1f71d0e09e57a0c5f222f886
Deleted: sha256:b50c57c49492d73253815a58741a577d0fdbe6234cdbff4c0198b55a75890ede
Build step 'Execute shell' marked build as failure
Not sending mail to unregistered user xujyan@apple.com

Mime
View raw message