mesos-builds mailing list archives

Site index · List index
Message view « Date » · « Thread »
Top « Date » · « Thread »
From Apache Jenkins Server <jenk...@builds.apache.org>
Subject Build failed in Jenkins: Mesos-Reviewbot #18909
Date Fri, 18 Aug 2017 08:07:18 GMT
See <https://builds.apache.org/job/Mesos-Reviewbot/18909/display/redirect>

------------------------------------------
[...truncated 2.60 MB...]
reading manifest file 'src/mesos.interface.egg-info/SOURCES.txt'
writing manifest file 'src/mesos.interface.egg-info/SOURCES.txt'
installing library code to build/bdist.linux-x86_64/egg
creating build/bdist.linux-x86_64/wheel/mesos-1.5.0.dist-info/WHEEL
creating build/bdist.linux-x86_64/wheel/mesos.native-1.5.0.dist-info/WHEEL
running install_lib
running build_py
creating build/bdist.linux-x86_64/egg
creating build/bdist.linux-x86_64/egg/mesos
creating build/bdist.linux-x86_64/egg/mesos/interface
copying build/lib.linux-x86_64-2.7/mesos/interface/mesos_pb2.py -> build/bdist.linux-x86_64/egg/mesos/interface
copying build/lib.linux-x86_64-2.7/mesos/interface/__init__.py -> build/bdist.linux-x86_64/egg/mesos/interface
copying build/lib.linux-x86_64-2.7/mesos/__init__.py -> build/bdist.linux-x86_64/egg/mesos
byte-compiling build/bdist.linux-x86_64/egg/mesos/interface/mesos_pb2.py to mesos_pb2.pyc
byte-compiling build/bdist.linux-x86_64/egg/mesos/__init__.py to __init__.pyc
byte-compiling build/bdist.linux-x86_64/egg/mesos/executor/__init__.py to __init__.pyc
creating stub loader for mesos/executor/_executor.so
byte-compiling build/bdist.linux-x86_64/egg/mesos/executor/_executor.py to _executor.pyc
creating build/bdist.linux-x86_64/egg/EGG-INFO
copying src/mesos.executor.egg-info/PKG-INFO -> build/bdist.linux-x86_64/egg/EGG-INFO
copying src/mesos.executor.egg-info/SOURCES.txt -> build/bdist.linux-x86_64/egg/EGG-INFO
copying src/mesos.executor.egg-info/dependency_links.txt -> build/bdist.linux-x86_64/egg/EGG-INFO
copying src/mesos.executor.egg-info/namespace_packages.txt -> build/bdist.linux-x86_64/egg/EGG-INFO
copying src/mesos.executor.egg-info/requires.txt -> build/bdist.linux-x86_64/egg/EGG-INFO
copying src/mesos.executor.egg-info/top_level.txt -> build/bdist.linux-x86_64/egg/EGG-INFO
writing build/bdist.linux-x86_64/egg/EGG-INFO/native_libs.txt
zip_safe flag not set; analyzing archive contents...
mesos.__init__: module references __path__
creating '/mesos/mesos-1.5.0/_build/src/python/dist/mesos.executor-1.5.0-py2.7-linux-x86_64.egg' and adding 'build/bdist.linux-x86_64/egg' to it
byte-compiling build/bdist.linux-x86_64/egg/mesos/interface/__init__.py to __init__.pyc
byte-compiling build/bdist.linux-x86_64/egg/mesos/__init__.py to __init__.pyc
creating build/bdist.linux-x86_64/egg/EGG-INFO
copying src/mesos.interface.egg-info/PKG-INFO -> build/bdist.linux-x86_64/egg/EGG-INFO
copying src/mesos.interface.egg-info/SOURCES.txt -> build/bdist.linux-x86_64/egg/EGG-INFO
copying src/mesos.interface.egg-info/dependency_links.txt -> build/bdist.linux-x86_64/egg/EGG-INFO
copying src/mesos.interface.egg-info/namespace_packages.txt -> build/bdist.linux-x86_64/egg/EGG-INFO
copying src/mesos.interface.egg-info/requires.txt -> build/bdist.linux-x86_64/egg/EGG-INFO
copying src/mesos.interface.egg-info/top_level.txt -> build/bdist.linux-x86_64/egg/EGG-INFO
zip_safe flag not set; analyzing archive contents...
mesos.__init__: module references __path__
creating '/mesos/mesos-1.5.0/_build/src/python/dist/mesos.interface-1.5.0-py2.7.egg' and adding 'build/bdist.linux-x86_64/egg' to it
removing 'build/bdist.linux-x86_64/egg' (and everything under it)
running bdist_wheel
running build
installing to build/bdist.linux-x86_64/wheel
running install
running install_lib
Skipping installation of build/bdist.linux-x86_64/wheel/mesos/__init__.py (namespace package)
copying mesos/interface/mesos_pb2.py -> build/bdist.linux-x86_64/wheel/mesos/interface
copying mesos/interface/__init__.py -> build/bdist.linux-x86_64/wheel/mesos/interface
running install_egg_info
Copying src/mesos.interface.egg-info to build/bdist.linux-x86_64/wheel/mesos.interface-1.5.0-py2.7.egg-info
Installing build/bdist.linux-x86_64/wheel/mesos.interface-1.5.0-py2.7-nspkg.pth
running install_scripts
creating build/bdist.linux-x86_64/wheel/mesos.interface-1.5.0.dist-info/WHEEL
copying build/lib.linux-x86_64-2.7/mesos/scheduler/__init__.py -> build/bdist.linux-x86_64/egg/mesos/scheduler
copying build/lib.linux-x86_64-2.7/mesos/__init__.py -> build/bdist.linux-x86_64/egg/mesos
byte-compiling build/bdist.linux-x86_64/egg/mesos/scheduler/__init__.py to __init__.pyc
byte-compiling build/bdist.linux-x86_64/egg/mesos/__init__.py to __init__.pyc
creating stub loader for mesos/scheduler/_scheduler.so
byte-compiling build/bdist.linux-x86_64/egg/mesos/scheduler/_scheduler.py to _scheduler.pyc
creating build/bdist.linux-x86_64/egg/EGG-INFO
copying src/mesos.scheduler.egg-info/PKG-INFO -> build/bdist.linux-x86_64/egg/EGG-INFO
copying src/mesos.scheduler.egg-info/SOURCES.txt -> build/bdist.linux-x86_64/egg/EGG-INFO
copying src/mesos.scheduler.egg-info/dependency_links.txt -> build/bdist.linux-x86_64/egg/EGG-INFO
copying src/mesos.scheduler.egg-info/namespace_packages.txt -> build/bdist.linux-x86_64/egg/EGG-INFO
copying src/mesos.scheduler.egg-info/requires.txt -> build/bdist.linux-x86_64/egg/EGG-INFO
copying src/mesos.scheduler.egg-info/top_level.txt -> build/bdist.linux-x86_64/egg/EGG-INFO
writing build/bdist.linux-x86_64/egg/EGG-INFO/native_libs.txt
zip_safe flag not set; analyzing archive contents...
mesos.__init__: module references __path__
creating '/mesos/mesos-1.5.0/_build/src/python/dist/mesos.scheduler-1.5.0-py2.7-linux-x86_64.egg' and adding 'build/bdist.linux-x86_64/egg' to it
removing 'build/bdist.linux-x86_64/egg' (and everything under it)
running bdist_wheel
running build
installing to build/bdist.linux-x86_64/wheel
running install
running install_lib
Skipping installation of build/bdist.linux-x86_64/wheel/mesos/__init__.py (namespace package)
copying mesos/executor/__init__.py -> build/bdist.linux-x86_64/wheel/mesos/executor
copying mesos/executor/_executor.so -> build/bdist.linux-x86_64/wheel/mesos/executor
running install_egg_info
Copying src/mesos.executor.egg-info to build/bdist.linux-x86_64/wheel/mesos.executor-1.5.0-py2.7.egg-info
Installing build/bdist.linux-x86_64/wheel/mesos.executor-1.5.0-py2.7-nspkg.pth
running install_scripts
creating build/bdist.linux-x86_64/wheel/mesos.executor-1.5.0.dist-info/WHEEL
removing 'build/bdist.linux-x86_64/egg' (and everything under it)
running bdist_wheel
running build
installing to build/bdist.linux-x86_64/wheel
running install
running install_lib
Skipping installation of build/bdist.linux-x86_64/wheel/mesos/__init__.py (namespace package)
copying mesos/scheduler/_scheduler.so -> build/bdist.linux-x86_64/wheel/mesos/scheduler
copying mesos/scheduler/__init__.py -> build/bdist.linux-x86_64/wheel/mesos/scheduler
running install_egg_info
Copying src/mesos.scheduler.egg-info to build/bdist.linux-x86_64/wheel/mesos.scheduler-1.5.0-py2.7.egg-info
Installing build/bdist.linux-x86_64/wheel/mesos.scheduler-1.5.0-py2.7-nspkg.pth
running install_scripts
creating build/bdist.linux-x86_64/wheel/mesos.scheduler-1.5.0.dist-info/WHEEL
make  dynamic-reservation-framework test-http-framework test-framework test-executor test-http-executor long-lived-framework long-lived-executor no-executor-framework docker-no-executor-framework balloon-framework balloon-executor load-generator-framework persistent-volume-framework disk-full-framework test-helper mesos-tests examples/java/test-executor examples/java/test-exception-framework examples/java/test-framework examples/java/test-log examples/java/test-multiple-executors-framework examples/java/v1-test-framework examples/python/test_executor.py examples/python/test-executor examples/python/test_framework.py examples/python/test-framework \
	  tests/balloon_framework_test.sh tests/disk_full_framework_test.sh tests/dynamic_reservation_framework_test.sh tests/java_exception_test.sh tests/java_framework_test.sh tests/java_log_test.sh tests/java_v0_framework_test.sh tests/java_v1_framework_test.sh tests/no_executor_framework_test.sh tests/persistent_volume_framework_test.sh tests/python_framework_test.sh tests/test_http_framework_test.sh tests/test_framework_test.sh
make[4]: Entering directory `/mesos/mesos-1.5.0/_build/src'
g++ -DPACKAGE_NAME=\"mesos\" -DPACKAGE_TARNAME=\"mesos\" -DPACKAGE_VERSION=\"1.5.0\" -DPACKAGE_STRING=\"mesos\ 1.5.0\" -DPACKAGE_BUGREPORT=\"\" -DPACKAGE_URL=\"\" -DPACKAGE=\"mesos\" -DVERSION=\"1.5.0\" -DSTDC_HEADERS=1 -DHAVE_SYS_TYPES_H=1 -DHAVE_SYS_STAT_H=1 -DHAVE_STDLIB_H=1 -DHAVE_STRING_H=1 -DHAVE_MEMORY_H=1 -DHAVE_STRINGS_H=1 -DHAVE_INTTYPES_H=1 -DHAVE_STDINT_H=1 -DHAVE_UNISTD_H=1 -DHAVE_DLFCN_H=1 -DLT_OBJDIR=\".libs/\" -DHAVE_CXX11=1 -DHAVE_PTHREAD_PRIO_INHERIT=1 -DHAVE_PTHREAD=1 -DHAVE_FTS_H=1 -DHAVE_APR_POOLS_H=1 -DHAVE_LIBAPR_1=1 -DHAVE_LIBCURL=1 -DMESOS_HAS_JAVA=1 -DHAVE_LIBSASL2=1 -DHAVE_OPENSSL_SSL_H=1 -DHAVE_SVN_VERSION_H=1 -DHAVE_LIBSVN_SUBR_1=1 -DHAVE_SVN_DELTA_H=1 -DHAVE_LIBSVN_DELTA_1=1 -DHAVE_ZLIB_H=1 -DHAVE_LIBZ=1 -DHAVE_PYTHON=\"2.7\" -DMESOS_HAS_PYTHON=1 -I. -I../../src   -Werror -DLIBDIR=\"/mesos/mesos-1.5.0/_inst/lib\" -DPKGLIBEXECDIR=\"/mesos/mesos-1.5.0/_inst/libexec/mesos\" -DPKGDATADIR=\"/mesos/mesos-1.5.0/_inst/share/mesos\" -DPKGMODULEDIR=\"/mesos/mesos-1.5.0/_inst/lib/mesos/modules\" -I../../include -I../include -I../include/mesos -DPICOJSON_USE_INT64 -D__STDC_FORMAT_MACROS -isystem ../3rdparty/boost-1.53.0 -isystem ../3rdparty/concurrentqueue-1.0.0-beta -I../3rdparty/elfio-3.2 -I../3rdparty/glog-0.3.3/src -I../3rdparty/leveldb-1.19/include -I../../3rdparty/libprocess/include -I../3rdparty/nvml-352.79 -I../3rdparty/picojson-1.3.0 -I../3rdparty/protobuf-3.3.0/src -I../../3rdparty/stout/include -I../3rdparty/zookeeper-3.4.8/src/c/include -I../3rdparty/zookeeper-3.4.8/src/c/generated -DHAS_AUTHENTICATION=1 -isystem /usr/include/subversion-1 -isystem /usr/include/apr-1 -isystem /usr/include/apr-1.0	       -pthread -Wall -Wsign-compare -Wformat-security -fstack-protector -fPIC -fPIE -g1 -O0 -Wno-unused-local-typedefs -std=c++11 -MT examples/dynamic_reservation_framework-dynamic_reservation_framework.o -MD -MP -MF examples/.deps/dynamic_reservation_framework-dynamic_reservation_framework.Tpo -c -o examples/dynamic_reservation_framework-dynamic_reservation_framework.o `test -f 'examples/dynamic_reservation_framework.cpp' || echo '../../src/'`examples/dynamic_reservation_framework.cpp
g++ -DPACKAGE_NAME=\"mesos\" -DPACKAGE_TARNAME=\"mesos\" -DPACKAGE_VERSION=\"1.5.0\" -DPACKAGE_STRING=\"mesos\ 1.5.0\" -DPACKAGE_BUGREPORT=\"\" -DPACKAGE_URL=\"\" -DPACKAGE=\"mesos\" -DVERSION=\"1.5.0\" -DSTDC_HEADERS=1 -DHAVE_SYS_TYPES_H=1 -DHAVE_SYS_STAT_H=1 -DHAVE_STDLIB_H=1 -DHAVE_STRING_H=1 -DHAVE_MEMORY_H=1 -DHAVE_STRINGS_H=1 -DHAVE_INTTYPES_H=1 -DHAVE_STDINT_H=1 -DHAVE_UNISTD_H=1 -DHAVE_DLFCN_H=1 -DLT_OBJDIR=\".libs/\" -DHAVE_CXX11=1 -DHAVE_PTHREAD_PRIO_INHERIT=1 -DHAVE_PTHREAD=1 -DHAVE_FTS_H=1 -DHAVE_APR_POOLS_H=1 -DHAVE_LIBAPR_1=1 -DHAVE_LIBCURL=1 -DMESOS_HAS_JAVA=1 -DHAVE_LIBSASL2=1 -DHAVE_OPENSSL_SSL_H=1 -DHAVE_SVN_VERSION_H=1 -DHAVE_LIBSVN_SUBR_1=1 -DHAVE_SVN_DELTA_H=1 -DHAVE_LIBSVN_DELTA_1=1 -DHAVE_ZLIB_H=1 -DHAVE_LIBZ=1 -DHAVE_PYTHON=\"2.7\" -DMESOS_HAS_PYTHON=1 -I. -I../../src   -Werror -DLIBDIR=\"/mesos/mesos-1.5.0/_inst/lib\" -DPKGLIBEXECDIR=\"/mesos/mesos-1.5.0/_inst/libexec/mesos\" -DPKGDATADIR=\"/mesos/mesos-1.5.0/_inst/share/mesos\" -DPKGMODULEDIR=\"/mesos/mesos-1.5.0/_inst/lib/mesos/modules\" -I../../include -I../include -I../include/mesos -DPICOJSON_USE_INT64 -D__STDC_FORMAT_MACROS -isystem ../3rdparty/boost-1.53.0 -isystem ../3rdparty/concurrentqueue-1.0.0-beta -I../3rdparty/elfio-3.2 -I../3rdparty/glog-0.3.3/src -I../3rdparty/leveldb-1.19/include -I../../3rdparty/libprocess/include -I../3rdparty/nvml-352.79 -I../3rdparty/picojson-1.3.0 -I../3rdparty/protobuf-3.3.0/src -I../../3rdparty/stout/include -I../3rdparty/zookeeper-3.4.8/src/c/include -I../3rdparty/zookeeper-3.4.8/src/c/generated -DHAS_AUTHENTICATION=1 -isystem /usr/include/subversion-1 -isystem /usr/include/apr-1 -isystem /usr/include/apr-1.0	       -pthread -Wall -Wsign-compare -Wformat-security -fstack-protector -fPIC -fPIE -g1 -O0 -Wno-unused-local-typedefs -std=c++11 -MT examples/test_http_framework-test_http_framework.o -MD -MP -MF examples/.deps/test_http_framework-test_http_framework.Tpo -c -o examples/test_http_framework-test_http_framework.o `test -f 'examples/test_http_framework.cpp' || echo '../../src/'`examples/test_http_framework.cpp
g++ -DPACKAGE_NAME=\"mesos\" -DPACKAGE_TARNAME=\"mesos\" -DPACKAGE_VERSION=\"1.5.0\" -DPACKAGE_STRING=\"mesos\ 1.5.0\" -DPACKAGE_BUGREPORT=\"\" -DPACKAGE_URL=\"\" -DPACKAGE=\"mesos\" -DVERSION=\"1.5.0\" -DSTDC_HEADERS=1 -DHAVE_SYS_TYPES_H=1 -DHAVE_SYS_STAT_H=1 -DHAVE_STDLIB_H=1 -DHAVE_STRING_H=1 -DHAVE_MEMORY_H=1 -DHAVE_STRINGS_H=1 -DHAVE_INTTYPES_H=1 -DHAVE_STDINT_H=1 -DHAVE_UNISTD_H=1 -DHAVE_DLFCN_H=1 -DLT_OBJDIR=\".libs/\" -DHAVE_CXX11=1 -DHAVE_PTHREAD_PRIO_INHERIT=1 -DHAVE_PTHREAD=1 -DHAVE_FTS_H=1 -DHAVE_APR_POOLS_H=1 -DHAVE_LIBAPR_1=1 -DHAVE_LIBCURL=1 -DMESOS_HAS_JAVA=1 -DHAVE_LIBSASL2=1 -DHAVE_OPENSSL_SSL_H=1 -DHAVE_SVN_VERSION_H=1 -DHAVE_LIBSVN_SUBR_1=1 -DHAVE_SVN_DELTA_H=1 -DHAVE_LIBSVN_DELTA_1=1 -DHAVE_ZLIB_H=1 -DHAVE_LIBZ=1 -DHAVE_PYTHON=\"2.7\" -DMESOS_HAS_PYTHON=1 -I. -I../../src   -Werror -DLIBDIR=\"/mesos/mesos-1.5.0/_inst/lib\" -DPKGLIBEXECDIR=\"/mesos/mesos-1.5.0/_inst/libexec/mesos\" -DPKGDATADIR=\"/mesos/mesos-1.5.0/_inst/share/mesos\" -DPKGMODULEDIR=\"/mesos/mesos-1.5.0/_inst/lib/mesos/modules\" -I../../include -I../include -I../include/mesos -DPICOJSON_USE_INT64 -D__STDC_FORMAT_MACROS -isystem ../3rdparty/boost-1.53.0 -isystem ../3rdparty/concurrentqueue-1.0.0-beta -I../3rdparty/elfio-3.2 -I../3rdparty/glog-0.3.3/src -I../3rdparty/leveldb-1.19/include -I../../3rdparty/libprocess/include -I../3rdparty/nvml-352.79 -I../3rdparty/picojson-1.3.0 -I../3rdparty/protobuf-3.3.0/src -I../../3rdparty/stout/include -I../3rdparty/zookeeper-3.4.8/src/c/include -I../3rdparty/zookeeper-3.4.8/src/c/generated -DHAS_AUTHENTICATION=1 -isystem /usr/include/subversion-1 -isystem /usr/include/apr-1 -isystem /usr/include/apr-1.0	       -pthread -Wall -Wsign-compare -Wformat-security -fstack-protector -fPIC -fPIE -g1 -O0 -Wno-unused-local-typedefs -std=c++11 -MT examples/test_framework-test_framework.o -MD -MP -MF examples/.deps/test_framework-test_framework.Tpo -c -o examples/test_framework-test_framework.o `test -f 'examples/test_framework.cpp' || echo '../../src/'`examples/test_framework.cpp
g++ -DPACKAGE_NAME=\"mesos\" -DPACKAGE_TARNAME=\"mesos\" -DPACKAGE_VERSION=\"1.5.0\" -DPACKAGE_STRING=\"mesos\ 1.5.0\" -DPACKAGE_BUGREPORT=\"\" -DPACKAGE_URL=\"\" -DPACKAGE=\"mesos\" -DVERSION=\"1.5.0\" -DSTDC_HEADERS=1 -DHAVE_SYS_TYPES_H=1 -DHAVE_SYS_STAT_H=1 -DHAVE_STDLIB_H=1 -DHAVE_STRING_H=1 -DHAVE_MEMORY_H=1 -DHAVE_STRINGS_H=1 -DHAVE_INTTYPES_H=1 -DHAVE_STDINT_H=1 -DHAVE_UNISTD_H=1 -DHAVE_DLFCN_H=1 -DLT_OBJDIR=\".libs/\" -DHAVE_CXX11=1 -DHAVE_PTHREAD_PRIO_INHERIT=1 -DHAVE_PTHREAD=1 -DHAVE_FTS_H=1 -DHAVE_APR_POOLS_H=1 -DHAVE_LIBAPR_1=1 -DHAVE_LIBCURL=1 -DMESOS_HAS_JAVA=1 -DHAVE_LIBSASL2=1 -DHAVE_OPENSSL_SSL_H=1 -DHAVE_SVN_VERSION_H=1 -DHAVE_LIBSVN_SUBR_1=1 -DHAVE_SVN_DELTA_H=1 -DHAVE_LIBSVN_DELTA_1=1 -DHAVE_ZLIB_H=1 -DHAVE_LIBZ=1 -DHAVE_PYTHON=\"2.7\" -DMESOS_HAS_PYTHON=1 -I. -I../../src   -Werror -DLIBDIR=\"/mesos/mesos-1.5.0/_inst/lib\" -DPKGLIBEXECDIR=\"/mesos/mesos-1.5.0/_inst/libexec/mesos\" -DPKGDATADIR=\"/mesos/mesos-1.5.0/_inst/share/mesos\" -DPKGMODULEDIR=\"/mesos/mesos-1.5.0/_inst/lib/mesos/modules\" -I../../include -I../include -I../include/mesos -DPICOJSON_USE_INT64 -D__STDC_FORMAT_MACROS -isystem ../3rdparty/boost-1.53.0 -isystem ../3rdparty/concurrentqueue-1.0.0-beta -I../3rdparty/elfio-3.2 -I../3rdparty/glog-0.3.3/src -I../3rdparty/leveldb-1.19/include -I../../3rdparty/libprocess/include -I../3rdparty/nvml-352.79 -I../3rdparty/picojson-1.3.0 -I../3rdparty/protobuf-3.3.0/src -I../../3rdparty/stout/include -I../3rdparty/zookeeper-3.4.8/src/c/include -I../3rdparty/zookeeper-3.4.8/src/c/generated -DHAS_AUTHENTICATION=1 -isystem /usr/include/subversion-1 -isystem /usr/include/apr-1 -isystem /usr/include/apr-1.0	       -pthread -Wall -Wsign-compare -Wformat-security -fstack-protector -fPIC -fPIE -g1 -O0 -Wno-unused-local-typedefs -std=c++11 -MT examples/test_executor-test_executor.o -MD -MP -MF examples/.deps/test_executor-test_executor.Tpo -c -o examples/test_executor-test_executor.o `test -f 'examples/test_executor.cpp' || echo '../../src/'`examples/test_executor.cpp
g++ -DPACKAGE_NAME=\"mesos\" -DPACKAGE_TARNAME=\"mesos\" -DPACKAGE_VERSION=\"1.5.0\" -DPACKAGE_STRING=\"mesos\ 1.5.0\" -DPACKAGE_BUGREPORT=\"\" -DPACKAGE_URL=\"\" -DPACKAGE=\"mesos\" -DVERSION=\"1.5.0\" -DSTDC_HEADERS=1 -DHAVE_SYS_TYPES_H=1 -DHAVE_SYS_STAT_H=1 -DHAVE_STDLIB_H=1 -DHAVE_STRING_H=1 -DHAVE_MEMORY_H=1 -DHAVE_STRINGS_H=1 -DHAVE_INTTYPES_H=1 -DHAVE_STDINT_H=1 -DHAVE_UNISTD_H=1 -DHAVE_DLFCN_H=1 -DLT_OBJDIR=\".libs/\" -DHAVE_CXX11=1 -DHAVE_PTHREAD_PRIO_INHERIT=1 -DHAVE_PTHREAD=1 -DHAVE_FTS_H=1 -DHAVE_APR_POOLS_H=1 -DHAVE_LIBAPR_1=1 -DHAVE_LIBCURL=1 -DMESOS_HAS_JAVA=1 -DHAVE_LIBSASL2=1 -DHAVE_OPENSSL_SSL_H=1 -DHAVE_SVN_VERSION_H=1 -DHAVE_LIBSVN_SUBR_1=1 -DHAVE_SVN_DELTA_H=1 -DHAVE_LIBSVN_DELTA_1=1 -DHAVE_ZLIB_H=1 -DHAVE_LIBZ=1 -DHAVE_PYTHON=\"2.7\" -DMESOS_HAS_PYTHON=1 -I. -I../../src   -Werror -DLIBDIR=\"/mesos/mesos-1.5.0/_inst/lib\" -DPKGLIBEXECDIR=\"/mesos/mesos-1.5.0/_inst/libexec/mesos\" -DPKGDATADIR=\"/mesos/mesos-1.5.0/_inst/share/mesos\" -DPKGMODULEDIR=\"/mesos/mesos-1.5.0/_inst/lib/mesos/modules\" -I../../include -I../include -I../include/mesos -DPICOJSON_USE_INT64 -D__STDC_FORMAT_MACROS -isystem ../3rdparty/boost-1.53.0 -isystem ../3rdparty/concurrentqueue-1.0.0-beta -I../3rdparty/elfio-3.2 -I../3rdparty/glog-0.3.3/src -I../3rdparty/leveldb-1.19/include -I../../3rdparty/libprocess/include -I../3rdparty/nvml-352.79 -I../3rdparty/picojson-1.3.0 -I../3rdparty/protobuf-3.3.0/src -I../../3rdparty/stout/include -I../3rdparty/zookeeper-3.4.8/src/c/include -I../3rdparty/zookeeper-3.4.8/src/c/generated -DHAS_AUTHENTICATION=1 -isystem /usr/include/subversion-1 -isystem /usr/include/apr-1 -isystem /usr/include/apr-1.0	       -pthread -Wall -Wsign-compare -Wformat-security -fstack-protector -fPIC -fPIE -g1 -O0 -Wno-unused-local-typedefs -std=c++11 -MT examples/test_http_executor-test_http_executor.o -MD -MP -MF examples/.deps/test_http_executor-test_http_executor.Tpo -c -o examples/test_http_executor-test_http_executor.o `test -f 'examples/test_http_executor.cpp' || echo '../../src/'`examples/test_http_executor.cpp
g++ -DPACKAGE_NAME=\"mesos\" -DPACKAGE_TARNAME=\"mesos\" -DPACKAGE_VERSION=\"1.5.0\" -DPACKAGE_STRING=\"mesos\ 1.5.0\" -DPACKAGE_BUGREPORT=\"\" -DPACKAGE_URL=\"\" -DPACKAGE=\"mesos\" -DVERSION=\"1.5.0\" -DSTDC_HEADERS=1 -DHAVE_SYS_TYPES_H=1 -DHAVE_SYS_STAT_H=1 -DHAVE_STDLIB_H=1 -DHAVE_STRING_H=1 -DHAVE_MEMORY_H=1 -DHAVE_STRINGS_H=1 -DHAVE_INTTYPES_H=1 -DHAVE_STDINT_H=1 -DHAVE_UNISTD_H=1 -DHAVE_DLFCN_H=1 -DLT_OBJDIR=\".libs/\" -DHAVE_CXX11=1 -DHAVE_PTHREAD_PRIO_INHERIT=1 -DHAVE_PTHREAD=1 -DHAVE_FTS_H=1 -DHAVE_APR_POOLS_H=1 -DHAVE_LIBAPR_1=1 -DHAVE_LIBCURL=1 -DMESOS_HAS_JAVA=1 -DHAVE_LIBSASL2=1 -DHAVE_OPENSSL_SSL_H=1 -DHAVE_SVN_VERSION_H=1 -DHAVE_LIBSVN_SUBR_1=1 -DHAVE_SVN_DELTA_H=1 -DHAVE_LIBSVN_DELTA_1=1 -DHAVE_ZLIB_H=1 -DHAVE_LIBZ=1 -DHAVE_PYTHON=\"2.7\" -DMESOS_HAS_PYTHON=1 -I. -I../../src   -Werror -DLIBDIR=\"/mesos/mesos-1.5.0/_inst/lib\" -DPKGLIBEXECDIR=\"/mesos/mesos-1.5.0/_inst/libexec/mesos\" -DPKGDATADIR=\"/mesos/mesos-1.5.0/_inst/share/mesos\" -DPKGMODULEDIR=\"/mesos/mesos-1.5.0/_inst/lib/mesos/modules\" -I../../include -I../include -I../include/mesos -DPICOJSON_USE_INT64 -D__STDC_FORMAT_MACROS -isystem ../3rdparty/boost-1.53.0 -isystem ../3rdparty/concurrentqueue-1.0.0-beta -I../3rdparty/elfio-3.2 -I../3rdparty/glog-0.3.3/src -I../3rdparty/leveldb-1.19/include -I../../3rdparty/libprocess/include -I../3rdparty/nvml-352.79 -I../3rdparty/picojson-1.3.0 -I../3rdparty/protobuf-3.3.0/src -I../../3rdparty/stout/include -I../3rdparty/zookeeper-3.4.8/src/c/include -I../3rdparty/zookeeper-3.4.8/src/c/generated -DHAS_AUTHENTICATION=1 -isystem /usr/include/subversion-1 -isystem /usr/include/apr-1 -isystem /usr/include/apr-1.0	       -pthread -Wall -Wsign-compare -Wformat-security -fstack-protector -fPIC -fPIE -g1 -O0 -Wno-unused-local-typedefs -std=c++11 -MT examples/long_lived_framework-long_lived_framework.o -MD -MP -MF examples/.deps/long_lived_framework-long_lived_framework.Tpo -c -o examples/long_lived_framework-long_lived_framework.o `test -f 'examples/long_lived_framework.cpp' || echo '../../src/'`examples/long_lived_framework.cpp
mv -f examples/.deps/test_executor-test_executor.Tpo examples/.deps/test_executor-test_executor.Po
g++ -DPACKAGE_NAME=\"mesos\" -DPACKAGE_TARNAME=\"mesos\" -DPACKAGE_VERSION=\"1.5.0\" -DPACKAGE_STRING=\"mesos\ 1.5.0\" -DPACKAGE_BUGREPORT=\"\" -DPACKAGE_URL=\"\" -DPACKAGE=\"mesos\" -DVERSION=\"1.5.0\" -DSTDC_HEADERS=1 -DHAVE_SYS_TYPES_H=1 -DHAVE_SYS_STAT_H=1 -DHAVE_STDLIB_H=1 -DHAVE_STRING_H=1 -DHAVE_MEMORY_H=1 -DHAVE_STRINGS_H=1 -DHAVE_INTTYPES_H=1 -DHAVE_STDINT_H=1 -DHAVE_UNISTD_H=1 -DHAVE_DLFCN_H=1 -DLT_OBJDIR=\".libs/\" -DHAVE_CXX11=1 -DHAVE_PTHREAD_PRIO_INHERIT=1 -DHAVE_PTHREAD=1 -DHAVE_FTS_H=1 -DHAVE_APR_POOLS_H=1 -DHAVE_LIBAPR_1=1 -DHAVE_LIBCURL=1 -DMESOS_HAS_JAVA=1 -DHAVE_LIBSASL2=1 -DHAVE_OPENSSL_SSL_H=1 -DHAVE_SVN_VERSION_H=1 -DHAVE_LIBSVN_SUBR_1=1 -DHAVE_SVN_DELTA_H=1 -DHAVE_LIBSVN_DELTA_1=1 -DHAVE_ZLIB_H=1 -DHAVE_LIBZ=1 -DHAVE_PYTHON=\"2.7\" -DMESOS_HAS_PYTHON=1 -I. -I../../src   -Werror -DLIBDIR=\"/mesos/mesos-1.5.0/_inst/lib\" -DPKGLIBEXECDIR=\"/mesos/mesos-1.5.0/_inst/libexec/mesos\" -DPKGDATADIR=\"/mesos/mesos-1.5.0/_inst/share/mesos\" -DPKGMODULEDIR=\"/mesos/mesos-1.5.0/_inst/lib/mesos/modules\" -I../../include -I../include -I../include/mesos -DPICOJSON_USE_INT64 -D__STDC_FORMAT_MACROS -isystem ../3rdparty/boost-1.53.0 -isystem ../3rdparty/concurrentqueue-1.0.0-beta -I../3rdparty/elfio-3.2 -I../3rdparty/glog-0.3.3/src -I../3rdparty/leveldb-1.19/include -I../../3rdparty/libprocess/include -I../3rdparty/nvml-352.79 -I../3rdparty/picojson-1.3.0 -I../3rdparty/protobuf-3.3.0/src -I../../3rdparty/stout/include -I../3rdparty/zookeeper-3.4.8/src/c/include -I../3rdparty/zookeeper-3.4.8/src/c/generated -DHAS_AUTHENTICATION=1 -isystem /usr/include/subversion-1 -isystem /usr/include/apr-1 -isystem /usr/include/apr-1.0	       -pthread -Wall -Wsign-compare -Wformat-security -fstack-protector -fPIC -fPIE -g1 -O0 -Wno-unused-local-typedefs -std=c++11 -MT examples/long_lived_executor-long_lived_executor.o -MD -MP -MF examples/.deps/long_lived_executor-long_lived_executor.Tpo -c -o examples/long_lived_executor-long_lived_executor.o `test -f 'examples/long_lived_executor.cpp' || echo '../../src/'`examples/long_lived_executor.cpp
mv -f examples/.deps/test_framework-test_framework.Tpo examples/.deps/test_framework-test_framework.Po
g++ -DPACKAGE_NAME=\"mesos\" -DPACKAGE_TARNAME=\"mesos\" -DPACKAGE_VERSION=\"1.5.0\" -DPACKAGE_STRING=\"mesos\ 1.5.0\" -DPACKAGE_BUGREPORT=\"\" -DPACKAGE_URL=\"\" -DPACKAGE=\"mesos\" -DVERSION=\"1.5.0\" -DSTDC_HEADERS=1 -DHAVE_SYS_TYPES_H=1 -DHAVE_SYS_STAT_H=1 -DHAVE_STDLIB_H=1 -DHAVE_STRING_H=1 -DHAVE_MEMORY_H=1 -DHAVE_STRINGS_H=1 -DHAVE_INTTYPES_H=1 -DHAVE_STDINT_H=1 -DHAVE_UNISTD_H=1 -DHAVE_DLFCN_H=1 -DLT_OBJDIR=\".libs/\" -DHAVE_CXX11=1 -DHAVE_PTHREAD_PRIO_INHERIT=1 -DHAVE_PTHREAD=1 -DHAVE_FTS_H=1 -DHAVE_APR_POOLS_H=1 -DHAVE_LIBAPR_1=1 -DHAVE_LIBCURL=1 -DMESOS_HAS_JAVA=1 -DHAVE_LIBSASL2=1 -DHAVE_OPENSSL_SSL_H=1 -DHAVE_SVN_VERSION_H=1 -DHAVE_LIBSVN_SUBR_1=1 -DHAVE_SVN_DELTA_H=1 -DHAVE_LIBSVN_DELTA_1=1 -DHAVE_ZLIB_H=1 -DHAVE_LIBZ=1 -DHAVE_PYTHON=\"2.7\" -DMESOS_HAS_PYTHON=1 -I. -I../../src   -Werror -DLIBDIR=\"/mesos/mesos-1.5.0/_inst/lib\" -DPKGLIBEXECDIR=\"/mesos/mesos-1.5.0/_inst/libexec/mesos\" -DPKGDATADIR=\"/mesos/mesos-1.5.0/_inst/share/mesos\" -DPKGMODULEDIR=\"/mesos/mesos-1.5.0/_inst/lib/mesos/modules\" -I../../include -I../include -I../include/mesos -DPICOJSON_USE_INT64 -D__STDC_FORMAT_MACROS -isystem ../3rdparty/boost-1.53.0 -isystem ../3rdparty/concurrentqueue-1.0.0-beta -I../3rdparty/elfio-3.2 -I../3rdparty/glog-0.3.3/src -I../3rdparty/leveldb-1.19/include -I../../3rdparty/libprocess/include -I../3rdparty/nvml-352.79 -I../3rdparty/picojson-1.3.0 -I../3rdparty/protobuf-3.3.0/src -I../../3rdparty/stout/include -I../3rdparty/zookeeper-3.4.8/src/c/include -I../3rdparty/zookeeper-3.4.8/src/c/generated -DHAS_AUTHENTICATION=1 -isystem /usr/include/subversion-1 -isystem /usr/include/apr-1 -isystem /usr/include/apr-1.0	       -pthread -Wall -Wsign-compare -Wformat-security -fstack-protector -fPIC -fPIE -g1 -O0 -Wno-unused-local-typedefs -std=c++11 -MT examples/no_executor_framework-no_executor_framework.o -MD -MP -MF examples/.deps/no_executor_framework-no_executor_framework.Tpo -c -o examples/no_executor_framework-no_executor_framework.o `test -f 'examples/no_executor_framework.cpp' || echo '../../src/'`examples/no_executor_framework.cpp
mv -f examples/.deps/dynamic_reservation_framework-dynamic_reservation_framework.Tpo examples/.deps/dynamic_reservation_framework-dynamic_reservation_framework.Po
g++ -DPACKAGE_NAME=\"mesos\" -DPACKAGE_TARNAME=\"mesos\" -DPACKAGE_VERSION=\"1.5.0\" -DPACKAGE_STRING=\"mesos\ 1.5.0\" -DPACKAGE_BUGREPORT=\"\" -DPACKAGE_URL=\"\" -DPACKAGE=\"mesos\" -DVERSION=\"1.5.0\" -DSTDC_HEADERS=1 -DHAVE_SYS_TYPES_H=1 -DHAVE_SYS_STAT_H=1 -DHAVE_STDLIB_H=1 -DHAVE_STRING_H=1 -DHAVE_MEMORY_H=1 -DHAVE_STRINGS_H=1 -DHAVE_INTTYPES_H=1 -DHAVE_STDINT_H=1 -DHAVE_UNISTD_H=1 -DHAVE_DLFCN_H=1 -DLT_OBJDIR=\".libs/\" -DHAVE_CXX11=1 -DHAVE_PTHREAD_PRIO_INHERIT=1 -DHAVE_PTHREAD=1 -DHAVE_FTS_H=1 -DHAVE_APR_POOLS_H=1 -DHAVE_LIBAPR_1=1 -DHAVE_LIBCURL=1 -DMESOS_HAS_JAVA=1 -DHAVE_LIBSASL2=1 -DHAVE_OPENSSL_SSL_H=1 -DHAVE_SVN_VERSION_H=1 -DHAVE_LIBSVN_SUBR_1=1 -DHAVE_SVN_DELTA_H=1 -DHAVE_LIBSVN_DELTA_1=1 -DHAVE_ZLIB_H=1 -DHAVE_LIBZ=1 -DHAVE_PYTHON=\"2.7\" -DMESOS_HAS_PYTHON=1 -I. -I../../src   -Werror -DLIBDIR=\"/mesos/mesos-1.5.0/_inst/lib\" -DPKGLIBEXECDIR=\"/mesos/mesos-1.5.0/_inst/libexec/mesos\" -DPKGDATADIR=\"/mesos/mesos-1.5.0/_inst/share/mesos\" -DPKGMODULEDIR=\"/mesos/mesos-1.5.0/_inst/lib/mesos/modules\" -I../../include -I../include -I../include/mesos -DPICOJSON_USE_INT64 -D__STDC_FORMAT_MACROS -isystem ../3rdparty/boost-1.53.0 -isystem ../3rdparty/concurrentqueue-1.0.0-beta -I../3rdparty/elfio-3.2 -I../3rdparty/glog-0.3.3/src -I../3rdparty/leveldb-1.19/include -I../../3rdparty/libprocess/include -I../3rdparty/nvml-352.79 -I../3rdparty/picojson-1.3.0 -I../3rdparty/protobuf-3.3.0/src -I../../3rdparty/stout/include -I../3rdparty/zookeeper-3.4.8/src/c/include -I../3rdparty/zookeeper-3.4.8/src/c/generated -DHAS_AUTHENTICATION=1 -isystem /usr/include/subversion-1 -isystem /usr/include/apr-1 -isystem /usr/include/apr-1.0	       -pthread -Wall -Wsign-compare -Wformat-security -fstack-protector -fPIC -fPIE -g1 -O0 -Wno-unused-local-typedefs -std=c++11 -MT examples/docker_no_executor_framework-docker_no_executor_framework.o -MD -MP -MF examples/.deps/docker_no_executor_framework-docker_no_executor_framework.Tpo -c -o examples/docker_no_executor_framework-docker_no_executor_framework.o `test -f 'examples/docker_no_executor_framework.cpp' || echo '../../src/'`examples/docker_no_executor_framework.cpp
mv -f examples/.deps/test_http_executor-test_http_executor.Tpo examples/.deps/test_http_executor-test_http_executor.Po
g++ -DPACKAGE_NAME=\"mesos\" -DPACKAGE_TARNAME=\"mesos\" -DPACKAGE_VERSION=\"1.5.0\" -DPACKAGE_STRING=\"mesos\ 1.5.0\" -DPACKAGE_BUGREPORT=\"\" -DPACKAGE_URL=\"\" -DPACKAGE=\"mesos\" -DVERSION=\"1.5.0\" -DSTDC_HEADERS=1 -DHAVE_SYS_TYPES_H=1 -DHAVE_SYS_STAT_H=1 -DHAVE_STDLIB_H=1 -DHAVE_STRING_H=1 -DHAVE_MEMORY_H=1 -DHAVE_STRINGS_H=1 -DHAVE_INTTYPES_H=1 -DHAVE_STDINT_H=1 -DHAVE_UNISTD_H=1 -DHAVE_DLFCN_H=1 -DLT_OBJDIR=\".libs/\" -DHAVE_CXX11=1 -DHAVE_PTHREAD_PRIO_INHERIT=1 -DHAVE_PTHREAD=1 -DHAVE_FTS_H=1 -DHAVE_APR_POOLS_H=1 -DHAVE_LIBAPR_1=1 -DHAVE_LIBCURL=1 -DMESOS_HAS_JAVA=1 -DHAVE_LIBSASL2=1 -DHAVE_OPENSSL_SSL_H=1 -DHAVE_SVN_VERSION_H=1 -DHAVE_LIBSVN_SUBR_1=1 -DHAVE_SVN_DELTA_H=1 -DHAVE_LIBSVN_DELTA_1=1 -DHAVE_ZLIB_H=1 -DHAVE_LIBZ=1 -DHAVE_PYTHON=\"2.7\" -DMESOS_HAS_PYTHON=1 -I. -I../../src   -Werror -DLIBDIR=\"/mesos/mesos-1.5.0/_inst/lib\" -DPKGLIBEXECDIR=\"/mesos/mesos-1.5.0/_inst/libexec/mesos\" -DPKGDATADIR=\"/mesos/mesos-1.5.0/_inst/share/mesos\" -DPKGMODULEDIR=\"/mesos/mesos-1.5.0/_inst/lib/mesos/modules\" -I../../include -I../include -I../include/mesos -DPICOJSON_USE_INT64 -D__STDC_FORMAT_MACROS -isystem ../3rdparty/boost-1.53.0 -isystem ../3rdparty/concurrentqueue-1.0.0-beta -I../3rdparty/elfio-3.2 -I../3rdparty/glog-0.3.3/src -I../3rdparty/leveldb-1.19/include -I../../3rdparty/libprocess/include -I../3rdparty/nvml-352.79 -I../3rdparty/picojson-1.3.0 -I../3rdparty/protobuf-3.3.0/src -I../../3rdparty/stout/include -I../3rdparty/zookeeper-3.4.8/src/c/include -I../3rdparty/zookeeper-3.4.8/src/c/generated -DHAS_AUTHENTICATION=1 -isystem /usr/include/subversion-1 -isystem /usr/include/apr-1 -isystem /usr/include/apr-1.0	       -pthread -Wall -Wsign-compare -Wformat-security -fstack-protector -fPIC -fPIE -g1 -O0 -Wno-unused-local-typedefs -std=c++11 -MT examples/balloon_framework-balloon_framework.o -MD -MP -MF examples/.deps/balloon_framework-balloon_framework.Tpo -c -o examples/balloon_framework-balloon_framework.o `test -f 'examples/balloon_framework.cpp' || echo '../../src/'`examples/balloon_framework.cpp
mv -f examples/.deps/test_http_framework-test_http_framework.Tpo examples/.deps/test_http_framework-test_http_framework.Po
g++ -DPACKAGE_NAME=\"mesos\" -DPACKAGE_TARNAME=\"mesos\" -DPACKAGE_VERSION=\"1.5.0\" -DPACKAGE_STRING=\"mesos\ 1.5.0\" -DPACKAGE_BUGREPORT=\"\" -DPACKAGE_URL=\"\" -DPACKAGE=\"mesos\" -DVERSION=\"1.5.0\" -DSTDC_HEADERS=1 -DHAVE_SYS_TYPES_H=1 -DHAVE_SYS_STAT_H=1 -DHAVE_STDLIB_H=1 -DHAVE_STRING_H=1 -DHAVE_MEMORY_H=1 -DHAVE_STRINGS_H=1 -DHAVE_INTTYPES_H=1 -DHAVE_STDINT_H=1 -DHAVE_UNISTD_H=1 -DHAVE_DLFCN_H=1 -DLT_OBJDIR=\".libs/\" -DHAVE_CXX11=1 -DHAVE_PTHREAD_PRIO_INHERIT=1 -DHAVE_PTHREAD=1 -DHAVE_FTS_H=1 -DHAVE_APR_POOLS_H=1 -DHAVE_LIBAPR_1=1 -DHAVE_LIBCURL=1 -DMESOS_HAS_JAVA=1 -DHAVE_LIBSASL2=1 -DHAVE_OPENSSL_SSL_H=1 -DHAVE_SVN_VERSION_H=1 -DHAVE_LIBSVN_SUBR_1=1 -DHAVE_SVN_DELTA_H=1 -DHAVE_LIBSVN_DELTA_1=1 -DHAVE_ZLIB_H=1 -DHAVE_LIBZ=1 -DHAVE_PYTHON=\"2.7\" -DMESOS_HAS_PYTHON=1 -I. -I../../src   -Werror -DLIBDIR=\"/mesos/mesos-1.5.0/_inst/lib\" -DPKGLIBEXECDIR=\"/mesos/mesos-1.5.0/_inst/libexec/mesos\" -DPKGDATADIR=\"/mesos/mesos-1.5.0/_inst/share/mesos\" -DPKGMODULEDIR=\"/mesos/mesos-1.5.0/_inst/lib/mesos/modules\" -I../../include -I../include -I../include/mesos -DPICOJSON_USE_INT64 -D__STDC_FORMAT_MACROS -isystem ../3rdparty/boost-1.53.0 -isystem ../3rdparty/concurrentqueue-1.0.0-beta -I../3rdparty/elfio-3.2 -I../3rdparty/glog-0.3.3/src -I../3rdparty/leveldb-1.19/include -I../../3rdparty/libprocess/include -I../3rdparty/nvml-352.79 -I../3rdparty/picojson-1.3.0 -I../3rdparty/protobuf-3.3.0/src -I../../3rdparty/stout/include -I../3rdparty/zookeeper-3.4.8/src/c/include -I../3rdparty/zookeeper-3.4.8/src/c/generated -DHAS_AUTHENTICATION=1 -isystem /usr/include/subversion-1 -isystem /usr/include/apr-1 -isystem /usr/include/apr-1.0	       -pthread -Wall -Wsign-compare -Wformat-security -fstack-protector -fPIC -fPIE -g1 -O0 -Wno-unused-local-typedefs -std=c++11 -MT examples/balloon_executor-balloon_executor.o -MD -MP -MF examples/.deps/balloon_executor-balloon_executor.Tpo -c -o examples/balloon_executor-balloon_executor.o `test -f 'examples/balloon_executor.cpp' || echo '../../src/'`examples/balloon_executor.cpp
mv -f examples/.deps/docker_no_executor_framework-docker_no_executor_framework.Tpo examples/.deps/docker_no_executor_framework-docker_no_executor_framework.Po
g++ -DPACKAGE_NAME=\"mesos\" -DPACKAGE_TARNAME=\"mesos\" -DPACKAGE_VERSION=\"1.5.0\" -DPACKAGE_STRING=\"mesos\ 1.5.0\" -DPACKAGE_BUGREPORT=\"\" -DPACKAGE_URL=\"\" -DPACKAGE=\"mesos\" -DVERSION=\"1.5.0\" -DSTDC_HEADERS=1 -DHAVE_SYS_TYPES_H=1 -DHAVE_SYS_STAT_H=1 -DHAVE_STDLIB_H=1 -DHAVE_STRING_H=1 -DHAVE_MEMORY_H=1 -DHAVE_STRINGS_H=1 -DHAVE_INTTYPES_H=1 -DHAVE_STDINT_H=1 -DHAVE_UNISTD_H=1 -DHAVE_DLFCN_H=1 -DLT_OBJDIR=\".libs/\" -DHAVE_CXX11=1 -DHAVE_PTHREAD_PRIO_INHERIT=1 -DHAVE_PTHREAD=1 -DHAVE_FTS_H=1 -DHAVE_APR_POOLS_H=1 -DHAVE_LIBAPR_1=1 -DHAVE_LIBCURL=1 -DMESOS_HAS_JAVA=1 -DHAVE_LIBSASL2=1 -DHAVE_OPENSSL_SSL_H=1 -DHAVE_SVN_VERSION_H=1 -DHAVE_LIBSVN_SUBR_1=1 -DHAVE_SVN_DELTA_H=1 -DHAVE_LIBSVN_DELTA_1=1 -DHAVE_ZLIB_H=1 -DHAVE_LIBZ=1 -DHAVE_PYTHON=\"2.7\" -DMESOS_HAS_PYTHON=1 -I. -I../../src   -Werror -DLIBDIR=\"/mesos/mesos-1.5.0/_inst/lib\" -DPKGLIBEXECDIR=\"/mesos/mesos-1.5.0/_inst/libexec/mesos\" -DPKGDATADIR=\"/mesos/mesos-1.5.0/_inst/share/mesos\" -DPKGMODULEDIR=\"/mesos/mesos-1.5.0/_inst/lib/mesos/modules\" -I../../include -I../include -I../include/mesos -DPICOJSON_USE_INT64 -D__STDC_FORMAT_MACROS -isystem ../3rdparty/boost-1.53.0 -isystem ../3rdparty/concurrentqueue-1.0.0-beta -I../3rdparty/elfio-3.2 -I../3rdparty/glog-0.3.3/src -I../3rdparty/leveldb-1.19/include -I../../3rdparty/libprocess/include -I../3rdparty/nvml-352.79 -I../3rdparty/picojson-1.3.0 -I../3rdparty/protobuf-3.3.0/src -I../../3rdparty/stout/include -I../3rdparty/zookeeper-3.4.8/src/c/include -I../3rdparty/zookeeper-3.4.8/src/c/generated -DHAS_AUTHENTICATION=1 -isystem /usr/include/subversion-1 -isystem /usr/include/apr-1 -isystem /usr/include/apr-1.0	       -pthread -Wall -Wsign-compare -Wformat-security -fstack-protector -fPIC -fPIE -g1 -O0 -Wno-unused-local-typedefs -std=c++11 -MT examples/load_generator_framework-load_generator_framework.o -MD -MP -MF examples/.deps/load_generator_framework-load_generator_framework.Tpo -c -o examples/load_generator_framework-load_generator_framework.o `test -f 'examples/load_generator_framework.cpp' || echo '../../src/'`examples/load_generator_framework.cpp
mv -f examples/.deps/long_lived_executor-long_lived_executor.Tpo examples/.deps/long_lived_executor-long_lived_executor.Po
g++ -DPACKAGE_NAME=\"mesos\" -DPACKAGE_TARNAME=\"mesos\" -DPACKAGE_VERSION=\"1.5.0\" -DPACKAGE_STRING=\"mesos\ 1.5.0\" -DPACKAGE_BUGREPORT=\"\" -DPACKAGE_URL=\"\" -DPACKAGE=\"mesos\" -DVERSION=\"1.5.0\" -DSTDC_HEADERS=1 -DHAVE_SYS_TYPES_H=1 -DHAVE_SYS_STAT_H=1 -DHAVE_STDLIB_H=1 -DHAVE_STRING_H=1 -DHAVE_MEMORY_H=1 -DHAVE_STRINGS_H=1 -DHAVE_INTTYPES_H=1 -DHAVE_STDINT_H=1 -DHAVE_UNISTD_H=1 -DHAVE_DLFCN_H=1 -DLT_OBJDIR=\".libs/\" -DHAVE_CXX11=1 -DHAVE_PTHREAD_PRIO_INHERIT=1 -DHAVE_PTHREAD=1 -DHAVE_FTS_H=1 -DHAVE_APR_POOLS_H=1 -DHAVE_LIBAPR_1=1 -DHAVE_LIBCURL=1 -DMESOS_HAS_JAVA=1 -DHAVE_LIBSASL2=1 -DHAVE_OPENSSL_SSL_H=1 -DHAVE_SVN_VERSION_H=1 -DHAVE_LIBSVN_SUBR_1=1 -DHAVE_SVN_DELTA_H=1 -DHAVE_LIBSVN_DELTA_1=1 -DHAVE_ZLIB_H=1 -DHAVE_LIBZ=1 -DHAVE_PYTHON=\"2.7\" -DMESOS_HAS_PYTHON=1 -I. -I../../src   -Werror -DLIBDIR=\"/mesos/mesos-1.5.0/_inst/lib\" -DPKGLIBEXECDIR=\"/mesos/mesos-1.5.0/_inst/libexec/mesos\" -DPKGDATADIR=\"/mesos/mesos-1.5.0/_inst/share/mesos\" -DPKGMODULEDIR=\"/mesos/mesos-1.5.0/_inst/lib/mesos/modules\" -I../../include -I../include -I../include/mesos -DPICOJSON_USE_INT64 -D__STDC_FORMAT_MACROS -isystem ../3rdparty/boost-1.53.0 -isystem ../3rdparty/concurrentqueue-1.0.0-beta -I../3rdparty/elfio-3.2 -I../3rdparty/glog-0.3.3/src -I../3rdparty/leveldb-1.19/include -I../../3rdparty/libprocess/include -I../3rdparty/nvml-352.79 -I../3rdparty/picojson-1.3.0 -I../3rdparty/protobuf-3.3.0/src -I../../3rdparty/stout/include -I../3rdparty/zookeeper-3.4.8/src/c/include -I../3rdparty/zookeeper-3.4.8/src/c/generated -DHAS_AUTHENTICATION=1 -isystem /usr/include/subversion-1 -isystem /usr/include/apr-1 -isystem /usr/include/apr-1.0	       -pthread -Wall -Wsign-compare -Wformat-security -fstack-protector -fPIC -fPIE -g1 -O0 -Wno-unused-local-typedefs -std=c++11 -MT examples/persistent_volume_framework-persistent_volume_framework.o -MD -MP -MF examples/.deps/persistent_volume_framework-persistent_volume_framework.Tpo -c -o examples/persistent_volume_framework-persistent_volume_framework.o `test -f 'examples/persistent_volume_framework.cpp' || echo '../../src/'`examples/persistent_volume_framework.cpp
mv -f examples/.deps/balloon_executor-balloon_executor.Tpo examples/.deps/balloon_executor-balloon_executor.Po
g++ -DPACKAGE_NAME=\"mesos\" -DPACKAGE_TARNAME=\"mesos\" -DPACKAGE_VERSION=\"1.5.0\" -DPACKAGE_STRING=\"mesos\ 1.5.0\" -DPACKAGE_BUGREPORT=\"\" -DPACKAGE_URL=\"\" -DPACKAGE=\"mesos\" -DVERSION=\"1.5.0\" -DSTDC_HEADERS=1 -DHAVE_SYS_TYPES_H=1 -DHAVE_SYS_STAT_H=1 -DHAVE_STDLIB_H=1 -DHAVE_STRING_H=1 -DHAVE_MEMORY_H=1 -DHAVE_STRINGS_H=1 -DHAVE_INTTYPES_H=1 -DHAVE_STDINT_H=1 -DHAVE_UNISTD_H=1 -DHAVE_DLFCN_H=1 -DLT_OBJDIR=\".libs/\" -DHAVE_CXX11=1 -DHAVE_PTHREAD_PRIO_INHERIT=1 -DHAVE_PTHREAD=1 -DHAVE_FTS_H=1 -DHAVE_APR_POOLS_H=1 -DHAVE_LIBAPR_1=1 -DHAVE_LIBCURL=1 -DMESOS_HAS_JAVA=1 -DHAVE_LIBSASL2=1 -DHAVE_OPENSSL_SSL_H=1 -DHAVE_SVN_VERSION_H=1 -DHAVE_LIBSVN_SUBR_1=1 -DHAVE_SVN_DELTA_H=1 -DHAVE_LIBSVN_DELTA_1=1 -DHAVE_ZLIB_H=1 -DHAVE_LIBZ=1 -DHAVE_PYTHON=\"2.7\" -DMESOS_HAS_PYTHON=1 -I. -I../../src   -Werror -DLIBDIR=\"/mesos/mesos-1.5.0/_inst/lib\" -DPKGLIBEXECDIR=\"/mesos/mesos-1.5.0/_inst/libexec/mesos\" -DPKGDATADIR=\"/mesos/mesos-1.5.0/_inst/share/mesos\" -DPKGMODULEDIR=\"/mesos/mesos-1.5.0/_inst/lib/mesos/modules\" -I../../include -I../include -I../include/mesos -DPICOJSON_USE_INT64 -D__STDC_FORMAT_MACROS -isystem ../3rdparty/boost-1.53.0 -isystem ../3rdparty/concurrentqueue-1.0.0-beta -I../3rdparty/elfio-3.2 -I../3rdparty/glog-0.3.3/src -I../3rdparty/leveldb-1.19/include -I../../3rdparty/libprocess/include -I../3rdparty/nvml-352.79 -I../3rdparty/picojson-1.3.0 -I../3rdparty/protobuf-3.3.0/src -I../../3rdparty/stout/include -I../3rdparty/zookeeper-3.4.8/src/c/include -I../3rdparty/zookeeper-3.4.8/src/c/generated -DHAS_AUTHENTICATION=1 -isystem /usr/include/subversion-1 -isystem /usr/include/apr-1 -isystem /usr/include/apr-1.0	       -pthread -Wall -Wsign-compare -Wformat-security -fstack-protector -fPIC -fPIE -g1 -O0 -Wno-unused-local-typedefs -std=c++11 -MT examples/disk_full_framework-disk_full_framework.o -MD -MP -MF examples/.deps/disk_full_framework-disk_full_framework.Tpo -c -o examples/disk_full_framework-disk_full_framework.o `test -f 'examples/disk_full_framework.cpp' || echo '../../src/'`examples/disk_full_framework.cpp
mv -f examples/.deps/no_executor_framework-no_executor_framework.Tpo examples/.deps/no_executor_framework-no_executor_framework.Po
g++ -DPACKAGE_NAME=\"mesos\" -DPACKAGE_TARNAME=\"mesos\" -DPACKAGE_VERSION=\"1.5.0\" -DPACKAGE_STRING=\"mesos\ 1.5.0\" -DPACKAGE_BUGREPORT=\"\" -DPACKAGE_URL=\"\" -DPACKAGE=\"mesos\" -DVERSION=\"1.5.0\" -DSTDC_HEADERS=1 -DHAVE_SYS_TYPES_H=1 -DHAVE_SYS_STAT_H=1 -DHAVE_STDLIB_H=1 -DHAVE_STRING_H=1 -DHAVE_MEMORY_H=1 -DHAVE_STRINGS_H=1 -DHAVE_INTTYPES_H=1 -DHAVE_STDINT_H=1 -DHAVE_UNISTD_H=1 -DHAVE_DLFCN_H=1 -DLT_OBJDIR=\".libs/\" -DHAVE_CXX11=1 -DHAVE_PTHREAD_PRIO_INHERIT=1 -DHAVE_PTHREAD=1 -DHAVE_FTS_H=1 -DHAVE_APR_POOLS_H=1 -DHAVE_LIBAPR_1=1 -DHAVE_LIBCURL=1 -DMESOS_HAS_JAVA=1 -DHAVE_LIBSASL2=1 -DHAVE_OPENSSL_SSL_H=1 -DHAVE_SVN_VERSION_H=1 -DHAVE_LIBSVN_SUBR_1=1 -DHAVE_SVN_DELTA_H=1 -DHAVE_LIBSVN_DELTA_1=1 -DHAVE_ZLIB_H=1 -DHAVE_LIBZ=1 -DHAVE_PYTHON=\"2.7\" -DMESOS_HAS_PYTHON=1 -I. -I../../src   -Werror -DLIBDIR=\"/mesos/mesos-1.5.0/_inst/lib\" -DPKGLIBEXECDIR=\"/mesos/mesos-1.5.0/_inst/libexec/mesos\" -DPKGDATADIR=\"/mesos/mesos-1.5.0/_inst/share/mesos\" -DPKGMODULEDIR=\"/mesos/mesos-1.5.0/_inst/lib/mesos/modules\" -I../../include -I../include -I../include/mesos -DPICOJSON_USE_INT64 -D__STDC_FORMAT_MACROS -isystem ../3rdparty/boost-1.53.0 -isystem ../3rdparty/concurrentqueue-1.0.0-beta -I../3rdparty/elfio-3.2 -I../3rdparty/glog-0.3.3/src -I../3rdparty/leveldb-1.19/include -I../../3rdparty/libprocess/include -I../3rdparty/nvml-352.79 -I../3rdparty/picojson-1.3.0 -I../3rdparty/protobuf-3.3.0/src -I../../3rdparty/stout/include -I../3rdparty/zookeeper-3.4.8/src/c/include -I../3rdparty/zookeeper-3.4.8/src/c/generated -DHAS_AUTHENTICATION=1 -DSOURCE_DIR=\"/mesos/mesos-1.5.0/_build/..\" -DBUILD_DIR=\"/mesos/mesos-1.5.0/_build\" -I../3rdparty/googletest-release-1.8.0/googletest/include -isystem ../3rdparty/googletest-release-1.8.0/googlemock/include -DTESTLIBEXECDIR=\"/mesos/mesos-1.5.0/_inst/libexec/mesos/tests\" -DSBINDIR=\"/mesos/mesos-1.5.0/_inst/sbin\" -isystem /usr/lib/jvm/java-7-openjdk-amd64/include -isystem /usr/lib/jvm/java-7-openjdk-amd64/include/linux -DZOOKEEPER_VERSION=\"3.4.8\" -isystem /usr/include/subversion-1 -isystem /usr/include/apr-1 -isystem /usr/include/apr-1.0	       -pthread -Wall -Wsign-compare -Wformat-security -fstack-protector -fPIC -fPIE -g1 -O0 -Wno-unused-local-typedefs -std=c++11 -MT slave/qos_controllers/mesos_tests-load.o -MD -MP -MF slave/qos_controllers/.deps/mesos_tests-load.Tpo -c -o slave/qos_controllers/mesos_tests-load.o `test -f 'slave/qos_controllers/load.cpp' || echo '../../src/'`slave/qos_controllers/load.cpp
mv -f examples/.deps/long_lived_framework-long_lived_framework.Tpo examples/.deps/long_lived_framework-long_lived_framework.Po
g++ -DPACKAGE_NAME=\"mesos\" -DPACKAGE_TARNAME=\"mesos\" -DPACKAGE_VERSION=\"1.5.0\" -DPACKAGE_STRING=\"mesos\ 1.5.0\" -DPACKAGE_BUGREPORT=\"\" -DPACKAGE_URL=\"\" -DPACKAGE=\"mesos\" -DVERSION=\"1.5.0\" -DSTDC_HEADERS=1 -DHAVE_SYS_TYPES_H=1 -DHAVE_SYS_STAT_H=1 -DHAVE_STDLIB_H=1 -DHAVE_STRING_H=1 -DHAVE_MEMORY_H=1 -DHAVE_STRINGS_H=1 -DHAVE_INTTYPES_H=1 -DHAVE_STDINT_H=1 -DHAVE_UNISTD_H=1 -DHAVE_DLFCN_H=1 -DLT_OBJDIR=\".libs/\" -DHAVE_CXX11=1 -DHAVE_PTHREAD_PRIO_INHERIT=1 -DHAVE_PTHREAD=1 -DHAVE_FTS_H=1 -DHAVE_APR_POOLS_H=1 -DHAVE_LIBAPR_1=1 -DHAVE_LIBCURL=1 -DMESOS_HAS_JAVA=1 -DHAVE_LIBSASL2=1 -DHAVE_OPENSSL_SSL_H=1 -DHAVE_SVN_VERSION_H=1 -DHAVE_LIBSVN_SUBR_1=1 -DHAVE_SVN_DELTA_H=1 -DHAVE_LIBSVN_DELTA_1=1 -DHAVE_ZLIB_H=1 -DHAVE_LIBZ=1 -DHAVE_PYTHON=\"2.7\" -DMESOS_HAS_PYTHON=1 -I. -I../../src   -Werror -DLIBDIR=\"/mesos/mesos-1.5.0/_inst/lib\" -DPKGLIBEXECDIR=\"/mesos/mesos-1.5.0/_inst/libexec/mesos\" -DPKGDATADIR=\"/mesos/mesos-1.5.0/_inst/share/mesos\" -DPKGMODULEDIR=\"/mesos/mesos-1.5.0/_inst/lib/mesos/modules\" -I../../include -I../include -I../include/mesos -DPICOJSON_USE_INT64 -D__STDC_FORMAT_MACROS -isystem ../3rdparty/boost-1.53.0 -isystem ../3rdparty/concurrentqueue-1.0.0-beta -I../3rdparty/elfio-3.2 -I../3rdparty/glog-0.3.3/src -I../3rdparty/leveldb-1.19/include -I../../3rdparty/libprocess/include -I../3rdparty/nvml-352.79 -I../3rdparty/picojson-1.3.0 -I../3rdparty/protobuf-3.3.0/src -I../../3rdparty/stout/include -I../3rdparty/zookeeper-3.4.8/src/c/include -I../3rdparty/zookeeper-3.4.8/src/c/generated -DHAS_AUTHENTICATION=1 -DSOURCE_DIR=\"/mesos/mesos-1.5.0/_build/..\" -DBUILD_DIR=\"/mesos/mesos-1.5.0/_build\" -I../3rdparty/googletest-release-1.8.0/googletest/include -isystem ../3rdparty/googletest-release-1.8.0/googlemock/include -DTESTLIBEXECDIR=\"/mesos/mesos-1.5.0/_inst/libexec/mesos/tests\" -DSBINDIR=\"/mesos/mesos-1.5.0/_inst/sbin\" -isystem /usr/lib/jvm/java-7-openjdk-amd64/include -isystem /usr/lib/jvm/java-7-openjdk-amd64/include/linux -DZOOKEEPER_VERSION=\"3.4.8\" -isystem /usr/include/subversion-1 -isystem /usr/include/apr-1 -isystem /usr/include/apr-1.0	       -pthread -Wall -Wsign-compare -Wformat-security -fstack-protector -fPIC -fPIE -g1 -O0 -Wno-unused-local-typedefs -std=c++11 -MT tests/mesos_tests-active_user_test_helper.o -MD -MP -MF tests/.deps/mesos_tests-active_user_test_helper.Tpo -c -o tests/mesos_tests-active_user_test_helper.o `test -f 'tests/active_user_test_helper.cpp' || echo '../../src/'`tests/active_user_test_helper.cpp
mv -f tests/.deps/mesos_tests-active_user_test_helper.Tpo tests/.deps/mesos_tests-active_user_test_helper.Po
g++ -DPACKAGE_NAME=\"mesos\" -DPACKAGE_TARNAME=\"mesos\" -DPACKAGE_VERSION=\"1.5.0\" -DPACKAGE_STRING=\"mesos\ 1.5.0\" -DPACKAGE_BUGREPORT=\"\" -DPACKAGE_URL=\"\" -DPACKAGE=\"mesos\" -DVERSION=\"1.5.0\" -DSTDC_HEADERS=1 -DHAVE_SYS_TYPES_H=1 -DHAVE_SYS_STAT_H=1 -DHAVE_STDLIB_H=1 -DHAVE_STRING_H=1 -DHAVE_MEMORY_H=1 -DHAVE_STRINGS_H=1 -DHAVE_INTTYPES_H=1 -DHAVE_STDINT_H=1 -DHAVE_UNISTD_H=1 -DHAVE_DLFCN_H=1 -DLT_OBJDIR=\".libs/\" -DHAVE_CXX11=1 -DHAVE_PTHREAD_PRIO_INHERIT=1 -DHAVE_PTHREAD=1 -DHAVE_FTS_H=1 -DHAVE_APR_POOLS_H=1 -DHAVE_LIBAPR_1=1 -DHAVE_LIBCURL=1 -DMESOS_HAS_JAVA=1 -DHAVE_LIBSASL2=1 -DHAVE_OPENSSL_SSL_H=1 -DHAVE_SVN_VERSION_H=1 -DHAVE_LIBSVN_SUBR_1=1 -DHAVE_SVN_DELTA_H=1 -DHAVE_LIBSVN_DELTA_1=1 -DHAVE_ZLIB_H=1 -DHAVE_LIBZ=1 -DHAVE_PYTHON=\"2.7\" -DMESOS_HAS_PYTHON=1 -I. -I../../src   -Werror -DLIBDIR=\"/mesos/mesos-1.5.0/_inst/lib\" -DPKGLIBEXECDIR=\"/mesos/mesos-1.5.0/_inst/libexec/mesos\" -DPKGDATADIR=\"/mesos/mesos-1.5.0/_inst/share/mesos\" -DPKGMODULEDIR=\"/mesos/mesos-1.5.0/_inst/lib/mesos/modules\" -I../../include -I../include -I../include/mesos -DPICOJSON_USE_INT64 -D__STDC_FORMAT_MACROS -isystem ../3rdparty/boost-1.53.0 -isystem ../3rdparty/concurrentqueue-1.0.0-beta -I../3rdparty/elfio-3.2 -I../3rdparty/glog-0.3.3/src -I../3rdparty/leveldb-1.19/include -I../../3rdparty/libprocess/include -I../3rdparty/nvml-352.79 -I../3rdparty/picojson-1.3.0 -I../3rdparty/protobuf-3.3.0/src -I../../3rdparty/stout/include -I../3rdparty/zookeeper-3.4.8/src/c/include -I../3rdparty/zookeeper-3.4.8/src/c/generated -DHAS_AUTHENTICATION=1 -DSOURCE_DIR=\"/mesos/mesos-1.5.0/_build/..\" -DBUILD_DIR=\"/mesos/mesos-1.5.0/_build\" -I../3rdparty/googletest-release-1.8.0/googletest/include -isystem ../3rdparty/googletest-release-1.8.0/googlemock/include -DTESTLIBEXECDIR=\"/mesos/mesos-1.5.0/_inst/libexec/mesos/tests\" -DSBINDIR=\"/mesos/mesos-1.5.0/_inst/sbin\" -isystem /usr/lib/jvm/java-7-openjdk-amd64/include -isystem /usr/lib/jvm/java-7-openjdk-amd64/include/linux -DZOOKEEPER_VERSION=\"3.4.8\" -isystem /usr/include/subversion-1 -isystem /usr/include/apr-1 -isystem /usr/include/apr-1.0	       -pthread -Wall -Wsign-compare -Wformat-security -fstack-protector -fPIC -fPIE -g1 -O0 -Wno-unused-local-typedefs -std=c++11 -MT tests/mesos_tests-anonymous_tests.o -MD -MP -MF tests/.deps/mesos_tests-anonymous_tests.Tpo -c -o tests/mesos_tests-anonymous_tests.o `test -f 'tests/anonymous_tests.cpp' || echo '../../src/'`tests/anonymous_tests.cpp
mv -f examples/.deps/load_generator_framework-load_generator_framework.Tpo examples/.deps/load_generator_framework-load_generator_framework.Po
g++ -DPACKAGE_NAME=\"mesos\" -DPACKAGE_TARNAME=\"mesos\" -DPACKAGE_VERSION=\"1.5.0\" -DPACKAGE_STRING=\"mesos\ 1.5.0\" -DPACKAGE_BUGREPORT=\"\" -DPACKAGE_URL=\"\" -DPACKAGE=\"mesos\" -DVERSION=\"1.5.0\" -DSTDC_HEADERS=1 -DHAVE_SYS_TYPES_H=1 -DHAVE_SYS_STAT_H=1 -DHAVE_STDLIB_H=1 -DHAVE_STRING_H=1 -DHAVE_MEMORY_H=1 -DHAVE_STRINGS_H=1 -DHAVE_INTTYPES_H=1 -DHAVE_STDINT_H=1 -DHAVE_UNISTD_H=1 -DHAVE_DLFCN_H=1 -DLT_OBJDIR=\".libs/\" -DHAVE_CXX11=1 -DHAVE_PTHREAD_PRIO_INHERIT=1 -DHAVE_PTHREAD=1 -DHAVE_FTS_H=1 -DHAVE_APR_POOLS_H=1 -DHAVE_LIBAPR_1=1 -DHAVE_LIBCURL=1 -DMESOS_HAS_JAVA=1 -DHAVE_LIBSASL2=1 -DHAVE_OPENSSL_SSL_H=1 -DHAVE_SVN_VERSION_H=1 -DHAVE_LIBSVN_SUBR_1=1 -DHAVE_SVN_DELTA_H=1 -DHAVE_LIBSVN_DELTA_1=1 -DHAVE_ZLIB_H=1 -DHAVE_LIBZ=1 -DHAVE_PYTHON=\"2.7\" -DMESOS_HAS_PYTHON=1 -I. -I../../src   -Werror -DLIBDIR=\"/mesos/mesos-1.5.0/_inst/lib\" -DPKGLIBEXECDIR=\"/mesos/mesos-1.5.0/_inst/libexec/mesos\" -DPKGDATADIR=\"/mesos/mesos-1.5.0/_inst/share/mesos\" -DPKGMODULEDIR=\"/mesos/mesos-1.5.0/_inst/lib/mesos/modules\" -I../../include -I../include -I../include/mesos -DPICOJSON_USE_INT64 -D__STDC_FORMAT_MACROS -isystem ../3rdparty/boost-1.53.0 -isystem ../3rdparty/concurrentqueue-1.0.0-beta -I../3rdparty/elfio-3.2 -I../3rdparty/glog-0.3.3/src -I../3rdparty/leveldb-1.19/include -I../../3rdparty/libprocess/include -I../3rdparty/nvml-352.79 -I../3rdparty/picojson-1.3.0 -I../3rdparty/protobuf-3.3.0/src -I../../3rdparty/stout/include -I../3rdparty/zookeeper-3.4.8/src/c/include -I../3rdparty/zookeeper-3.4.8/src/c/generated -DHAS_AUTHENTICATION=1 -DSOURCE_DIR=\"/mesos/mesos-1.5.0/_build/..\" -DBUILD_DIR=\"/mesos/mesos-1.5.0/_build\" -I../3rdparty/googletest-release-1.8.0/googletest/include -isystem ../3rdparty/googletest-release-1.8.0/googlemock/include -DTESTLIBEXECDIR=\"/mesos/mesos-1.5.0/_inst/libexec/mesos/tests\" -DSBINDIR=\"/mesos/mesos-1.5.0/_inst/sbin\" -isystem /usr/lib/jvm/java-7-openjdk-amd64/include -isystem /usr/lib/jvm/java-7-openjdk-amd64/include/linux -DZOOKEEPER_VERSION=\"3.4.8\" -isystem /usr/include/subversion-1 -isystem /usr/include/apr-1 -isystem /usr/include/apr-1.0	       -pthread -Wall -Wsign-compare -Wformat-security -fstack-protector -fPIC -fPIE -g1 -O0 -Wno-unused-local-typedefs -std=c++11 -MT tests/mesos_tests-api_tests.o -MD -MP -MF tests/.deps/mesos_tests-api_tests.Tpo -c -o tests/mesos_tests-api_tests.o `test -f 'tests/api_tests.cpp' || echo '../../src/'`tests/api_tests.cpp
mv -f examples/.deps/persistent_volume_framework-persistent_volume_framework.Tpo examples/.deps/persistent_volume_framework-persistent_volume_framework.Po
g++ -DPACKAGE_NAME=\"mesos\" -DPACKAGE_TARNAME=\"mesos\" -DPACKAGE_VERSION=\"1.5.0\" -DPACKAGE_STRING=\"mesos\ 1.5.0\" -DPACKAGE_BUGREPORT=\"\" -DPACKAGE_URL=\"\" -DPACKAGE=\"mesos\" -DVERSION=\"1.5.0\" -DSTDC_HEADERS=1 -DHAVE_SYS_TYPES_H=1 -DHAVE_SYS_STAT_H=1 -DHAVE_STDLIB_H=1 -DHAVE_STRING_H=1 -DHAVE_MEMORY_H=1 -DHAVE_STRINGS_H=1 -DHAVE_INTTYPES_H=1 -DHAVE_STDINT_H=1 -DHAVE_UNISTD_H=1 -DHAVE_DLFCN_H=1 -DLT_OBJDIR=\".libs/\" -DHAVE_CXX11=1 -DHAVE_PTHREAD_PRIO_INHERIT=1 -DHAVE_PTHREAD=1 -DHAVE_FTS_H=1 -DHAVE_APR_POOLS_H=1 -DHAVE_LIBAPR_1=1 -DHAVE_LIBCURL=1 -DMESOS_HAS_JAVA=1 -DHAVE_LIBSASL2=1 -DHAVE_OPENSSL_SSL_H=1 -DHAVE_SVN_VERSION_H=1 -DHAVE_LIBSVN_SUBR_1=1 -DHAVE_SVN_DELTA_H=1 -DHAVE_LIBSVN_DELTA_1=1 -DHAVE_ZLIB_H=1 -DHAVE_LIBZ=1 -DHAVE_PYTHON=\"2.7\" -DMESOS_HAS_PYTHON=1 -I. -I../../src   -Werror -DLIBDIR=\"/mesos/mesos-1.5.0/_inst/lib\" -DPKGLIBEXECDIR=\"/mesos/mesos-1.5.0/_inst/libexec/mesos\" -DPKGDATADIR=\"/mesos/mesos-1.5.0/_inst/share/mesos\" -DPKGMODULEDIR=\"/mesos/mesos-1.5.0/_inst/lib/mesos/modules\" -I../../include -I../include -I../include/mesos -DPICOJSON_USE_INT64 -D__STDC_FORMAT_MACROS -isystem ../3rdparty/boost-1.53.0 -isystem ../3rdparty/concurrentqueue-1.0.0-beta -I../3rdparty/elfio-3.2 -I../3rdparty/glog-0.3.3/src -I../3rdparty/leveldb-1.19/include -I../../3rdparty/libprocess/include -I../3rdparty/nvml-352.79 -I../3rdparty/picojson-1.3.0 -I../3rdparty/protobuf-3.3.0/src -I../../3rdparty/stout/include -I../3rdparty/zookeeper-3.4.8/src/c/include -I../3rdparty/zookeeper-3.4.8/src/c/generated -DHAS_AUTHENTICATION=1 -DSOURCE_DIR=\"/mesos/mesos-1.5.0/_build/..\" -DBUILD_DIR=\"/mesos/mesos-1.5.0/_build\" -I../3rdparty/googletest-release-1.8.0/googletest/include -isystem ../3rdparty/googletest-release-1.8.0/googlemock/include -DTESTLIBEXECDIR=\"/mesos/mesos-1.5.0/_inst/libexec/mesos/tests\" -DSBINDIR=\"/mesos/mesos-1.5.0/_inst/sbin\" -isystem /usr/lib/jvm/java-7-openjdk-amd64/include -isystem /usr/lib/jvm/java-7-openjdk-amd64/include/linux -DZOOKEEPER_VERSION=\"3.4.8\" -isystem /usr/include/subversion-1 -isystem /usr/include/apr-1 -isystem /usr/include/apr-1.0	       -pthread -Wall -Wsign-compare -Wformat-security -fstack-protector -fPIC -fPIE -g1 -O0 -Wno-unused-local-typedefs -std=c++11 -MT tests/mesos_tests-attributes_tests.o -MD -MP -MF tests/.deps/mesos_tests-attributes_tests.Tpo -c -o tests/mesos_tests-attributes_tests.o `test -f 'tests/attributes_tests.cpp' || echo '../../src/'`tests/attributes_tests.cpp
mv -f examples/.deps/balloon_framework-balloon_framework.Tpo examples/.deps/balloon_framework-balloon_framework.Po
g++ -DPACKAGE_NAME=\"mesos\" -DPACKAGE_TARNAME=\"mesos\" -DPACKAGE_VERSION=\"1.5.0\" -DPACKAGE_STRING=\"mesos\ 1.5.0\" -DPACKAGE_BUGREPORT=\"\" -DPACKAGE_URL=\"\" -DPACKAGE=\"mesos\" -DVERSION=\"1.5.0\" -DSTDC_HEADERS=1 -DHAVE_SYS_TYPES_H=1 -DHAVE_SYS_STAT_H=1 -DHAVE_STDLIB_H=1 -DHAVE_STRING_H=1 -DHAVE_MEMORY_H=1 -DHAVE_STRINGS_H=1 -DHAVE_INTTYPES_H=1 -DHAVE_STDINT_H=1 -DHAVE_UNISTD_H=1 -DHAVE_DLFCN_H=1 -DLT_OBJDIR=\".libs/\" -DHAVE_CXX11=1 -DHAVE_PTHREAD_PRIO_INHERIT=1 -DHAVE_PTHREAD=1 -DHAVE_FTS_H=1 -DHAVE_APR_POOLS_H=1 -DHAVE_LIBAPR_1=1 -DHAVE_LIBCURL=1 -DMESOS_HAS_JAVA=1 -DHAVE_LIBSASL2=1 -DHAVE_OPENSSL_SSL_H=1 -DHAVE_SVN_VERSION_H=1 -DHAVE_LIBSVN_SUBR_1=1 -DHAVE_SVN_DELTA_H=1 -DHAVE_LIBSVN_DELTA_1=1 -DHAVE_ZLIB_H=1 -DHAVE_LIBZ=1 -DHAVE_PYTHON=\"2.7\" -DMESOS_HAS_PYTHON=1 -I. -I../../src   -Werror -DLIBDIR=\"/mesos/mesos-1.5.0/_inst/lib\" -DPKGLIBEXECDIR=\"/mesos/mesos-1.5.0/_inst/libexec/mesos\" -DPKGDATADIR=\"/mesos/mesos-1.5.0/_inst/share/mesos\" -DPKGMODULEDIR=\"/mesos/mesos-1.5.0/_inst/lib/mesos/modules\" -I../../include -I../include -I../include/mesos -DPICOJSON_USE_INT64 -D__STDC_FORMAT_MACROS -isystem ../3rdparty/boost-1.53.0 -isystem ../3rdparty/concurrentqueue-1.0.0-beta -I../3rdparty/elfio-3.2 -I../3rdparty/glog-0.3.3/src -I../3rdparty/leveldb-1.19/include -I../../3rdparty/libprocess/include -I../3rdparty/nvml-352.79 -I../3rdparty/picojson-1.3.0 -I../3rdparty/protobuf-3.3.0/src -I../../3rdparty/stout/include -I../3rdparty/zookeeper-3.4.8/src/c/include -I../3rdparty/zookeeper-3.4.8/src/c/generated -DHAS_AUTHENTICATION=1 -DSOURCE_DIR=\"/mesos/mesos-1.5.0/_build/..\" -DBUILD_DIR=\"/mesos/mesos-1.5.0/_build\" -I../3rdparty/googletest-release-1.8.0/googletest/include -isystem ../3rdparty/googletest-release-1.8.0/googlemock/include -DTESTLIBEXECDIR=\"/mesos/mesos-1.5.0/_inst/libexec/mesos/tests\" -DSBINDIR=\"/mesos/mesos-1.5.0/_inst/sbin\" -isystem /usr/lib/jvm/java-7-openjdk-amd64/include -isystem /usr/lib/jvm/java-7-openjdk-amd64/include/linux -DZOOKEEPER_VERSION=\"3.4.8\" -isystem /usr/include/subversion-1 -isystem /usr/include/apr-1 -isystem /usr/include/apr-1.0	       -pthread -Wall -Wsign-compare -Wformat-security -fstack-protector -fPIC -fPIE -g1 -O0 -Wno-unused-local-typedefs -std=c++11 -MT tests/mesos_tests-authentication_tests.o -MD -MP -MF tests/.deps/mesos_tests-authentication_tests.Tpo -c -o tests/mesos_tests-authentication_tests.o `test -f 'tests/authentication_tests.cpp' || echo '../../src/'`tests/authentication_tests.cpp
mv -f slave/qos_controllers/.deps/mesos_tests-load.Tpo slave/qos_controllers/.deps/mesos_tests-load.Po
g++ -DPACKAGE_NAME=\"mesos\" -DPACKAGE_TARNAME=\"mesos\" -DPACKAGE_VERSION=\"1.5.0\" -DPACKAGE_STRING=\"mesos\ 1.5.0\" -DPACKAGE_BUGREPORT=\"\" -DPACKAGE_URL=\"\" -DPACKAGE=\"mesos\" -DVERSION=\"1.5.0\" -DSTDC_HEADERS=1 -DHAVE_SYS_TYPES_H=1 -DHAVE_SYS_STAT_H=1 -DHAVE_STDLIB_H=1 -DHAVE_STRING_H=1 -DHAVE_MEMORY_H=1 -DHAVE_STRINGS_H=1 -DHAVE_INTTYPES_H=1 -DHAVE_STDINT_H=1 -DHAVE_UNISTD_H=1 -DHAVE_DLFCN_H=1 -DLT_OBJDIR=\".libs/\" -DHAVE_CXX11=1 -DHAVE_PTHREAD_PRIO_INHERIT=1 -DHAVE_PTHREAD=1 -DHAVE_FTS_H=1 -DHAVE_APR_POOLS_H=1 -DHAVE_LIBAPR_1=1 -DHAVE_LIBCURL=1 -DMESOS_HAS_JAVA=1 -DHAVE_LIBSASL2=1 -DHAVE_OPENSSL_SSL_H=1 -DHAVE_SVN_VERSION_H=1 -DHAVE_LIBSVN_SUBR_1=1 -DHAVE_SVN_DELTA_H=1 -DHAVE_LIBSVN_DELTA_1=1 -DHAVE_ZLIB_H=1 -DHAVE_LIBZ=1 -DHAVE_PYTHON=\"2.7\" -DMESOS_HAS_PYTHON=1 -I. -I../../src   -Werror -DLIBDIR=\"/mesos/mesos-1.5.0/_inst/lib\" -DPKGLIBEXECDIR=\"/mesos/mesos-1.5.0/_inst/libexec/mesos\" -DPKGDATADIR=\"/mesos/mesos-1.5.0/_inst/share/mesos\" -DPKGMODULEDIR=\"/mesos/mesos-1.5.0/_inst/lib/mesos/modules\" -I../../include -I../include -I../include/mesos -DPICOJSON_USE_INT64 -D__STDC_FORMAT_MACROS -isystem ../3rdparty/boost-1.53.0 -isystem ../3rdparty/concurrentqueue-1.0.0-beta -I../3rdparty/elfio-3.2 -I../3rdparty/glog-0.3.3/src -I../3rdparty/leveldb-1.19/include -I../../3rdparty/libprocess/include -I../3rdparty/nvml-352.79 -I../3rdparty/picojson-1.3.0 -I../3rdparty/protobuf-3.3.0/src -I../../3rdparty/stout/include -I../3rdparty/zookeeper-3.4.8/src/c/include -I../3rdparty/zookeeper-3.4.8/src/c/generated -DHAS_AUTHENTICATION=1 -DSOURCE_DIR=\"/mesos/mesos-1.5.0/_build/..\" -DBUILD_DIR=\"/mesos/mesos-1.5.0/_build\" -I../3rdparty/googletest-release-1.8.0/googletest/include -isystem ../3rdparty/googletest-release-1.8.0/googlemock/include -DTESTLIBEXECDIR=\"/mesos/mesos-1.5.0/_inst/libexec/mesos/tests\" -DSBINDIR=\"/mesos/mesos-1.5.0/_inst/sbin\" -isystem /usr/lib/jvm/java-7-openjdk-amd64/include -isystem /usr/lib/jvm/java-7-openjdk-amd64/include/linux -DZOOKEEPER_VERSION=\"3.4.8\" -isystem /usr/include/subversion-1 -isystem /usr/include/apr-1 -isystem /usr/include/apr-1.0	       -pthread -Wall -Wsign-compare -Wformat-security -fstack-protector -fPIC -fPIE -g1 -O0 -Wno-unused-local-typedefs -std=c++11 -MT tests/mesos_tests-authorization_tests.o -MD -MP -MF tests/.deps/mesos_tests-authorization_tests.Tpo -c -o tests/mesos_tests-authorization_tests.o `test -f 'tests/authorization_tests.cpp' || echo '../../src/'`tests/authorization_tests.cpp
mv -f tests/.deps/mesos_tests-attributes_tests.Tpo tests/.deps/mesos_tests-attributes_tests.Po
g++ -DPACKAGE_NAME=\"mesos\" -DPACKAGE_TARNAME=\"mesos\" -DPACKAGE_VERSION=\"1.5.0\" -DPACKAGE_STRING=\"mesos\ 1.5.0\" -DPACKAGE_BUGREPORT=\"\" -DPACKAGE_URL=\"\" -DPACKAGE=\"mesos\" -DVERSION=\"1.5.0\" -DSTDC_HEADERS=1 -DHAVE_SYS_TYPES_H=1 -DHAVE_SYS_STAT_H=1 -DHAVE_STDLIB_H=1 -DHAVE_STRING_H=1 -DHAVE_MEMORY_H=1 -DHAVE_STRINGS_H=1 -DHAVE_INTTYPES_H=1 -DHAVE_STDINT_H=1 -DHAVE_UNISTD_H=1 -DHAVE_DLFCN_H=1 -DLT_OBJDIR=\".libs/\" -DHAVE_CXX11=1 -DHAVE_PTHREAD_PRIO_INHERIT=1 -DHAVE_PTHREAD=1 -DHAVE_FTS_H=1 -DHAVE_APR_POOLS_H=1 -DHAVE_LIBAPR_1=1 -DHAVE_LIBCURL=1 -DMESOS_HAS_JAVA=1 -DHAVE_LIBSASL2=1 -DHAVE_OPENSSL_SSL_H=1 -DHAVE_SVN_VERSION_H=1 -DHAVE_LIBSVN_SUBR_1=1 -DHAVE_SVN_DELTA_H=1 -DHAVE_LIBSVN_DELTA_1=1 -DHAVE_ZLIB_H=1 -DHAVE_LIBZ=1 -DHAVE_PYTHON=\"2.7\" -DMESOS_HAS_PYTHON=1 -I. -I../../src   -Werror -DLIBDIR=\"/mesos/mesos-1.5.0/_inst/lib\" -DPKGLIBEXECDIR=\"/mesos/mesos-1.5.0/_inst/libexec/mesos\" -DPKGDATADIR=\"/mesos/mesos-1.5.0/_inst/share/mesos\" -DPKGMODULEDIR=\"/mesos/mesos-1.5.0/_inst/lib/mesos/modules\" -I../../include -I../include -I../include/mesos -DPICOJSON_USE_INT64 -D__STDC_FORMAT_MACROS -isystem ../3rdparty/boost-1.53.0 -isystem ../3rdparty/concurrentqueue-1.0.0-beta -I../3rdparty/elfio-3.2 -I../3rdparty/glog-0.3.3/src -I../3rdparty/leveldb-1.19/include -I../../3rdparty/libprocess/include -I../3rdparty/nvml-352.79 -I../3rdparty/picojson-1.3.0 -I../3rdparty/protobuf-3.3.0/src -I../../3rdparty/stout/include -I../3rdparty/zookeeper-3.4.8/src/c/include -I../3rdparty/zookeeper-3.4.8/src/c/generated -DHAS_AUTHENTICATION=1 -DSOURCE_DIR=\"/mesos/mesos-1.5.0/_build/..\" -DBUILD_DIR=\"/mesos/mesos-1.5.0/_build\" -I../3rdparty/googletest-release-1.8.0/googletest/include -isystem ../3rdparty/googletest-release-1.8.0/googlemock/include -DTESTLIBEXECDIR=\"/mesos/mesos-1.5.0/_inst/libexec/mesos/tests\" -DSBINDIR=\"/mesos/mesos-1.5.0/_inst/sbin\" -isystem /usr/lib/jvm/java-7-openjdk-amd64/include -isystem /usr/lib/jvm/java-7-openjdk-amd64/include/linux -DZOOKEEPER_VERSION=\"3.4.8\" -isystem /usr/include/subversion-1 -isystem /usr/include/apr-1 -isystem /usr/include/apr-1.0	       -pthread -Wall -Wsign-compare -Wformat-security -fstack-protector -fPIC -fPIE -g1 -O0 -Wno-unused-local-typedefs -std=c++11 -MT tests/mesos_tests-check_tests.o -MD -MP -MF tests/.deps/mesos_tests-check_tests.Tpo -c -o tests/mesos_tests-check_tests.o `test -f 'tests/check_tests.cpp' || echo '../../src/'`tests/check_tests.cpp
mv -f examples/.deps/disk_full_framework-disk_full_framework.Tpo examples/.deps/disk_full_framework-disk_full_framework.Po
g++ -DPACKAGE_NAME=\"mesos\" -DPACKAGE_TARNAME=\"mesos\" -DPACKAGE_VERSION=\"1.5.0\" -DPACKAGE_STRING=\"mesos\ 1.5.0\" -DPACKAGE_BUGREPORT=\"\" -DPACKAGE_URL=\"\" -DPACKAGE=\"mesos\" -DVERSION=\"1.5.0\" -DSTDC_HEADERS=1 -DHAVE_SYS_TYPES_H=1 -DHAVE_SYS_STAT_H=1 -DHAVE_STDLIB_H=1 -DHAVE_STRING_H=1 -DHAVE_MEMORY_H=1 -DHAVE_STRINGS_H=1 -DHAVE_INTTYPES_H=1 -DHAVE_STDINT_H=1 -DHAVE_UNISTD_H=1 -DHAVE_DLFCN_H=1 -DLT_OBJDIR=\".libs/\" -DHAVE_CXX11=1 -DHAVE_PTHREAD_PRIO_INHERIT=1 -DHAVE_PTHREAD=1 -DHAVE_FTS_H=1 -DHAVE_APR_POOLS_H=1 -DHAVE_LIBAPR_1=1 -DHAVE_LIBCURL=1 -DMESOS_HAS_JAVA=1 -DHAVE_LIBSASL2=1 -DHAVE_OPENSSL_SSL_H=1 -DHAVE_SVN_VERSION_H=1 -DHAVE_LIBSVN_SUBR_1=1 -DHAVE_SVN_DELTA_H=1 -DHAVE_LIBSVN_DELTA_1=1 -DHAVE_ZLIB_H=1 -DHAVE_LIBZ=1 -DHAVE_PYTHON=\"2.7\" -DMESOS_HAS_PYTHON=1 -I. -I../../src   -Werror -DLIBDIR=\"/mesos/mesos-1.5.0/_inst/lib\" -DPKGLIBEXECDIR=\"/mesos/mesos-1.5.0/_inst/libexec/mesos\" -DPKGDATADIR=\"/mesos/mesos-1.5.0/_inst/share/mesos\" -DPKGMODULEDIR=\"/mesos/mesos-1.5.0/_inst/lib/mesos/modules\" -I../../include -I../include -I../include/mesos -DPICOJSON_USE_INT64 -D__STDC_FORMAT_MACROS -isystem ../3rdparty/boost-1.53.0 -isystem ../3rdparty/concurrentqueue-1.0.0-beta -I../3rdparty/elfio-3.2 -I../3rdparty/glog-0.3.3/src -I../3rdparty/leveldb-1.19/include -I../../3rdparty/libprocess/include -I../3rdparty/nvml-352.79 -I../3rdparty/picojson-1.3.0 -I../3rdparty/protobuf-3.3.0/src -I../../3rdparty/stout/include -I../3rdparty/zookeeper-3.4.8/src/c/include -I../3rdparty/zookeeper-3.4.8/src/c/generated -DHAS_AUTHENTICATION=1 -DSOURCE_DIR=\"/mesos/mesos-1.5.0/_build/..\" -DBUILD_DIR=\"/mesos/mesos-1.5.0/_build\" -I../3rdparty/googletest-release-1.8.0/googletest/include -isystem ../3rdparty/googletest-release-1.8.0/googlemock/include -DTESTLIBEXECDIR=\"/mesos/mesos-1.5.0/_inst/libexec/mesos/tests\" -DSBINDIR=\"/mesos/mesos-1.5.0/_inst/sbin\" -isystem /usr/lib/jvm/java-7-openjdk-amd64/include -isystem /usr/lib/jvm/java-7-openjdk-amd64/include/linux -DZOOKEEPER_VERSION=\"3.4.8\" -isystem /usr/include/subversion-1 -isystem /usr/include/apr-1 -isystem /usr/include/apr-1.0	       -pthread -Wall -Wsign-compare -Wformat-security -fstack-protector -fPIC -fPIE -g1 -O0 -Wno-unused-local-typedefs -std=c++11 -MT tests/mesos_tests-cluster.o -MD -MP -MF tests/.deps/mesos_tests-cluster.Tpo -c -o tests/mesos_tests-cluster.o `test -f 'tests/cluster.cpp' || echo '../../src/'`tests/cluster.cpp
mv -f tests/.deps/mesos_tests-anonymous_tests.Tpo tests/.deps/mesos_tests-anonymous_tests.Po
g++ -DPACKAGE_NAME=\"mesos\" -DPACKAGE_TARNAME=\"mesos\" -DPACKAGE_VERSION=\"1.5.0\" -DPACKAGE_STRING=\"mesos\ 1.5.0\" -DPACKAGE_BUGREPORT=\"\" -DPACKAGE_URL=\"\" -DPACKAGE=\"mesos\" -DVERSION=\"1.5.0\" -DSTDC_HEADERS=1 -DHAVE_SYS_TYPES_H=1 -DHAVE_SYS_STAT_H=1 -DHAVE_STDLIB_H=1 -DHAVE_STRING_H=1 -DHAVE_MEMORY_H=1 -DHAVE_STRINGS_H=1 -DHAVE_INTTYPES_H=1 -DHAVE_STDINT_H=1 -DHAVE_UNISTD_H=1 -DHAVE_DLFCN_H=1 -DLT_OBJDIR=\".libs/\" -DHAVE_CXX11=1 -DHAVE_PTHREAD_PRIO_INHERIT=1 -DHAVE_PTHREAD=1 -DHAVE_FTS_H=1 -DHAVE_APR_POOLS_H=1 -DHAVE_LIBAPR_1=1 -DHAVE_LIBCURL=1 -DMESOS_HAS_JAVA=1 -DHAVE_LIBSASL2=1 -DHAVE_OPENSSL_SSL_H=1 -DHAVE_SVN_VERSION_H=1 -DHAVE_LIBSVN_SUBR_1=1 -DHAVE_SVN_DELTA_H=1 -DHAVE_LIBSVN_DELTA_1=1 -DHAVE_ZLIB_H=1 -DHAVE_LIBZ=1 -DHAVE_PYTHON=\"2.7\" -DMESOS_HAS_PYTHON=1 -I. -I../../src   -Werror -DLIBDIR=\"/mesos/mesos-1.5.0/_inst/lib\" -DPKGLIBEXECDIR=\"/mesos/mesos-1.5.0/_inst/libexec/mesos\" -DPKGDATADIR=\"/mesos/mesos-1.5.0/_inst/share/mesos\" -DPKGMODULEDIR=\"/mesos/mesos-1.5.0/_inst/lib/mesos/modules\" -I../../include -I../include -I../include/mesos -DPICOJSON_USE_INT64 -D__STDC_FORMAT_MACROS -isystem ../3rdparty/boost-1.53.0 -isystem ../3rdparty/concurrentqueue-1.0.0-beta -I../3rdparty/elfio-3.2 -I../3rdparty/glog-0.3.3/src -I../3rdparty/leveldb-1.19/include -I../../3rdparty/libprocess/include -I../3rdparty/nvml-352.79 -I../3rdparty/picojson-1.3.0 -I../3rdparty/protobuf-3.3.0/src -I../../3rdparty/stout/include -I../3rdparty/zookeeper-3.4.8/src/c/include -I../3rdparty/zookeeper-3.4.8/src/c/generated -DHAS_AUTHENTICATION=1 -DSOURCE_DIR=\"/mesos/mesos-1.5.0/_build/..\" -DBUILD_DIR=\"/mesos/mesos-1.5.0/_build\" -I../3rdparty/googletest-release-1.8.0/googletest/include -isystem ../3rdparty/googletest-release-1.8.0/googlemock/include -DTESTLIBEXECDIR=\"/mesos/mesos-1.5.0/_inst/libexec/mesos/tests\" -DSBINDIR=\"/mesos/mesos-1.5.0/_inst/sbin\" -isystem /usr/lib/jvm/java-7-openjdk-amd64/include -isystem /usr/lib/jvm/java-7-openjdk-amd64/include/linux -DZOOKEEPER_VERSION=\"3.4.8\" -isystem /usr/include/subversion-1 -isystem /usr/include/apr-1 -isystem /usr/include/apr-1.0	       -pthread -Wall -Wsign-compare -Wformat-security -fstack-protector -fPIC -fPIE -g1 -O0 -Wno-unused-local-typedefs -std=c++11 -MT tests/mesos_tests-command_executor_tests.o -MD -MP -MF tests/.deps/mesos_tests-command_executor_tests.Tpo -c -o tests/mesos_tests-command_executor_tests.o `test -f 'tests/command_executor_tests.cpp' || echo '../../src/'`tests/command_executor_tests.cpp
mv -f tests/.deps/mesos_tests-authorization_tests.Tpo tests/.deps/mesos_tests-authorization_tests.Po
g++ -DPACKAGE_NAME=\"mesos\" -DPACKAGE_TARNAME=\"mesos\" -DPACKAGE_VERSION=\"1.5.0\" -DPACKAGE_STRING=\"mesos\ 1.5.0\" -DPACKAGE_BUGREPORT=\"\" -DPACKAGE_URL=\"\" -DPACKAGE=\"mesos\" -DVERSION=\"1.5.0\" -DSTDC_HEADERS=1 -DHAVE_SYS_TYPES_H=1 -DHAVE_SYS_STAT_H=1 -DHAVE_STDLIB_H=1 -DHAVE_STRING_H=1 -DHAVE_MEMORY_H=1 -DHAVE_STRINGS_H=1 -DHAVE_INTTYPES_H=1 -DHAVE_STDINT_H=1 -DHAVE_UNISTD_H=1 -DHAVE_DLFCN_H=1 -DLT_OBJDIR=\".libs/\" -DHAVE_CXX11=1 -DHAVE_PTHREAD_PRIO_INHERIT=1 -DHAVE_PTHREAD=1 -DHAVE_FTS_H=1 -DHAVE_APR_POOLS_H=1 -DHAVE_LIBAPR_1=1 -DHAVE_LIBCURL=1 -DMESOS_HAS_JAVA=1 -DHAVE_LIBSASL2=1 -DHAVE_OPENSSL_SSL_H=1 -DHAVE_SVN_VERSION_H=1 -DHAVE_LIBSVN_SUBR_1=1 -DHAVE_SVN_DELTA_H=1 -DHAVE_LIBSVN_DELTA_1=1 -DHAVE_ZLIB_H=1 -DHAVE_LIBZ=1 -DHAVE_PYTHON=\"2.7\" -DMESOS_HAS_PYTHON=1 -I. -I../../src   -Werror -DLIBDIR=\"/mesos/mesos-1.5.0/_inst/lib\" -DPKGLIBEXECDIR=\"/mesos/mesos-1.5.0/_inst/libexec/mesos\" -DPKGDATADIR=\"/mesos/mesos-1.5.0/_inst/share/mesos\" -DPKGMODULEDIR=\"/mesos/mesos-1.5.0/_inst/lib/mesos/modules\" -I../../include -I../include -I../include/mesos -DPICOJSON_USE_INT64 -D__STDC_FORMAT_MACROS -isystem ../3rdparty/boost-1.53.0 -isystem ../3rdparty/concurrentqueue-1.0.0-beta -I../3rdparty/elfio-3.2 -I../3rdparty/glog-0.3.3/src -I../3rdparty/leveldb-1.19/include -I../../3rdparty/libprocess/include -I../3rdparty/nvml-352.79 -I../3rdparty/picojson-1.3.0 -I../3rdparty/protobuf-3.3.0/src -I../../3rdparty/stout/include -I../3rdparty/zookeeper-3.4.8/src/c/include -I../3rdparty/zookeeper-3.4.8/src/c/generated -DHAS_AUTHENTICATION=1 -DSOURCE_DIR=\"/mesos/mesos-1.5.0/_build/..\" -DBUILD_DIR=\"/mesos/mesos-1.5.0/_build\" -I../3rdparty/googletest-release-1.8.0/googletest/include -isystem ../3rdparty/googletest-release-1.8.0/googlemock/include -DTESTLIBEXECDIR=\"/mesos/mesos-1.5.0/_inst/libexec/mesos/tests\" -DSBINDIR=\"/mesos/mesos-1.5.0/_inst/sbin\" -isystem /usr/lib/jvm/java-7-openjdk-amd64/include -isystem /usr/lib/jvm/java-7-openjdk-amd64/include/linux -DZOOKEEPER_VERSION=\"3.4.8\" -isystem /usr/include/subversion-1 -isystem /usr/include/apr-1 -isystem /usr/include/apr-1.0	       -pthread -Wall -Wsign-compare -Wformat-security -fstack-protector -fPIC -fPIE -g1 -O0 -Wno-unused-local-typedefs -std=c++11 -MT tests/mesos_tests-container_logger_tests.o -MD -MP -MF tests/.deps/mesos_tests-container_logger_tests.Tpo -c -o tests/mesos_tests-container_logger_tests.o `test -f 'tests/container_logger_tests.cpp' || echo '../../src/'`tests/container_logger_tests.cpp
mv -f tests/.deps/mesos_tests-authentication_tests.Tpo tests/.deps/mesos_tests-authentication_tests.Po
g++ -DPACKAGE_NAME=\"mesos\" -DPACKAGE_TARNAME=\"mesos\" -DPACKAGE_VERSION=\"1.5.0\" -DPACKAGE_STRING=\"mesos\ 1.5.0\" -DPACKAGE_BUGREPORT=\"\" -DPACKAGE_URL=\"\" -DPACKAGE=\"mesos\" -DVERSION=\"1.5.0\" -DSTDC_HEADERS=1 -DHAVE_SYS_TYPES_H=1 -DHAVE_SYS_STAT_H=1 -DHAVE_STDLIB_H=1 -DHAVE_STRING_H=1 -DHAVE_MEMORY_H=1 -DHAVE_STRINGS_H=1 -DHAVE_INTTYPES_H=1 -DHAVE_STDINT_H=1 -DHAVE_UNISTD_H=1 -DHAVE_DLFCN_H=1 -DLT_OBJDIR=\".libs/\" -DHAVE_CXX11=1 -DHAVE_PTHREAD_PRIO_INHERIT=1 -DHAVE_PTHREAD=1 -DHAVE_FTS_H=1 -DHAVE_APR_POOLS_H=1 -DHAVE_LIBAPR_1=1 -DHAVE_LIBCURL=1 -DMESOS_HAS_JAVA=1 -DHAVE_LIBSASL2=1 -DHAVE_OPENSSL_SSL_H=1 -DHAVE_SVN_VERSION_H=1 -DHAVE_LIBSVN_SUBR_1=1 -DHAVE_SVN_DELTA_H=1 -DHAVE_LIBSVN_DELTA_1=1 -DHAVE_ZLIB_H=1 -DHAVE_LIBZ=1 -DHAVE_PYTHON=\"2.7\" -DMESOS_HAS_PYTHON=1 -I. -I../../src   -Werror -DLIBDIR=\"/mesos/mesos-1.5.0/_inst/lib\" -DPKGLIBEXECDIR=\"/mesos/mesos-1.5.0/_inst/libexec/mesos\" -DPKGDATADIR=\"/mesos/mesos-1.5.0/_inst/share/mesos\" -DPKGMODULEDIR=\"/mesos/mesos-1.5.0/_inst/lib/mesos/modules\" -I../../include -I../include -I../include/mesos -DPICOJSON_USE_INT64 -D__STDC_FORMAT_MACROS -isystem ../3rdparty/boost-1.53.0 -isystem ../3rdparty/concurrentqueue-1.0.0-beta -I../3rdparty/elfio-3.2 -I../3rdparty/glog-0.3.3/src -I../3rdparty/leveldb-1.19/include -I../../3rdparty/libprocess/include -I../3rdparty/nvml-352.79 -I../3rdparty/picojson-1.3.0 -I../3rdparty/protobuf-3.3.0/src -I../../3rdparty/stout/include -I../3rdparty/zookeeper-3.4.8/src/c/include -I../3rdparty/zookeeper-3.4.8/src/c/generated -DHAS_AUTHENTICATION=1 -DSOURCE_DIR=\"/mesos/mesos-1.5.0/_build/..\" -DBUILD_DIR=\"/mesos/mesos-1.5.0/_build\" -I../3rdparty/googletest-release-1.8.0/googletest/include -isystem ../3rdparty/googletest-release-1.8.0/googlemock/include -DTESTLIBEXECDIR=\"/mesos/mesos-1.5.0/_inst/libexec/mesos/tests\" -DSBINDIR=\"/mesos/mesos-1.5.0/_inst/sbin\" -isystem /usr/lib/jvm/java-7-openjdk-amd64/include -isystem /usr/lib/jvm/java-7-openjdk-amd64/include/linux -DZOOKEEPER_VERSION=\"3.4.8\" -isystem /usr/include/subversion-1 -isystem /usr/include/apr-1 -isystem /usr/include/apr-1.0	       -pthread -Wall -Wsign-compare -Wformat-security -fstack-protector -fPIC -fPIE -g1 -O0 -Wno-unused-local-typedefs -std=c++11 -MT tests/mesos_tests-containerizer.o -MD -MP -MF tests/.deps/mesos_tests-containerizer.Tpo -c -o tests/mesos_tests-containerizer.o `test -f 'tests/containerizer.cpp' || echo '../../src/'`tests/containerizer.cpp
mv -f tests/.deps/mesos_tests-cluster.Tpo tests/.deps/mesos_tests-cluster.Po
g++ -DPACKAGE_NAME=\"mesos\" -DPACKAGE_TARNAME=\"mesos\" -DPACKAGE_VERSION=\"1.5.0\" -DPACKAGE_STRING=\"mesos\ 1.5.0\" -DPACKAGE_BUGREPORT=\"\" -DPACKAGE_URL=\"\" -DPACKAGE=\"mesos\" -DVERSION=\"1.5.0\" -DSTDC_HEADERS=1 -DHAVE_SYS_TYPES_H=1 -DHAVE_SYS_STAT_H=1 -DHAVE_STDLIB_H=1 -DHAVE_STRING_H=1 -DHAVE_MEMORY_H=1 -DHAVE_STRINGS_H=1 -DHAVE_INTTYPES_H=1 -DHAVE_STDINT_H=1 -DHAVE_UNISTD_H=1 -DHAVE_DLFCN_H=1 -DLT_OBJDIR=\".libs/\" -DHAVE_CXX11=1 -DHAVE_PTHREAD_PRIO_INHERIT=1 -DHAVE_PTHREAD=1 -DHAVE_FTS_H=1 -DHAVE_APR_POOLS_H=1 -DHAVE_LIBAPR_1=1 -DHAVE_LIBCURL=1 -DMESOS_HAS_JAVA=1 -DHAVE_LIBSASL2=1 -DHAVE_OPENSSL_SSL_H=1 -DHAVE_SVN_VERSION_H=1 -DHAVE_LIBSVN_SUBR_1=1 -DHAVE_SVN_DELTA_H=1 -DHAVE_LIBSVN_DELTA_1=1 -DHAVE_ZLIB_H=1 -DHAVE_LIBZ=1 -DHAVE_PYTHON=\"2.7\" -DMESOS_HAS_PYTHON=1 -I. -I../../src   -Werror -DLIBDIR=\"/mesos/mesos-1.5.0/_inst/lib\" -DPKGLIBEXECDIR=\"/mesos/mesos-1.5.0/_inst/libexec/mesos\" -DPKGDATADIR=\"/mesos/mesos-1.5.0/_inst/share/mesos\" -DPKGMODULEDIR=\"/mesos/mesos-1.5.0/_inst/lib/mesos/modules\" -I../../include -I../include -I../include/mesos -DPICOJSON_USE_INT64 -D__STDC_FORMAT_MACROS -isystem ../3rdparty/boost-1.53.0 -isystem ../3rdparty/concurrentqueue-1.0.0-beta -I../3rdparty/elfio-3.2 -I../3rdparty/glog-0.3.3/src -I../3rdparty/leveldb-1.19/include -I../../3rdparty/libprocess/include -I../3rdparty/nvml-352.79 -I../3rdparty/picojson-1.3.0 -I../3rdparty/protobuf-3.3.0/src -I../../3rdparty/stout/include -I../3rdparty/zookeeper-3.4.8/src/c/include -I../3rdparty/zookeeper-3.4.8/src/c/generated -DHAS_AUTHENTICATION=1 -DSOURCE_DIR=\"/mesos/mesos-1.5.0/_build/..\" -DBUILD_DIR=\"/mesos/mesos-1.5.0/_build\" -I../3rdparty/googletest-release-1.8.0/googletest/include -isystem ../3rdparty/googletest-release-1.8.0/googlemock/include -DTESTLIBEXECDIR=\"/mesos/mesos-1.5.0/_inst/libexec/mesos/tests\" -DSBINDIR=\"/mesos/mesos-1.5.0/_inst/sbin\" -isystem /usr/lib/jvm/java-7-openjdk-amd64/include -isystem /usr/lib/jvm/java-7-openjdk-amd64/include/linux -DZOOKEEPER_VERSION=\"3.4.8\" -isystem /usr/include/subversion-1 -isystem /usr/include/apr-1 -isystem /usr/include/apr-1.0	       -pthread -Wall -Wsign-compare -Wformat-security -fstack-protector -fPIC -fPIE -g1 -O0 -Wno-unused-local-typedefs -std=c++11 -MT tests/mesos_tests-cram_md5_authentication_tests.o -MD -MP -MF tests/.deps/mesos_tests-cram_md5_authentication_tests.Tpo -c -o tests/mesos_tests-cram_md5_authentication_tests.o `test -f 'tests/cram_md5_authentication_tests.cpp' || echo '../../src/'`tests/cram_md5_authentication_tests.cpp
mv -f tests/.deps/mesos_tests-check_tests.Tpo tests/.deps/mesos_tests-check_tests.Po
g++ -DPACKAGE_NAME=\"mesos\" -DPACKAGE_TARNAME=\"mesos\" -DPACKAGE_VERSION=\"1.5.0\" -DPACKAGE_STRING=\"mesos\ 1.5.0\" -DPACKAGE_BUGREPORT=\"\" -DPACKAGE_URL=\"\" -DPACKAGE=\"mesos\" -DVERSION=\"1.5.0\" -DSTDC_HEADERS=1 -DHAVE_SYS_TYPES_H=1 -DHAVE_SYS_STAT_H=1 -DHAVE_STDLIB_H=1 -DHAVE_STRING_H=1 -DHAVE_MEMORY_H=1 -DHAVE_STRINGS_H=1 -DHAVE_INTTYPES_H=1 -DHAVE_STDINT_H=1 -DHAVE_UNISTD_H=1 -DHAVE_DLFCN_H=1 -DLT_OBJDIR=\".libs/\" -DHAVE_CXX11=1 -DHAVE_PTHREAD_PRIO_INHERIT=1 -DHAVE_PTHREAD=1 -DHAVE_FTS_H=1 -DHAVE_APR_POOLS_H=1 -DHAVE_LIBAPR_1=1 -DHAVE_LIBCURL=1 -DMESOS_HAS_JAVA=1 -DHAVE_LIBSASL2=1 -DHAVE_OPENSSL_SSL_H=1 -DHAVE_SVN_VERSION_H=1 -DHAVE_LIBSVN_SUBR_1=1 -DHAVE_SVN_DELTA_H=1 -DHAVE_LIBSVN_DELTA_1=1 -DHAVE_ZLIB_H=1 -DHAVE_LIBZ=1 -DHAVE_PYTHON=\"2.7\" -DMESOS_HAS_PYTHON=1 -I. -I../../src   -Werror -DLIBDIR=\"/mesos/mesos-1.5.0/_inst/lib\" -DPKGLIBEXECDIR=\"/mesos/mesos-1.5.0/_inst/libexec/mesos\" -DPKGDATADIR=\"/mesos/mesos-1.5.0/_inst/share/mesos\" -DPKGMODULEDIR=\"/mesos/mesos-1.5.0/_inst/lib/mesos/modules\" -I../../include -I../include -I../include/mesos -DPICOJSON_USE_INT64 -D__STDC_FORMAT_MACROS -isystem ../3rdparty/boost-1.53.0 -isystem ../3rdparty/concurrentqueue-1.0.0-beta -I../3rdparty/elfio-3.2 -I../3rdparty/glog-0.3.3/src -I../3rdparty/leveldb-1.19/include -I../../3rdparty/libprocess/include -I../3rdparty/nvml-352.79 -I../3rdparty/picojson-1.3.0 -I../3rdparty/protobuf-3.3.0/src -I../../3rdparty/stout/include -I../3rdparty/zookeeper-3.4.8/src/c/include -I../3rdparty/zookeeper-3.4.8/src/c/generated -DHAS_AUTHENTICATION=1 -DSOURCE_DIR=\"/mesos/mesos-1.5.0/_build/..\" -DBUILD_DIR=\"/mesos/mesos-1.5.0/_build\" -I../3rdparty/googletest-release-1.8.0/googletest/include -isystem ../3rdparty/googletest-release-1.8.0/googlemock/include -DTESTLIBEXECDIR=\"/mesos/mesos-1.5.0/_inst/libexec/mesos/tests\" -DSBINDIR=\"/mesos/mesos-1.5.0/_inst/sbin\" -isystem /usr/lib/jvm/java-7-openjdk-amd64/include -isystem /usr/lib/jvm/java-7-openjdk-amd64/include/linux -DZOOKEEPER_VERSION=\"3.4.8\" -isystem /usr/include/subversion-1 -isystem /usr/include/apr-1 -isystem /usr/include/apr-1.0	       -pthread -Wall -Wsign-compare -Wformat-security -fstack-protector -fPIC -fPIE -g1 -O0 -Wno-unused-local-typedefs -std=c++11 -MT tests/mesos_tests-credentials_tests.o -MD -MP -MF tests/.deps/mesos_tests-credentials_tests.Tpo -c -o tests/mesos_tests-credentials_tests.o `test -f 'tests/credentials_tests.cpp' || echo '../../src/'`tests/credentials_tests.cpp
mv -f tests/.deps/mesos_tests-command_executor_tests.Tpo tests/.deps/mesos_tests-command_executor_tests.Po
g++ -DPACKAGE_NAME=\"mesos\" -DPACKAGE_TARNAME=\"mesos\" -DPACKAGE_VERSION=\"1.5.0\" -DPACKAGE_STRING=\"mesos\ 1.5.0\" -DPACKAGE_BUGREPORT=\"\" -DPACKAGE_URL=\"\" -DPACKAGE=\"mesos\" -DVERSION=\"1.5.0\" -DSTDC_HEADERS=1 -DHAVE_SYS_TYPES_H=1 -DHAVE_SYS_STAT_H=1 -DHAVE_STDLIB_H=1 -DHAVE_STRING_H=1 -DHAVE_MEMORY_H=1 -DHAVE_STRINGS_H=1 -DHAVE_INTTYPES_H=1 -DHAVE_STDINT_H=1 -DHAVE_UNISTD_H=1 -DHAVE_DLFCN_H=1 -DLT_OBJDIR=\".libs/\" -DHAVE_CXX11=1 -DHAVE_PTHREAD_PRIO_INHERIT=1 -DHAVE_PTHREAD=1 -DHAVE_FTS_H=1 -DHAVE_APR_POOLS_H=1 -DHAVE_LIBAPR_1=1 -DHAVE_LIBCURL=1 -DMESOS_HAS_JAVA=1 -DHAVE_LIBSASL2=1 -DHAVE_OPENSSL_SSL_H=1 -DHAVE_SVN_VERSION_H=1 -DHAVE_LIBSVN_SUBR_1=1 -DHAVE_SVN_DELTA_H=1 -DHAVE_LIBSVN_DELTA_1=1 -DHAVE_ZLIB_H=1 -DHAVE_LIBZ=1 -DHAVE_PYTHON=\"2.7\" -DMESOS_HAS_PYTHON=1 -I. -I../../src   -Werror -DLIBDIR=\"/mesos/mesos-1.5.0/_inst/lib\" -DPKGLIBEXECDIR=\"/mesos/mesos-1.5.0/_inst/libexec/mesos\" -DPKGDATADIR=\"/mesos/mesos-1.5.0/_inst/share/mesos\" -DPKGMODULEDIR=\"/mesos/mesos-1.5.0/_inst/lib/mesos/modules\" -I../../include -I../include -I../include/mesos -DPICOJSON_USE_INT64 -D__STDC_FORMAT_MACROS -isystem ../3rdparty/boost-1.53.0 -isystem ../3rdparty/concurrentqueue-1.0.0-beta -I../3rdparty/elfio-3.2 -I../3rdparty/glog-0.3.3/src -I../3rdparty/leveldb-1.19/include -I../../3rdparty/libprocess/include -I../3rdparty/nvml-352.79 -I../3rdparty/picojson-1.3.0 -I../3rdparty/protobuf-3.3.0/src -I../../3rdparty/stout/include -I../3rdparty/zookeeper-3.4.8/src/c/include -I../3rdparty/zookeeper-3.4.8/src/c/generated -DHAS_AUTHENTICATION=1 -DSOURCE_DIR=\"/mesos/mesos-1.5.0/_build/..\" -DBUILD_DIR=\"/mesos/mesos-1.5.0/_build\" -I../3rdparty/googletest-release-1.8.0/googletest/include -isystem ../3rdparty/googletest-release-1.8.0/googlemock/include -DTESTLIBEXECDIR=\"/mesos/mesos-1.5.0/_inst/libexec/mesos/tests\" -DSBINDIR=\"/mesos/mesos-1.5.0/_inst/sbin\" -isystem /usr/lib/jvm/java-7-openjdk-amd64/include -isystem /usr/lib/jvm/java-7-openjdk-amd64/include/linux -DZOOKEEPER_VERSION=\"3.4.8\" -isystem /usr/include/subversion-1 -isystem /usr/include/apr-1 -isystem /usr/include/apr-1.0	       -pthread -Wall -Wsign-compare -Wformat-security -fstack-protector -fPIC -fPIE -g1 -O0 -Wno-unused-local-typedefs -std=c++11 -MT tests/mesos_tests-default_executor_tests.o -MD -MP -MF tests/.deps/mesos_tests-default_executor_tests.Tpo -c -o tests/mesos_tests-default_executor_tests.o `test -f 'tests/default_executor_tests.cpp' || echo '../../src/'`tests/default_executor_tests.cpp
mv -f tests/.deps/mesos_tests-credentials_tests.Tpo tests/.deps/mesos_tests-credentials_tests.Po
g++ -DPACKAGE_NAME=\"mesos\" -DPACKAGE_TARNAME=\"mesos\" -DPACKAGE_VERSION=\"1.5.0\" -DPACKAGE_STRING=\"mesos\ 1.5.0\" -DPACKAGE_BUGREPORT=\"\" -DPACKAGE_URL=\"\" -DPACKAGE=\"mesos\" -DVERSION=\"1.5.0\" -DSTDC_HEADERS=1 -DHAVE_SYS_TYPES_H=1 -DHAVE_SYS_STAT_H=1 -DHAVE_STDLIB_H=1 -DHAVE_STRING_H=1 -DHAVE_MEMORY_H=1 -DHAVE_STRINGS_H=1 -DHAVE_INTTYPES_H=1 -DHAVE_STDINT_H=1 -DHAVE_UNISTD_H=1 -DHAVE_DLFCN_H=1 -DLT_OBJDIR=\".libs/\" -DHAVE_CXX11=1 -DHAVE_PTHREAD_PRIO_INHERIT=1 -DHAVE_PTHREAD=1 -DHAVE_FTS_H=1 -DHAVE_APR_POOLS_H=1 -DHAVE_LIBAPR_1=1 -DHAVE_LIBCURL=1 -DMESOS_HAS_JAVA=1 -DHAVE_LIBSASL2=1 -DHAVE_OPENSSL_SSL_H=1 -DHAVE_SVN_VERSION_H=1 -DHAVE_LIBSVN_SUBR_1=1 -DHAVE_SVN_DELTA_H=1 -DHAVE_LIBSVN_DELTA_1=1 -DHAVE_ZLIB_H=1 -DHAVE_LIBZ=1 -DHAVE_PYTHON=\"2.7\" -DMESOS_HAS_PYTHON=1 -I. -I../../src   -Werror -DLIBDIR=\"/mesos/mesos-1.5.0/_inst/lib\" -DPKGLIBEXECDIR=\"/mesos/mesos-1.5.0/_inst/libexec/mesos\" -DPKGDATADIR=\"/mesos/mesos-1.5.0/_inst/share/mesos\" -DPKGMODULEDIR=\"/mesos/mesos-1.5.0/_inst/lib/mesos/modules\" -I../../include -I../include -I../include/mesos -DPICOJSON_USE_INT64 -D__STDC_FORMAT_MACROS -isystem ../3rdparty/boost-1.53.0 -isystem ../3rdparty/concurrentqueue-1.0.0-beta -I../3rdparty/elfio-3.2 -I../3rdparty/glog-0.3.3/src -I../3rdparty/leveldb-1.19/include -I../../3rdparty/libprocess/include -I../3rdparty/nvml-352.79 -I../3rdparty/picojson-1.3.0 -I../3rdparty/protobuf-3.3.0/src -I../../3rdparty/stout/include -I../3rdparty/zookeeper-3.4.8/src/c/include -I../3rdparty/zookeeper-3.4.8/src/c/generated -DHAS_AUTHENTICATION=1 -DSOURCE_DIR=\"/mesos/mesos-1.5.0/_build/..\" -DBUILD_DIR=\"/mesos/mesos-1.5.0/_build\" -I../3rdparty/googletest-release-1.8.0/googletest/include -isystem ../3rdparty/googletest-release-1.8.0/googlemock/include -DTESTLIBEXECDIR=\"/mesos/mesos-1.5.0/_inst/libexec/mesos/tests\" -DSBINDIR=\"/mesos/mesos-1.5.0/_inst/sbin\" -isystem /usr/lib/jvm/java-7-openjdk-amd64/include -isystem /usr/lib/jvm/java-7-openjdk-amd64/include/linux -DZOOKEEPER_VERSION=\"3.4.8\" -isystem /usr/include/subversion-1 -isystem /usr/include/apr-1 -isystem /usr/include/apr-1.0	       -pthread -Wall -Wsign-compare -Wformat-security -fstack-protector -fPIC -fPIE -g1 -O0 -Wno-unused-local-typedefs -std=c++11 -MT tests/mesos_tests-disk_quota_tests.o -MD -MP -MF tests/.deps/mesos_tests-disk_quota_tests.Tpo -c -o tests/mesos_tests-disk_quota_tests.o `test -f 'tests/disk_quota_tests.cpp' || echo '../../src/'`tests/disk_quota_tests.cpp
mv -f tests/.deps/mesos_tests-cram_md5_authentication_tests.Tpo tests/.deps/mesos_tests-cram_md5_authentication_tests.Po
g++ -DPACKAGE_NAME=\"mesos\" -DPACKAGE_TARNAME=\"mesos\" -DPACKAGE_VERSION=\"1.5.0\" -DPACKAGE_STRING=\"mesos\ 1.5.0\" -DPACKAGE_BUGREPORT=\"\" -DPACKAGE_URL=\"\" -DPACKAGE=\"mesos\" -DVERSION=\"1.5.0\" -DSTDC_HEADERS=1 -DHAVE_SYS_TYPES_H=1 -DHAVE_SYS_STAT_H=1 -DHAVE_STDLIB_H=1 -DHAVE_STRING_H=1 -DHAVE_MEMORY_H=1 -DHAVE_STRINGS_H=1 -DHAVE_INTTYPES_H=1 -DHAVE_STDINT_H=1 -DHAVE_UNISTD_H=1 -DHAVE_DLFCN_H=1 -DLT_OBJDIR=\".libs/\" -DHAVE_CXX11=1 -DHAVE_PTHREAD_PRIO_INHERIT=1 -DHAVE_PTHREAD=1 -DHAVE_FTS_H=1 -DHAVE_APR_POOLS_H=1 -DHAVE_LIBAPR_1=1 -DHAVE_LIBCURL=1 -DMESOS_HAS_JAVA=1 -DHAVE_LIBSASL2=1 -DHAVE_OPENSSL_SSL_H=1 -DHAVE_SVN_VERSION_H=1 -DHAVE_LIBSVN_SUBR_1=1 -DHAVE_SVN_DELTA_H=1 -DHAVE_LIBSVN_DELTA_1=1 -DHAVE_ZLIB_H=1 -DHAVE_LIBZ=1 -DHAVE_PYTHON=\"2.7\" -DMESOS_HAS_PYTHON=1 -I. -I../../src   -Werror -DLIBDIR=\"/mesos/mesos-1.5.0/_inst/lib\" -DPKGLIBEXECDIR=\"/mesos/mesos-1.5.0/_inst/libexec/mesos\" -DPKGDATADIR=\"/mesos/mesos-1.5.0/_inst/share/mesos\" -DPKGMODULEDIR=\"/mesos/mesos-1.5.0/_inst/lib/mesos/modules\" -I../../include -I../include -I../include/mesos -DPICOJSON_USE_INT64 -D__STDC_FORMAT_MACROS -isystem ../3rdparty/boost-1.53.0 -isystem ../3rdparty/concurrentqueue-1.0.0-beta -I../3rdparty/elfio-3.2 -I../3rdparty/glog-0.3.3/src -I../3rdparty/leveldb-1.19/include -I../../3rdparty/libprocess/include -I../3rdparty/nvml-352.79 -I../3rdparty/picojson-1.3.0 -I../3rdparty/protobuf-3.3.0/src -I../../3rdparty/stout/include -I../3rdparty/zookeeper-3.4.8/src/c/include -I../3rdparty/zookeeper-3.4.8/src/c/generated -DHAS_AUTHENTICATION=1 -DSOURCE_DIR=\"/mesos/mesos-1.5.0/_build/..\" -DBUILD_DIR=\"/mesos/mesos-1.5.0/_build\" -I../3rdparty/googletest-release-1.8.0/googletest/include -isystem ../3rdparty/googletest-release-1.8.0/googlemock/include -DTESTLIBEXECDIR=\"/mesos/mesos-1.5.0/_inst/libexec/mesos/tests\" -DSBINDIR=\"/mesos/mesos-1.5.0/_inst/sbin\" -isystem /usr/lib/jvm/java-7-openjdk-amd64/include -isystem /usr/lib/jvm/java-7-openjdk-amd64/include/linux -DZOOKEEPER_VERSION=\"3.4.8\" -isystem /usr/include/subversion-1 -isystem /usr/include/apr-1 -isystem /usr/include/apr-1.0	       -pthread -Wall -Wsign-compare -Wformat-security -fstack-protector -fPIC -fPIE -g1 -O0 -Wno-unused-local-typedefs -std=c++11 -MT tests/mesos_tests-dynamic_weights_tests.o -MD -MP -MF tests/.deps/mesos_tests-dynamic_weights_tests.Tpo -c -o tests/mesos_tests-dynamic_weights_tests.o `test -f 'tests/dynamic_weights_tests.cpp' || echo '../../src/'`tests/dynamic_weights_tests.cpp
mv -f tests/.deps/mesos_tests-container_logger_tests.Tpo tests/.deps/mesos_tests-container_logger_tests.Po
g++ -DPACKAGE_NAME=\"mesos\" -DPACKAGE_TARNAME=\"mesos\" -DPACKAGE_VERSION=\"1.5.0\" -DPACKAGE_STRING=\"mesos\ 1.5.0\" -DPACKAGE_BUGREPORT=\"\" -DPACKAGE_URL=\"\" -DPACKAGE=\"mesos\" -DVERSION=\"1.5.0\" -DSTDC_HEADERS=1 -DHAVE_SYS_TYPES_H=1 -DHAVE_SYS_STAT_H=1 -DHAVE_STDLIB_H=1 -DHAVE_STRING_H=1 -DHAVE_MEMORY_H=1 -DHAVE_STRINGS_H=1 -DHAVE_INTTYPES_H=1 -DHAVE_STDINT_H=1 -DHAVE_UNISTD_H=1 -DHAVE_DLFCN_H=1 -DLT_OBJDIR=\".libs/\" -DHAVE_CXX11=1 -DHAVE_PTHREAD_PRIO_INHERIT=1 -DHAVE_PTHREAD=1 -DHAVE_FTS_H=1 -DHAVE_APR_POOLS_H=1 -DHAVE_LIBAPR_1=1 -DHAVE_LIBCURL=1 -DMESOS_HAS_JAVA=1 -DHAVE_LIBSASL2=1 -DHAVE_OPENSSL_SSL_H=1 -DHAVE_SVN_VERSION_H=1 -DHAVE_LIBSVN_SUBR_1=1 -DHAVE_SVN_DELTA_H=1 -DHAVE_LIBSVN_DELTA_1=1 -DHAVE_ZLIB_H=1 -DHAVE_LIBZ=1 -DHAVE_PYTHON=\"2.7\" -DMESOS_HAS_PYTHON=1 -I. -I../../src   -Werror -DLIBDIR=\"/mesos/mesos-1.5.0/_inst/lib\" -DPKGLIBEXECDIR=\"/mesos/mesos-1.5.0/_inst/libexec/mesos\" -DPKGDATADIR=\"/mesos/mesos-1.5.0/_inst/share/mesos\" -DPKGMODULEDIR=\"/mesos/mesos-1.5.0/_inst/lib/mesos/modules\" -I../../include -I../include -I../include/mesos -DPICOJSON_USE_INT64 -D__STDC_FORMAT_MACROS -isystem ../3rdparty/boost-1.53.0 -isystem ../3rdparty/concurrentqueue-1.0.0-beta -I../3rdparty/elfio-3.2 -I../3rdparty/glog-0.3.3/src -I../3rdparty/leveldb-1.19/include -I../../3rdparty/libprocess/include -I../3rdparty/nvml-352.79 -I../3rdparty/picojson-1.3.0 -I../3rdparty/protobuf-3.3.0/src -I../../3rdparty/stout/include -I../3rdparty/zookeeper-3.4.8/src/c/include -I../3rdparty/zookeeper-3.4.8/src/c/generated -DHAS_AUTHENTICATION=1 -DSOURCE_DIR=\"/mesos/mesos-1.5.0/_build/..\" -DBUILD_DIR=\"/mesos/mesos-1.5.0/_build\" -I../3rdparty/googletest-release-1.8.0/googletest/include -isystem ../3rdparty/googletest-release-1.8.0/googlemock/include -DTESTLIBEXECDIR=\"/mesos/mesos-1.5.0/_inst/libexec/mesos/tests\" -DSBINDIR=\"/mesos/mesos-1.5.0/_inst/sbin\" -isystem /usr/lib/jvm/java-7-openjdk-amd64/include -isystem /usr/lib/jvm/java-7-openjdk-amd64/include/linux -DZOOKEEPER_VERSION=\"3.4.8\" -isystem /usr/include/subversion-1 -isystem /usr/include/apr-1 -isystem /usr/include/apr-1.0	       -pthread -Wall -Wsign-compare -Wformat-security -fstack-protector -fPIC -fPIE -g1 -O0 -Wno-unused-local-typedefs -std=c++11 -MT tests/mesos_tests-environment.o -MD -MP -MF tests/.deps/mesos_tests-environment.Tpo -c -o tests/mesos_tests-environment.o `test -f 'tests/environment.cpp' || echo '../../src/'`tests/environment.cpp
mv -f tests/.deps/mesos_tests-containerizer.Tpo tests/.deps/mesos_tests-containerizer.Po
g++ -DPACKAGE_NAME=\"mesos\" -DPACKAGE_TARNAME=\"mesos\" -DPACKAGE_VERSION=\"1.5.0\" -DPACKAGE_STRING=\"mesos\ 1.5.0\" -DPACKAGE_BUGREPORT=\"\" -DPACKAGE_URL=\"\" -DPACKAGE=\"mesos\" -DVERSION=\"1.5.0\" -DSTDC_HEADERS=1 -DHAVE_SYS_TYPES_H=1 -DHAVE_SYS_STAT_H=1 -DHAVE_STDLIB_H=1 -DHAVE_STRING_H=1 -DHAVE_MEMORY_H=1 -DHAVE_STRINGS_H=1 -DHAVE_INTTYPES_H=1 -DHAVE_STDINT_H=1 -DHAVE_UNISTD_H=1 -DHAVE_DLFCN_H=1 -DLT_OBJDIR=\".libs/\" -DHAVE_CXX11=1 -DHAVE_PTHREAD_PRIO_INHERIT=1 -DHAVE_PTHREAD=1 -DHAVE_FTS_H=1 -DHAVE_APR_POOLS_H=1 -DHAVE_LIBAPR_1=1 -DHAVE_LIBCURL=1 -DMESOS_HAS_JAVA=1 -DHAVE_LIBSASL2=1 -DHAVE_OPENSSL_SSL_H=1 -DHAVE_SVN_VERSION_H=1 -DHAVE_LIBSVN_SUBR_1=1 -DHAVE_SVN_DELTA_H=1 -DHAVE_LIBSVN_DELTA_1=1 -DHAVE_ZLIB_H=1 -DHAVE_LIBZ=1 -DHAVE_PYTHON=\"2.7\" -DMESOS_HAS_PYTHON=1 -I. -I../../src   -Werror -DLIBDIR=\"/mesos/mesos-1.5.0/_inst/lib\" -DPKGLIBEXECDIR=\"/mesos/mesos-1.5.0/_inst/libexec/mesos\" -DPKGDATADIR=\"/mesos/mesos-1.5.0/_inst/share/mesos\" -DPKGMODULEDIR=\"/mesos/mesos-1.5.0/_inst/lib/mesos/modules\" -I../../include -I../include -I../include/mesos -DPICOJSON_USE_INT64 -D__STDC_FORMAT_MACROS -isystem ../3rdparty/boost-1.53.0 -isystem ../3rdparty/concurrentqueue-1.0.0-beta -I../3rdparty/elfio-3.2 -I../3rdparty/glog-0.3.3/src -I../3rdparty/leveldb-1.19/include -I../../3rdparty/libprocess/include -I../3rdparty/nvml-352.79 -I../3rdparty/picojson-1.3.0 -I../3rdparty/protobuf-3.3.0/src -I../../3rdparty/stout/include -I../3rdparty/zookeeper-3.4.8/src/c/include -I../3rdparty/zookeeper-3.4.8/src/c/generated -DHAS_AUTHENTICATION=1 -DSOURCE_DIR=\"/mesos/mesos-1.5.0/_build/..\" -DBUILD_DIR=\"/mesos/mesos-1.5.0/_build\" -I../3rdparty/googletest-release-1.8.0/googletest/include -isystem ../3rdparty/googletest-release-1.8.0/googlemock/include -DTESTLIBEXECDIR=\"/mesos/mesos-1.5.0/_inst/libexec/mesos/tests\" -DSBINDIR=\"/mesos/mesos-1.5.0/_inst/sbin\" -isystem /usr/lib/jvm/java-7-openjdk-amd64/include -isystem /usr/lib/jvm/java-7-openjdk-amd64/include/linux -DZOOKEEPER_VERSION=\"3.4.8\" -isystem /usr/include/subversion-1 -isystem /usr/include/apr-1 -isystem /usr/include/apr-1.0	       -pthread -Wall -Wsign-compare -Wformat-security -fstack-protector -fPIC -fPIE -g1 -O0 -Wno-unused-local-typedefs -std=c++11 -MT tests/mesos_tests-examples_tests.o -MD -MP -MF tests/.deps/mesos_tests-examples_tests.Tpo -c -o tests/mesos_tests-examples_tests.o `test -f 'tests/examples_tests.cpp' || echo '../../src/'`tests/examples_tests.cpp
mv -f tests/.deps/mesos_tests-examples_tests.Tpo tests/.deps/mesos_tests-examples_tests.Po
g++ -DPACKAGE_NAME=\"mesos\" -DPACKAGE_TARNAME=\"mesos\" -DPACKAGE_VERSION=\"1.5.0\" -DPACKAGE_STRING=\"mesos\ 1.5.0\" -DPACKAGE_BUGREPORT=\"\" -DPACKAGE_URL=\"\" -DPACKAGE=\"mesos\" -DVERSION=\"1.5.0\" -DSTDC_HEADERS=1 -DHAVE_SYS_TYPES_H=1 -DHAVE_SYS_STAT_H=1 -DHAVE_STDLIB_H=1 -DHAVE_STRING_H=1 -DHAVE_MEMORY_H=1 -DHAVE_STRINGS_H=1 -DHAVE_INTTYPES_H=1 -DHAVE_STDINT_H=1 -DHAVE_UNISTD_H=1 -DHAVE_DLFCN_H=1 -DLT_OBJDIR=\".libs/\" -DHAVE_CXX11=1 -DHAVE_PTHREAD_PRIO_INHERIT=1 -DHAVE_PTHREAD=1 -DHAVE_FTS_H=1 -DHAVE_APR_POOLS_H=1 -DHAVE_LIBAPR_1=1 -DHAVE_LIBCURL=1 -DMESOS_HAS_JAVA=1 -DHAVE_LIBSASL2=1 -DHAVE_OPENSSL_SSL_H=1 -DHAVE_SVN_VERSION_H=1 -DHAVE_LIBSVN_SUBR_1=1 -DHAVE_SVN_DELTA_H=1 -DHAVE_LIBSVN_DELTA_1=1 -DHAVE_ZLIB_H=1 -DHAVE_LIBZ=1 -DHAVE_PYTHON=\"2.7\" -DMESOS_HAS_PYTHON=1 -I. -I../../src   -Werror -DLIBDIR=\"/mesos/mesos-1.5.0/_inst/lib\" -DPKGLIBEXECDIR=\"/mesos/mesos-1.5.0/_inst/libexec/mesos\" -DPKGDATADIR=\"/mesos/mesos-1.5.0/_inst/share/mesos\" -DPKGMODULEDIR=\"/mesos/mesos-1.5.0/_inst/lib/mesos/modules\" -I../../include -I../include -I../include/mesos -DPICOJSON_USE_INT64 -D__STDC_FORMAT_MACROS -isystem ../3rdparty/boost-1.53.0 -isystem ../3rdparty/concurrentqueue-1.0.0-beta -I../3rdparty/elfio-3.2 -I../3rdparty/glog-0.3.3/src -I../3rdparty/leveldb-1.19/include -I../../3rdparty/libprocess/include -I../3rdparty/nvml-352.79 -I../3rdparty/picojson-1.3.0 -I../3rdparty/protobuf-3.3.0/src -I../../3rdparty/stout/include -I../3rdparty/zookeeper-3.4.8/src/c/include -I../3rdparty/zookeeper-3.4.8/src/c/generated -DHAS_AUTHENTICATION=1 -DSOURCE_DIR=\"/mesos/mesos-1.5.0/_build/..\" -DBUILD_DIR=\"/mesos/mesos-1.5.0/_build\" -I../3rdparty/googletest-release-1.8.0/googletest/include -isystem ../3rdparty/googletest-release-1.8.0/googlemock/include -DTESTLIBEXECDIR=\"/mesos/mesos-1.5.0/_inst/libexec/mesos/tests\" -DSBINDIR=\"/mesos/mesos-1.5.0/_inst/sbin\" -isystem /usr/lib/jvm/java-7-openjdk-amd64/include -isystem /usr/lib/jvm/java-7-openjdk-amd64/include/linux -DZOOKEEPER_VERSION=\"3.4.8\" -isystem /usr/include/subversion-1 -isystem /usr/include/apr-1 -isystem /usr/include/apr-1.0	       -pthread -Wall -Wsign-compare -Wformat-security -fstack-protector -fPIC -fPIE -g1 -O0 -Wno-unused-local-typedefs -std=c++11 -MT tests/mesos_tests-exception_tests.o -MD -MP -MF tests/.deps/mesos_tests-exception_tests.Tpo -c -o tests/mesos_tests-exception_tests.o `test -f 'tests/exception_tests.cpp' || echo '../../src/'`tests/exception_tests.cpp
mv -f tests/.deps/mesos_tests-api_tests.Tpo tests/.deps/mesos_tests-api_tests.Po
g++ -DPACKAGE_NAME=\"mesos\" -DPACKAGE_TARNAME=\"mesos\" -DPACKAGE_VERSION=\"1.5.0\" -DPACKAGE_STRING=\"mesos\ 1.5.0\" -DPACKAGE_BUGREPORT=\"\" -DPACKAGE_URL=\"\" -DPACKAGE=\"mesos\" -DVERSION=\"1.5.0\" -DSTDC_HEADERS=1 -DHAVE_SYS_TYPES_H=1 -DHAVE_SYS_STAT_H=1 -DHAVE_STDLIB_H=1 -DHAVE_STRING_H=1 -DHAVE_MEMORY_H=1 -DHAVE_STRINGS_H=1 -DHAVE_INTTYPES_H=1 -DHAVE_STDINT_H=1 -DHAVE_UNISTD_H=1 -DHAVE_DLFCN_H=1 -DLT_OBJDIR=\".libs/\" -DHAVE_CXX11=1 -DHAVE_PTHREAD_PRIO_INHERIT=1 -DHAVE_PTHREAD=1 -DHAVE_FTS_H=1 -DHAVE_APR_POOLS_H=1 -DHAVE_LIBAPR_1=1 -DHAVE_LIBCURL=1 -DMESOS_HAS_JAVA=1 -DHAVE_LIBSASL2=1 -DHAVE_OPENSSL_SSL_H=1 -DHAVE_SVN_VERSION_H=1 -DHAVE_LIBSVN_SUBR_1=1 -DHAVE_SVN_DELTA_H=1 -DHAVE_LIBSVN_DELTA_1=1 -DHAVE_ZLIB_H=1 -DHAVE_LIBZ=1 -DHAVE_PYTHON=\"2.7\" -DMESOS_HAS_PYTHON=1 -I. -I../../src   -Werror -DLIBDIR=\"/mesos/mesos-1.5.0/_inst/lib\" -DPKGLIBEXECDIR=\"/mesos/mesos-1.5.0/_inst/libexec/mesos\" -DPKGDATADIR=\"/mesos/mesos-1.5.0/_inst/share/mesos\" -DPKGMODULEDIR=\"/mesos/mesos-1.5.0/_inst/lib/mesos/modules\" -I../../include -I../include -I../include/mesos -DPICOJSON_USE_INT64 -D__STDC_FORMAT_MACROS -isystem ../3rdparty/boost-1.53.0 -isystem ../3rdparty/concurrentqueue-1.0.0-beta -I../3rdparty/elfio-3.2 -I../3rdparty/glog-0.3.3/src -I../3rdparty/leveldb-1.19/include -I../../3rdparty/libprocess/include -I../3rdparty/nvml-352.79 -I../3rdparty/picojson-1.3.0 -I../3rdparty/protobuf-3.3.0/src -I../../3rdparty/stout/include -I../3rdparty/zookeeper-3.4.8/src/c/include -I../3rdparty/zookeeper-3.4.8/src/c/generated -DHAS_AUTHENTICATION=1 -DSOURCE_DIR=\"/mesos/mesos-1.5.0/_build/..\" -DBUILD_DIR=\"/mesos/mesos-1.5.0/_build\" -I../3rdparty/googletest-release-1.8.0/googletest/include -isystem ../3rdparty/googletest-release-1.8.0/googlemock/include -DTESTLIBEXECDIR=\"/mesos/mesos-1.5.0/_inst/libexec/mesos/tests\" -DSBINDIR=\"/mesos/mesos-1.5.0/_inst/sbin\" -isystem /usr/lib/jvm/java-7-openjdk-amd64/include -isystem /usr/lib/jvm/java-7-openjdk-amd64/include/linux -DZOOKEEPER_VERSION=\"3.4.8\" -isystem /usr/include/subversion-1 -isystem /usr/include/apr-1 -isystem /usr/include/apr-1.0	       -pthread -Wall -Wsign-compare -Wformat-security -fstack-protector -fPIC -fPIE -g1 -O0 -Wno-unused-local-typedefs -std=c++11 -MT tests/mesos_tests-executor_http_api_tests.o -MD -MP -MF tests/.deps/mesos_tests-executor_http_api_tests.Tpo -c -o tests/mesos_tests-executor_http_api_tests.o `test -f 'tests/executor_http_api_tests.cpp' || echo '../../src/'`tests/executor_http_api_tests.cpp
mv -f tests/.deps/mesos_tests-environment.Tpo tests/.deps/mesos_tests-environment.Po
g++ -DPACKAGE_NAME=\"mesos\" -DPACKAGE_TARNAME=\"mesos\" -DPACKAGE_VERSION=\"1.5.0\" -DPACKAGE_STRING=\"mesos\ 1.5.0\" -DPACKAGE_BUGREPORT=\"\" -DPACKAGE_URL=\"\" -DPACKAGE=\"mesos\" -DVERSION=\"1.5.0\" -DSTDC_HEADERS=1 -DHAVE_SYS_TYPES_H=1 -DHAVE_SYS_STAT_H=1 -DHAVE_STDLIB_H=1 -DHAVE_STRING_H=1 -DHAVE_MEMORY_H=1 -DHAVE_STRINGS_H=1 -DHAVE_INTTYPES_H=1 -DHAVE_STDINT_H=1 -DHAVE_UNISTD_H=1 -DHAVE_DLFCN_H=1 -DLT_OBJDIR=\".libs/\" -DHAVE_CXX11=1 -DHAVE_PTHREAD_PRIO_INHERIT=1 -DHAVE_PTHREAD=1 -DHAVE_FTS_H=1 -DHAVE_APR_POOLS_H=1 -DHAVE_LIBAPR_1=1 -DHAVE_LIBCURL=1 -DMESOS_HAS_JAVA=1 -DHAVE_LIBSASL2=1 -DHAVE_OPENSSL_SSL_H=1 -DHAVE_SVN_VERSION_H=1 -DHAVE_LIBSVN_SUBR_1=1 -DHAVE_SVN_DELTA_H=1 -DHAVE_LIBSVN_DELTA_1=1 -DHAVE_ZLIB_H=1 -DHAVE_LIBZ=1 -DHAVE_PYTHON=\"2.7\" -DMESOS_HAS_PYTHON=1 -I. -I../../src   -Werror -DLIBDIR=\"/mesos/mesos-1.5.0/_inst/lib\" -DPKGLIBEXECDIR=\"/mesos/mesos-1.5.0/_inst/libexec/mesos\" -DPKGDATADIR=\"/mesos/mesos-1.5.0/_inst/share/mesos\" -DPKGMODULEDIR=\"/mesos/mesos-1.5.0/_inst/lib/mesos/modules\" -I../../include -I../include -I../include/mesos -DPICOJSON_USE_INT64 -D__STDC_FORMAT_MACROS -isystem ../3rdparty/boost-1.53.0 -isystem ../3rdparty/concurrentqueue-1.0.0-beta -I../3rdparty/elfio-3.2 -I../3rdparty/glog-0.3.3/src -I../3rdparty/leveldb-1.19/include -I../../3rdparty/libprocess/include -I../3rdparty/nvml-352.79 -I../3rdparty/picojson-1.3.0 -I../3rdparty/protobuf-3.3.0/src -I../../3rdparty/stout/include -I../3rdparty/zookeeper-3.4.8/src/c/include -I../3rdparty/zookeeper-3.4.8/src/c/generated -DHAS_AUTHENTICATION=1 -DSOURCE_DIR=\"/mesos/mesos-1.5.0/_build/..\" -DBUILD_DIR=\"/mesos/mesos-1.5.0/_build\" -I../3rdparty/googletest-release-1.8.0/googletest/include -isystem ../3rdparty/googletest-release-1.8.0/googlemock/include -DTESTLIBEXECDIR=\"/mesos/mesos-1.5.0/_inst/libexec/mesos/tests\" -DSBINDIR=\"/mesos/mesos-1.5.0/_inst/sbin\" -isystem /usr/lib/jvm/java-7-openjdk-amd64/include -isystem /usr/lib/jvm/java-7-openjdk-amd64/include/linux -DZOOKEEPER_VERSION=\"3.4.8\" -isystem /usr/include/subversion-1 -isystem /usr/include/apr-1 -isystem /usr/include/apr-1.0	       -pthread -Wall -Wsign-compare -Wformat-security -fstack-protector -fPIC -fPIE -g1 -O0 -Wno-unused-local-typedefs -std=c++11 -MT tests/mesos_tests-fault_tolerance_tests.o -MD -MP -MF tests/.deps/mesos_tests-fault_tolerance_tests.Tpo -c -o tests/mesos_tests-fault_tolerance_tests.o `test -f 'tests/fault_tolerance_tests.cpp' || echo '../../src/'`tests/fault_tolerance_tests.cpp
mv -f tests/.deps/mesos_tests-default_executor_tests.Tpo tests/.deps/mesos_tests-default_executor_tests.Po
g++ -DPACKAGE_NAME=\"mesos\" -DPACKAGE_TARNAME=\"mesos\" -DPACKAGE_VERSION=\"1.5.0\" -DPACKAGE_STRING=\"mesos\ 1.5.0\" -DPACKAGE_BUGREPORT=\"\" -DPACKAGE_URL=\"\" -DPACKAGE=\"mesos\" -DVERSION=\"1.5.0\" -DSTDC_HEADERS=1 -DHAVE_SYS_TYPES_H=1 -DHAVE_SYS_STAT_H=1 -DHAVE_STDLIB_H=1 -DHAVE_STRING_H=1 -DHAVE_MEMORY_H=1 -DHAVE_STRINGS_H=1 -DHAVE_INTTYPES_H=1 -DHAVE_STDINT_H=1 -DHAVE_UNISTD_H=1 -DHAVE_DLFCN_H=1 -DLT_OBJDIR=\".libs/\" -DHAVE_CXX11=1 -DHAVE_PTHREAD_PRIO_INHERIT=1 -DHAVE_PTHREAD=1 -DHAVE_FTS_H=1 -DHAVE_APR_POOLS_H=1 -DHAVE_LIBAPR_1=1 -DHAVE_LIBCURL=1 -DMESOS_HAS_JAVA=1 -DHAVE_LIBSASL2=1 -DHAVE_OPENSSL_SSL_H=1 -DHAVE_SVN_VERSION_H=1 -DHAVE_LIBSVN_SUBR_1=1 -DHAVE_SVN_DELTA_H=1 -DHAVE_LIBSVN_DELTA_1=1 -DHAVE_ZLIB_H=1 -DHAVE_LIBZ=1 -DHAVE_PYTHON=\"2.7\" -DMESOS_HAS_PYTHON=1 -I. -I../../src   -Werror -DLIBDIR=\"/mesos/mesos-1.5.0/_inst/lib\" -DPKGLIBEXECDIR=\"/mesos/mesos-1.5.0/_inst/libexec/mesos\" -DPKGDATADIR=\"/mesos/mesos-1.5.0/_inst/share/mesos\" -DPKGMODULEDIR=\"/mesos/mesos-1.5.0/_inst/lib/mesos/modules\" -I../../include -I../include -I../include/mesos -DPICOJSON_USE_INT64 -D__STDC_FORMAT_MACROS -isystem ../3rdparty/boost-1.53.0 -isystem ../3rdparty/concurrentqueue-1.0.0-beta -I../3rdparty/elfio-3.2 -I../3rdparty/glog-0.3.3/src -I../3rdparty/leveldb-1.19/include -I../../3rdparty/libprocess/include -I../3rdparty/nvml-352.79 -I../3rdparty/picojson-1.3.0 -I../3rdparty/protobuf-3.3.0/src -I../../3rdparty/stout/include -I../3rdparty/zookeeper-3.4.8/src/c/include -I../3rdparty/zookeeper-3.4.8/src/c/generated -DHAS_AUTHENTICATION=1 -DSOURCE_DIR=\"/mesos/mesos-1.5.0/_build/..\" -DBUILD_DIR=\"/mesos/mesos-1.5.0/_build\" -I../3rdparty/googletest-release-1.8.0/googletest/include -isystem ../3rdparty/googletest-release-1.8.0/googlemock/include -DTESTLIBEXECDIR=\"/mesos/mesos-1.5.0/_inst/libexec/mesos/tests\" -DSBINDIR=\"/mesos/mesos-1.5.0/_inst/sbin\" -isystem /usr/lib/jvm/java-7-openjdk-amd64/include -isystem /usr/lib/jvm/java-7-openjdk-amd64/include/linux -DZOOKEEPER_VERSION=\"3.4.8\" -isystem /usr/include/subversion-1 -isystem /usr/include/apr-1 -isystem /usr/include/apr-1.0	       -pthread -Wall -Wsign-compare -Wformat-security -fstack-protector -fPIC -fPIE -g1 -O0 -Wno-unused-local-typedefs -std=c++11 -MT tests/mesos_tests-fetcher_cache_tests.o -MD -MP -MF tests/.deps/mesos_tests-fetcher_cache_tests.Tpo -c -o tests/mesos_tests-fetcher_cache_tests.o `test -f 'tests/fetcher_cache_tests.cpp' || echo '../../src/'`tests/fetcher_cache_tests.cpp
mv -f tests/.deps/mesos_tests-disk_quota_tests.Tpo tests/.deps/mesos_tests-disk_quota_tests.Po
g++ -DPACKAGE_NAME=\"mesos\" -DPACKAGE_TARNAME=\"mesos\" -DPACKAGE_VERSION=\"1.5.0\" -DPACKAGE_STRING=\"mesos\ 1.5.0\" -DPACKAGE_BUGREPORT=\"\" -DPACKAGE_URL=\"\" -DPACKAGE=\"mesos\" -DVERSION=\"1.5.0\" -DSTDC_HEADERS=1 -DHAVE_SYS_TYPES_H=1 -DHAVE_SYS_STAT_H=1 -DHAVE_STDLIB_H=1 -DHAVE_STRING_H=1 -DHAVE_MEMORY_H=1 -DHAVE_STRINGS_H=1 -DHAVE_INTTYPES_H=1 -DHAVE_STDINT_H=1 -DHAVE_UNISTD_H=1 -DHAVE_DLFCN_H=1 -DLT_OBJDIR=\".libs/\" -DHAVE_CXX11=1 -DHAVE_PTHREAD_PRIO_INHERIT=1 -DHAVE_PTHREAD=1 -DHAVE_FTS_H=1 -DHAVE_APR_POOLS_H=1 -DHAVE_LIBAPR_1=1 -DHAVE_LIBCURL=1 -DMESOS_HAS_JAVA=1 -DHAVE_LIBSASL2=1 -DHAVE_OPENSSL_SSL_H=1 -DHAVE_SVN_VERSION_H=1 -DHAVE_LIBSVN_SUBR_1=1 -DHAVE_SVN_DELTA_H=1 -DHAVE_LIBSVN_DELTA_1=1 -DHAVE_ZLIB_H=1 -DHAVE_LIBZ=1 -DHAVE_PYTHON=\"2.7\" -DMESOS_HAS_PYTHON=1 -I. -I../../src   -Werror -DLIBDIR=\"/mesos/mesos-1.5.0/_inst/lib\" -DPKGLIBEXECDIR=\"/mesos/mesos-1.5.0/_inst/libexec/mesos\" -DPKGDATADIR=\"/mesos/mesos-1.5.0/_inst/share/mesos\" -DPKGMODULEDIR=\"/mesos/mesos-1.5.0/_inst/lib/mesos/modules\" -I../../include -I../include -I../include/mesos -DPICOJSON_USE_INT64 -D__STDC_FORMAT_MACROS -isystem ../3rdparty/boost-1.53.0 -isystem ../3rdparty/concurrentqueue-1.0.0-beta -I../3rdparty/elfio-3.2 -I../3rdparty/glog-0.3.3/src -I../3rdparty/leveldb-1.19/include -I../../3rdparty/libprocess/include -I../3rdparty/nvml-352.79 -I../3rdparty/picojson-1.3.0 -I../3rdparty/protobuf-3.3.0/src -I../../3rdparty/stout/include -I../3rdparty/zookeeper-3.4.8/src/c/include -I../3rdparty/zookeeper-3.4.8/src/c/generated -DHAS_AUTHENTICATION=1 -DSOURCE_DIR=\"/mesos/mesos-1.5.0/_build/..\" -DBUILD_DIR=\"/mesos/mesos-1.5.0/_build\" -I../3rdparty/googletest-release-1.8.0/googletest/include -isystem ../3rdparty/googletest-release-1.8.0/googlemock/include -DTESTLIBEXECDIR=\"/mesos/mesos-1.5.0/_inst/libexec/mesos/tests\" -DSBINDIR=\"/mesos/mesos-1.5.0/_inst/sbin\" -isystem /usr/lib/jvm/java-7-openjdk-amd64/include -isystem /usr/lib/jvm/java-7-openjdk-amd64/include/linux -DZOOKEEPER_VERSION=\"3.4.8\" -isystem /usr/include/subversion-1 -isystem /usr/include/apr-1 -isystem /usr/include/apr-1.0	       -pthread -Wall -Wsign-compare -Wformat-security -fstack-protector -fPIC -fPIE -g1 -O0 -Wno-unused-local-typedefs -std=c++11 -MT tests/mesos_tests-fetcher_tests.o -MD -MP -MF tests/.deps/mesos_tests-fetcher_tests.Tpo -c -o tests/mesos_tests-fetcher_tests.o `test -f 'tests/fetcher_tests.cpp' || echo '../../src/'`tests/fetcher_tests.cpp
mv -f tests/.deps/mesos_tests-dynamic_weights_tests.Tpo tests/.deps/mesos_tests-dynamic_weights_tests.Po
g++ -DPACKAGE_NAME=\"mesos\" -DPACKAGE_TARNAME=\"mesos\" -DPACKAGE_VERSION=\"1.5.0\" -DPACKAGE_STRING=\"mesos\ 1.5.0\" -DPACKAGE_BUGREPORT=\"\" -DPACKAGE_URL=\"\" -DPACKAGE=\"mesos\" -DVERSION=\"1.5.0\" -DSTDC_HEADERS=1 -DHAVE_SYS_TYPES_H=1 -DHAVE_SYS_STAT_H=1 -DHAVE_STDLIB_H=1 -DHAVE_STRING_H=1 -DHAVE_MEMORY_H=1 -DHAVE_STRINGS_H=1 -DHAVE_INTTYPES_H=1 -DHAVE_STDINT_H=1 -DHAVE_UNISTD_H=1 -DHAVE_DLFCN_H=1 -DLT_OBJDIR=\".libs/\" -DHAVE_CXX11=1 -DHAVE_PTHREAD_PRIO_INHERIT=1 -DHAVE_PTHREAD=1 -DHAVE_FTS_H=1 -DHAVE_APR_POOLS_H=1 -DHAVE_LIBAPR_1=1 -DHAVE_LIBCURL=1 -DMESOS_HAS_JAVA=1 -DHAVE_LIBSASL2=1 -DHAVE_OPENSSL_SSL_H=1 -DHAVE_SVN_VERSION_H=1 -DHAVE_LIBSVN_SUBR_1=1 -DHAVE_SVN_DELTA_H=1 -DHAVE_LIBSVN_DELTA_1=1 -DHAVE_ZLIB_H=1 -DHAVE_LIBZ=1 -DHAVE_PYTHON=\"2.7\" -DMESOS_HAS_PYTHON=1 -I. -I../../src   -Werror -DLIBDIR=\"/mesos/mesos-1.5.0/_inst/lib\" -DPKGLIBEXECDIR=\"/mesos/mesos-1.5.0/_inst/libexec/mesos\" -DPKGDATADIR=\"/mesos/mesos-1.5.0/_inst/share/mesos\" -DPKGMODULEDIR=\"/mesos/mesos-1.5.0/_inst/lib/mesos/modules\" -I../../include -I../include -I../include/mesos -DPICOJSON_USE_INT64 -D__STDC_FORMAT_MACROS -isystem ../3rdparty/boost-1.53.0 -isystem ../3rdparty/concurrentqueue-1.0.0-beta -I../3rdparty/elfio-3.2 -I../3rdparty/glog-0.3.3/src -I../3rdparty/leveldb-1.19/include -I../../3rdparty/libprocess/include -I../3rdparty/nvml-352.79 -I../3rdparty/picojson-1.3.0 -I../3rdparty/protobuf-3.3.0/src -I../../3rdparty/stout/include -I../3rdparty/zookeeper-3.4.8/src/c/include -I../3rdparty/zookeeper-3.4.8/src/c/generated -DHAS_AUTHENTICATION=1 -DSOURCE_DIR=\"/mesos/mesos-1.5.0/_build/..\" -DBUILD_DIR=\"/mesos/mesos-1.5.0/_build\" -I../3rdparty/googletest-release-1.8.0/googletest/include -isystem ../3rdparty/googletest-release-1.8.0/googlemock/include -DTESTLIBEXECDIR=\"/mesos/mesos-1.5.0/_inst/libexec/mesos/tests\" -DSBINDIR=\"/mesos/mesos-1.5.0/_inst/sbin\" -isystem /usr/lib/jvm/java-7-openjdk-amd64/include -isystem /usr/lib/jvm/java-7-openjdk-amd64/include/linux -DZOOKEEPER_VERSION=\"3.4.8\" -isystem /usr/include/subversion-1 -isystem /usr/include/apr-1 -isystem /usr/include/apr-1.0	       -pthread -Wall -Wsign-compare -Wformat-security -fstack-protector -fPIC -fPIE -g1 -O0 -Wno-unused-local-typedefs -std=c++11 -MT tests/mesos_tests-files_tests.o -MD -MP -MF tests/.deps/mesos_tests-files_tests.Tpo -c -o tests/mesos_tests-files_tests.o `test -f 'tests/files_tests.cpp' || echo '../../src/'`tests/files_tests.cpp
mv -f tests/.deps/mesos_tests-exception_tests.Tpo tests/.deps/mesos_tests-exception_tests.Po
g++ -DPACKAGE_NAME=\"mesos\" -DPACKAGE_TARNAME=\"mesos\" -DPACKAGE_VERSION=\"1.5.0\" -DPACKAGE_STRING=\"mesos\ 1.5.0\" -DPACKAGE_BUGREPORT=\"\" -DPACKAGE_URL=\"\" -DPACKAGE=\"mesos\" -DVERSION=\"1.5.0\" -DSTDC_HEADERS=1 -DHAVE_SYS_TYPES_H=1 -DHAVE_SYS_STAT_H=1 -DHAVE_STDLIB_H=1 -DHAVE_STRING_H=1 -DHAVE_MEMORY_H=1 -DHAVE_STRINGS_H=1 -DHAVE_INTTYPES_H=1 -DHAVE_STDINT_H=1 -DHAVE_UNISTD_H=1 -DHAVE_DLFCN_H=1 -DLT_OBJDIR=\".libs/\" -DHAVE_CXX11=1 -DHAVE_PTHREAD_PRIO_INHERIT=1 -DHAVE_PTHREAD=1 -DHAVE_FTS_H=1 -DHAVE_APR_POOLS_H=1 -DHAVE_LIBAPR_1=1 -DHAVE_LIBCURL=1 -DMESOS_HAS_JAVA=1 -DHAVE_LIBSASL2=1 -DHAVE_OPENSSL_SSL_H=1 -DHAVE_SVN_VERSION_H=1 -DHAVE_LIBSVN_SUBR_1=1 -DHAVE_SVN_DELTA_H=1 -DHAVE_LIBSVN_DELTA_1=1 -DHAVE_ZLIB_H=1 -DHAVE_LIBZ=1 -DHAVE_PYTHON=\"2.7\" -DMESOS_HAS_PYTHON=1 -I. -I../../src   -Werror -DLIBDIR=\"/mesos/mesos-1.5.0/_inst/lib\" -DPKGLIBEXECDIR=\"/mesos/mesos-1.5.0/_inst/libexec/mesos\" -DPKGDATADIR=\"/mesos/mesos-1.5.0/_inst/share/mesos\" -DPKGMODULEDIR=\"/mesos/mesos-1.5.0/_inst/lib/mesos/modules\" -I../../include -I../include -I../include/mesos -DPICOJSON_USE_INT64 -D__STDC_FORMAT_MACROS -isystem ../3rdparty/boost-1.53.0 -isystem ../3rdparty/concurrentqueue-1.0.0-beta -I../3rdparty/elfio-3.2 -I../3rdparty/glog-0.3.3/src -I../3rdparty/leveldb-1.19/include -I../../3rdparty/libprocess/include -I../3rdparty/nvml-352.79 -I../3rdparty/picojson-1.3.0 -I../3rdparty/protobuf-3.3.0/src -I../../3rdparty/stout/include -I../3rdparty/zookeeper-3.4.8/src/c/include -I../3rdparty/zookeeper-3.4.8/src/c/generated -DHAS_AUTHENTICATION=1 -DSOURCE_DIR=\"/mesos/mesos-1.5.0/_build/..\" -DBUILD_DIR=\"/mesos/mesos-1.5.0/_build\" -I../3rdparty/googletest-release-1.8.0/googletest/include -isystem ../3rdparty/googletest-release-1.8.0/googlemock/include -DTESTLIBEXECDIR=\"/mesos/mesos-1.5.0/_inst/libexec/mesos/tests\" -DSBINDIR=\"/mesos/mesos-1.5.0/_inst/sbin\" -isystem /usr/lib/jvm/java-7-openjdk-amd64/include -isystem /usr/lib/jvm/java-7-openjdk-amd64/include/linux -DZOOKEEPER_VERSION=\"3.4.8\" -isystem /usr/include/subversion-1 -isystem /usr/include/apr-1 -isystem /usr/include/apr-1.0	       -pthread -Wall -Wsign-compare -Wformat-security -fstack-protector -fPIC -fPIE -g1 -O0 -Wno-unused-local-typedefs -std=c++11 -MT tests/mesos_tests-flags.o -MD -MP -MF tests/.deps/mesos_tests-flags.Tpo -c -o tests/mesos_tests-flags.o `test -f 'tests/flags.cpp' || echo '../../src/'`tests/flags.cpp
../../src/tests/flags.cpp:28:1: fatal error: error writing to /tmp/ccOC8gi9.s: No space left on device
 } // namespace mesos {
 ^
compilation terminated.
../../src/tests/executor_http_api_tests.cpp:953:1: fatal error: error writing to /tmp/cc1SUlVj.s: No space left on device
 } // namespace mesos {
 ^
compilation terminated.
../../src/tests/fetcher_tests.cpp:1214:1: fatal error: error writing to /tmp/ccBFBhQL.s: No space left on device
 } // namespace mesos {
 ^
compilation terminated.
../../src/tests/files_tests.cpp:609:1: fatal error: error writing to /tmp/cc66JUwe.s: No space left on device
 } // namespace mesos {
 ^
compilation terminated.
../../src/tests/fetcher_cache_tests.cpp:1717:1: fatal error: error writing to /tmp/cc5c59Yo.s: No space left on device
 } // namespace mesos {
 ^
compilation terminated.
../../src/tests/fault_tolerance_tests.cpp:2293:1: fatal error: error writing to /tmp/ccbMGtAS.s: No space left on device
 } // namespace mesos {
 ^
compilation terminated.
The bug is not reproducible, so it is likely a hardware or OS problem.
make[4]: *** [tests/mesos_tests-flags.o] Error 1
make[4]: *** Waiting for unfinished jobs....
The bug is not reproducible, so it is likely a hardware or OS problem.
make[4]: *** [tests/mesos_tests-executor_http_api_tests.o] Error 1
The bug is not reproducible, so it is likely a hardware or OS problem.
make[4]: *** [tests/mesos_tests-fetcher_tests.o] Error 1
The bug is not reproducible, so it is likely a hardware or OS problem.
make[4]: *** [tests/mesos_tests-files_tests.o] Error 1
The bug is not reproducible, so it is likely a hardware or OS problem.
make[4]: *** [tests/mesos_tests-fetcher_cache_tests.o] Error 1
The bug is not reproducible, so it is likely a hardware or OS problem.
make[4]: *** [tests/mesos_tests-fault_tolerance_tests.o] Error 1
make[4]: Leaving directory `/mesos/mesos-1.5.0/_build/src'
make[3]: *** [check-am] Error 2
make[3]: Leaving directory `/mesos/mesos-1.5.0/_build/src'
make[2]: *** [check] Error 2
make[2]: Leaving directory `/mesos/mesos-1.5.0/_build/src'
make[1]: *** [check-recursive] Error 1
make[1]: Leaving directory `/mesos/mesos-1.5.0/_build'
make: *** [distcheck] Error 1
+ docker rmi mesos-1503038690-7940
Untagged: mesos-1503038690-7940:latest
Deleted: sha256:56b3cf5b2fe38316d0b8ac610d4990b62918083fda842f99b855634ef3549bbb
Deleted: sha256:3e58a06876cbb4a4a4f4d0b052c62ee596beec4a1a363173399add87efdd6ca3
Deleted: sha256:dec8493d8c47b9cb6bde3d224cf2a5f573e1afbc810729fecb3b97795e18fa98
Deleted: sha256:e210c92a82ed0731ea49b624c42790ee759df43d6b1de76a0bb7c3bf203f7216
Deleted: sha256:f5b1b736d47c47ec87f07e37f7f20f98f81441bad8143c002e0dc70c651829fe
Deleted: sha256:6058e633ddb5ed4a580b5bcb57835dcc4b7af36fd9939dbceeecf627fac3bd07
Deleted: sha256:e5a314e8df85e2ed980c0259dc510d2fec89e2f1231902b4cbbee6f54b23f0c4
Deleted: sha256:0fdf667bf31921d9083ab109895b421cbaeed977d57013f335b0e80361fb7ef3
Deleted: sha256:04f391df673233fd304aa0a0de82a43595d0dcea24f1c178606559e4cc77ef75
Deleted: sha256:d40bda4e9009e40d4be3bd15f9640c8a344446dcddd0f31f9779ea0f10978ebe
Deleted: sha256:fa75a3f6213952670464543f67fc851475f6cd52c3141cc2891b033cbb09df14
Deleted: sha256:19bbce6443f4fc0f6ec58c68647386e303913b04ec1c6ab5b94b196004b34da7
Deleted: sha256:36e2aa364586b8112aa844dfb2042dd4cb9f8c6f2b44ce3e0f436480b137ab59
Deleted: sha256:062625852cc06c58888fe11917a8e6e6c1bdf8f2fff800fd8f6a14c91c05dcf8
Deleted: sha256:a7b572cc371d4fba545fcb9ec95f2f3de3b62e51beb1eeaaac60f47946addb34
Deleted: sha256:9bb89ca99fb169d30e80bfb2b33ed97ed94b0fa360d40bd0478da6e34678a80f
Deleted: sha256:17f8fa85fc589a8ecf07ec8876b4ca0ebd5b39538a82aa63fcf94c7f0a6e1108
Deleted: sha256:0762d817aa2f5d5b3c646a6c525bf8aec0fe047d41640796c844f729b92c1c62
Deleted: sha256:3d8f8d0902116a9903c4bdfb8efa022051902cc7f11fef3d7f73ad8aff35e0eb
Deleted: sha256:fee3d683efe092cdfbb46e85217fb9f05e6feb11137f56f29ab96aca8fe1cd16
Deleted: sha256:e5a5371e37e04f21d1da2cd43d8e8418a513e1355ac09c204bc8c9a72bccd891
Deleted: sha256:de7abac4c7e8210f6498a6d8ea9cc0b7f375db574ace83dcad41630f46c16f1b
Deleted: sha256:bc72d471b3868deec77f36b15b03d3f302fd93d218bfcacb71868602316f48f9
Deleted: sha256:5d64c064cbb1c2813af7bb22fb04a85510d7b7c6f4706e0e1e47b9955d964f6a
Build step 'Execute shell' marked build as failure

Mime
View raw message