mesos-builds mailing list archives

Site index · List index
Message view « Date » · « Thread »
Top « Date » · « Thread »
From Apache Jenkins Server <jenk...@builds.apache.org>
Subject Build failed in Jenkins: Mesos-Buildbot » autotools,gcc,--verbose --enable-libevent --enable-ssl,GLOG_v=1 MESOS_VERBOSE=1,centos:7,(ubuntu)&&(!ubuntu-us1)&&(!ubuntu-eu2) #4171
Date Wed, 30 Aug 2017 14:17:10 GMT
See <https://builds.apache.org/job/Mesos-Buildbot/BUILDTOOL=autotools,COMPILER=gcc,CONFIGURATION=--verbose%20--enable-libevent%20--enable-ssl,ENVIRONMENT=GLOG_v=1%20MESOS_VERBOSE=1,OS=centos%3A7,label_exp=(ubuntu)&&(!ubuntu-us1)&&(!ubuntu-eu2)/4171/display/redirect>

------------------------------------------
[...truncated 32.28 MB...]
I0830 14:17:02.232113 30392 slave.cpp:252] Mesos agent started on (810)@172.17.0.7:44926
I0830 14:17:02.232139 30392 slave.cpp:253] Flags at startup: --acls="" --appc_simple_discovery_uri_prefix="http://"
--appc_store_dir="/tmp/Endpoint_SlaveEndpointTest_UnauthorizedRequest_0_uh5pfJ/store/appc"
--authenticate_http_executors="true" --authenticate_http_readonly="true" --authenticate_http_readwrite="true"
--authenticatee="crammd5" --authentication_backoff_factor="1secs" --authorizer="local" --cgroups_cpu_enable_pids_and_tids_count="false"
--cgroups_enable_cfs="false" --cgroups_hierarchy="/sys/fs/cgroup" --cgroups_limit_swap="false"
--cgroups_root="mesos" --container_disk_watch_interval="15secs" --containerizers="mesos" --credential="/tmp/Endpoint_SlaveEndpointTest_UnauthorizedRequest_0_uh5pfJ/credential"
--default_role="*" --disallow_sharing_agent_pid_namespace="false" --disk_watch_interval="1mins"
--docker="docker" --docker_kill_orphans="true" --docker_registry="https://registry-1.docker.io"
--docker_remove_delay="6hrs" --docker_socket="/var/run/docker.sock" --docker_stop_timeout="0ns"
--docker_store_dir="/tmp/Endpoint_SlaveEndpointTest_UnauthorizedRequest_0_uh5pfJ/store/docker"
--docker_volume_checkpoint_dir="/var/run/mesos/isolators/docker/volume" --enforce_container_disk_quota="false"
--executor_registration_timeout="1mins" --executor_reregistration_timeout="2secs" --executor_secret_key="/tmp/Endpoint_SlaveEndpointTest_UnauthorizedRequest_0_uh5pfJ/executor_secret_key"
--executor_shutdown_grace_period="5secs" --fetcher_cache_dir="/tmp/Endpoint_SlaveEndpointTest_UnauthorizedRequest_0_uh5pfJ/fetch"
--fetcher_cache_size="2GB" --frameworks_home="" --gc_delay="1weeks" --gc_disk_headroom="0.1"
--hadoop_home="" --help="false" --hostname_lookup="true" --http_command_executor="false" --http_credentials="/tmp/Endpoint_SlaveEndpointTest_UnauthorizedRequest_0_uh5pfJ/http_credentials"
--http_heartbeat_interval="30secs" --initialize_driver_logging="true" --isolation="posix/cpu,posix/mem"
--launcher="posix" --launcher_dir="/mesos/mesos-1.5.0/_build/src" --logbufsecs="0" --logging_level="INFO"
--max_completed_executors_per_framework="150" --oversubscribed_resources_interval="15secs"
--perf_duration="10secs" --perf_interval="1mins" --port="5051" --qos_correction_interval_min="0ns"
--quiet="false" --recover="reconnect" --recovery_timeout="15mins" --registration_backoff_factor="10ms"
--resources="cpus:2;gpus:0;mem:1024;disk:1024;ports:[31000-32000]" --revocable_cpu_low_priority="true"
--runtime_dir="/tmp/Endpoint_SlaveEndpointTest_UnauthorizedRequest_0_uh5pfJ" --sandbox_directory="/mnt/mesos/sandbox"
--strict="true" --switch_user="true" --systemd_enable_support="true" --systemd_runtime_directory="/run/systemd/system"
--version="false" --work_dir="/tmp/Endpoint_SlaveEndpointTest_UnauthorizedRequest_0_BLpwGH"
--zk_session_timeout="10secs"
I0830 14:17:02.232560 30392 credentials.hpp:86] Loading credential for authentication from
'/tmp/Endpoint_SlaveEndpointTest_UnauthorizedRequest_0_uh5pfJ/credential'
I0830 14:17:02.232738 30392 slave.cpp:285] Agent using credential for: test-principal
I0830 14:17:02.232761 30392 credentials.hpp:37] Loading credentials for authentication from
'/tmp/Endpoint_SlaveEndpointTest_UnauthorizedRequest_0_uh5pfJ/http_credentials'
I0830 14:17:02.233055 30392 http.cpp:1045] Creating default 'basic' HTTP authenticator for
realm 'mesos-agent-executor'
I0830 14:17:02.233192 30392 http.cpp:1066] Creating default 'jwt' HTTP authenticator for realm
'mesos-agent-executor'
I0830 14:17:02.233422 30392 http.cpp:1045] Creating default 'basic' HTTP authenticator for
realm 'mesos-agent-readonly'
I0830 14:17:02.233532 30392 http.cpp:1066] Creating default 'jwt' HTTP authenticator for realm
'mesos-agent-readonly'
I0830 14:17:02.233742 30392 http.cpp:1045] Creating default 'basic' HTTP authenticator for
realm 'mesos-agent-readwrite'
I0830 14:17:02.233855 30392 http.cpp:1066] Creating default 'jwt' HTTP authenticator for realm
'mesos-agent-readwrite'
I0830 14:17:02.235265 30392 slave.cpp:581] Agent resources: [{"name":"cpus","scalar":{"value":2.0},"type":"SCALAR"},{"name":"mem","scalar":{"value":1024.0},"type":"SCALAR"},{"name":"disk","scalar":{"value":1024.0},"type":"SCALAR"},{"name":"ports","ranges":{"range":[{"begin":31000,"end":32000}]},"type":"RANGES"}]
I0830 14:17:02.235499 30392 slave.cpp:589] Agent attributes: [  ]
I0830 14:17:02.235517 30392 slave.cpp:598] Agent hostname: 487418f2b5e6
I0830 14:17:02.235640 30376 status_update_manager.cpp:177] Pausing sending status updates
I0830 14:17:02.237134 30386 state.cpp:64] Recovering state from '/tmp/Endpoint_SlaveEndpointTest_UnauthorizedRequest_0_BLpwGH/meta'
I0830 14:17:02.237428 30371 status_update_manager.cpp:203] Recovering status update manager
I0830 14:17:02.237615 30389 containerizer.cpp:646] Recovering containerizer
I0830 14:17:02.238868 30378 provisioner.cpp:416] Provisioner recovery complete
I0830 14:17:02.239233 30392 slave.cpp:6296] Finished recovery
I0830 14:17:02.239681 30392 slave.cpp:6478] Querying resource estimator for oversubscribable
resources
I0830 14:17:02.239938 30377 slave.cpp:6492] Received oversubscribable resources {} from the
resource estimator
I0830 14:17:02.242012 30381 process.cpp:3956] Handling HTTP event for process 'slave(810)'
with path: '/slave(810)/monitor/statistics'
I0830 14:17:02.243765 30391 http.cpp:1185] HTTP GET for /slave(810)/monitor/statistics from
172.17.0.7:36288
I0830 14:17:02.243835 30391 http.cpp:976] Authorizing principal 'test-principal' to GET the
'/monitor/statistics' endpoint
I0830 14:17:02.245707 30371 slave.cpp:859] Agent terminating
[       OK ] Endpoint/SlaveEndpointTest.UnauthorizedRequest/0 (29 ms)
[ RUN      ] Endpoint/SlaveEndpointTest.UnauthorizedRequest/1
I0830 14:17:02.256454  9655 containerizer.cpp:290] Using isolation { environment_secret, posix/cpu,
posix/mem, filesystem/posix, network/cni }
W0830 14:17:02.256947  9655 backend.cpp:76] Failed to create 'aufs' backend: AufsBackend requires
root privileges
W0830 14:17:02.257055  9655 backend.cpp:76] Failed to create 'bind' backend: BindBackend requires
root privileges
I0830 14:17:02.257091  9655 provisioner.cpp:255] Using default backend 'copy'
I0830 14:17:02.260506 30386 slave.cpp:252] Mesos agent started on (811)@172.17.0.7:44926
I0830 14:17:02.260531 30386 slave.cpp:253] Flags at startup: --acls="" --appc_simple_discovery_uri_prefix="http://"
--appc_store_dir="/tmp/Endpoint_SlaveEndpointTest_UnauthorizedRequest_1_QjXwJP/store/appc"
--authenticate_http_executors="true" --authenticate_http_readonly="true" --authenticate_http_readwrite="true"
--authenticatee="crammd5" --authentication_backoff_factor="1secs" --authorizer="local" --cgroups_cpu_enable_pids_and_tids_count="false"
--cgroups_enable_cfs="false" --cgroups_hierarchy="/sys/fs/cgroup" --cgroups_limit_swap="false"
--cgroups_root="mesos" --container_disk_watch_interval="15secs" --containerizers="mesos" --credential="/tmp/Endpoint_SlaveEndpointTest_UnauthorizedRequest_1_QjXwJP/credential"
--default_role="*" --disallow_sharing_agent_pid_namespace="false" --disk_watch_interval="1mins"
--docker="docker" --docker_kill_orphans="true" --docker_registry="https://registry-1.docker.io"
--docker_remove_delay="6hrs" --docker_socket="/var/run/docker.sock" --docker_stop_timeout="0ns"
--docker_store_dir="/tmp/Endpoint_SlaveEndpointTest_UnauthorizedRequest_1_QjXwJP/store/docker"
--docker_volume_checkpoint_dir="/var/run/mesos/isolators/docker/volume" --enforce_container_disk_quota="false"
--executor_registration_timeout="1mins" --executor_reregistration_timeout="2secs" --executor_secret_key="/tmp/Endpoint_SlaveEndpointTest_UnauthorizedRequest_1_QjXwJP/executor_secret_key"
--executor_shutdown_grace_period="5secs" --fetcher_cache_dir="/tmp/Endpoint_SlaveEndpointTest_UnauthorizedRequest_1_QjXwJP/fetch"
--fetcher_cache_size="2GB" --frameworks_home="" --gc_delay="1weeks" --gc_disk_headroom="0.1"
--hadoop_home="" --help="false" --hostname_lookup="true" --http_command_executor="false" --http_credentials="/tmp/Endpoint_SlaveEndpointTest_UnauthorizedRequest_1_QjXwJP/http_credentials"
--http_heartbeat_interval="30secs" --initialize_driver_logging="true" --isolation="posix/cpu,posix/mem"
--launcher="posix" --launcher_dir="/mesos/mesos-1.5.0/_build/src" --logbufsecs="0" --logging_level="INFO"
--max_completed_executors_per_framework="150" --oversubscribed_resources_interval="15secs"
--perf_duration="10secs" --perf_interval="1mins" --port="5051" --qos_correction_interval_min="0ns"
--quiet="false" --recover="reconnect" --recovery_timeout="15mins" --registration_backoff_factor="10ms"
--resources="cpus:2;gpus:0;mem:1024;disk:1024;ports:[31000-32000]" --revocable_cpu_low_priority="true"
--runtime_dir="/tmp/Endpoint_SlaveEndpointTest_UnauthorizedRequest_1_QjXwJP" --sandbox_directory="/mnt/mesos/sandbox"
--strict="true" --switch_user="true" --systemd_enable_support="true" --systemd_runtime_directory="/run/systemd/system"
--version="false" --work_dir="/tmp/Endpoint_SlaveEndpointTest_UnauthorizedRequest_1_jyeo6N"
--zk_session_timeout="10secs"
I0830 14:17:02.260921 30386 credentials.hpp:86] Loading credential for authentication from
'/tmp/Endpoint_SlaveEndpointTest_UnauthorizedRequest_1_QjXwJP/credential'
I0830 14:17:02.261082 30386 slave.cpp:285] Agent using credential for: test-principal
I0830 14:17:02.261106 30386 credentials.hpp:37] Loading credentials for authentication from
'/tmp/Endpoint_SlaveEndpointTest_UnauthorizedRequest_1_QjXwJP/http_credentials'
I0830 14:17:02.261386 30386 http.cpp:1045] Creating default 'basic' HTTP authenticator for
realm 'mesos-agent-executor'
I0830 14:17:02.261514 30386 http.cpp:1066] Creating default 'jwt' HTTP authenticator for realm
'mesos-agent-executor'
I0830 14:17:02.261719 30386 http.cpp:1045] Creating default 'basic' HTTP authenticator for
realm 'mesos-agent-readonly'
I0830 14:17:02.261822 30386 http.cpp:1066] Creating default 'jwt' HTTP authenticator for realm
'mesos-agent-readonly'
I0830 14:17:02.262006 30386 http.cpp:1045] Creating default 'basic' HTTP authenticator for
realm 'mesos-agent-readwrite'
I0830 14:17:02.262104 30386 http.cpp:1066] Creating default 'jwt' HTTP authenticator for realm
'mesos-agent-readwrite'
I0830 14:17:02.263607 30386 slave.cpp:581] Agent resources: [{"name":"cpus","scalar":{"value":2.0},"type":"SCALAR"},{"name":"mem","scalar":{"value":1024.0},"type":"SCALAR"},{"name":"disk","scalar":{"value":1024.0},"type":"SCALAR"},{"name":"ports","ranges":{"range":[{"begin":31000,"end":32000}]},"type":"RANGES"}]
I0830 14:17:02.263844 30386 slave.cpp:589] Agent attributes: [  ]
I0830 14:17:02.263859 30386 slave.cpp:598] Agent hostname: 487418f2b5e6
I0830 14:17:02.264003 30387 status_update_manager.cpp:177] Pausing sending status updates
I0830 14:17:02.265681 30390 state.cpp:64] Recovering state from '/tmp/Endpoint_SlaveEndpointTest_UnauthorizedRequest_1_jyeo6N/meta'
I0830 14:17:02.265965 30392 status_update_manager.cpp:203] Recovering status update manager
I0830 14:17:02.266176 30382 containerizer.cpp:646] Recovering containerizer
I0830 14:17:02.267544 30371 provisioner.cpp:416] Provisioner recovery complete
I0830 14:17:02.267859 30377 slave.cpp:6296] Finished recovery
I0830 14:17:02.268285 30377 slave.cpp:6478] Querying resource estimator for oversubscribable
resources
I0830 14:17:02.268523 30381 slave.cpp:6492] Received oversubscribable resources {} from the
resource estimator
I0830 14:17:02.270501 30384 process.cpp:3956] Handling HTTP event for process 'slave(811)'
with path: '/slave(811)/monitor/statistics.json'
I0830 14:17:02.272264 30385 http.cpp:1185] HTTP GET for /slave(811)/monitor/statistics.json
from 172.17.0.7:36290
I0830 14:17:02.272336 30385 http.cpp:976] Authorizing principal 'test-principal' to GET the
'/monitor/statistics.json' endpoint
I0830 14:17:02.274067 30392 slave.cpp:859] Agent terminating
[       OK ] Endpoint/SlaveEndpointTest.UnauthorizedRequest/1 (29 ms)
[ RUN      ] Endpoint/SlaveEndpointTest.UnauthorizedRequest/2
I0830 14:17:02.286856  9655 containerizer.cpp:290] Using isolation { environment_secret, posix/cpu,
posix/mem, filesystem/posix, network/cni }
W0830 14:17:02.287354  9655 backend.cpp:76] Failed to create 'aufs' backend: AufsBackend requires
root privileges
W0830 14:17:02.287466  9655 backend.cpp:76] Failed to create 'bind' backend: BindBackend requires
root privileges
I0830 14:17:02.287499  9655 provisioner.cpp:255] Using default backend 'copy'
I0830 14:17:02.290963 30385 slave.cpp:252] Mesos agent started on (812)@172.17.0.7:44926
I0830 14:17:02.290993 30385 slave.cpp:253] Flags at startup: --acls="" --appc_simple_discovery_uri_prefix="http://"
--appc_store_dir="/tmp/Endpoint_SlaveEndpointTest_UnauthorizedRequest_2_DszjvW/store/appc"
--authenticate_http_executors="true" --authenticate_http_readonly="true" --authenticate_http_readwrite="true"
--authenticatee="crammd5" --authentication_backoff_factor="1secs" --authorizer="local" --cgroups_cpu_enable_pids_and_tids_count="false"
--cgroups_enable_cfs="false" --cgroups_hierarchy="/sys/fs/cgroup" --cgroups_limit_swap="false"
--cgroups_root="mesos" --container_disk_watch_interval="15secs" --containerizers="mesos" --credential="/tmp/Endpoint_SlaveEndpointTest_UnauthorizedRequest_2_DszjvW/credential"
--default_role="*" --disallow_sharing_agent_pid_namespace="false" --disk_watch_interval="1mins"
--docker="docker" --docker_kill_orphans="true" --docker_registry="https://registry-1.docker.io"
--docker_remove_delay="6hrs" --docker_socket="/var/run/docker.sock" --docker_stop_timeout="0ns"
--docker_store_dir="/tmp/Endpoint_SlaveEndpointTest_UnauthorizedRequest_2_DszjvW/store/docker"
--docker_volume_checkpoint_dir="/var/run/mesos/isolators/docker/volume" --enforce_container_disk_quota="false"
--executor_registration_timeout="1mins" --executor_reregistration_timeout="2secs" --executor_secret_key="/tmp/Endpoint_SlaveEndpointTest_UnauthorizedRequest_2_DszjvW/executor_secret_key"
--executor_shutdown_grace_period="5secs" --fetcher_cache_dir="/tmp/Endpoint_SlaveEndpointTest_UnauthorizedRequest_2_DszjvW/fetch"
--fetcher_cache_size="2GB" --frameworks_home="" --gc_delay="1weeks" --gc_disk_headroom="0.1"
--hadoop_home="" --help="false" --hostname_lookup="true" --http_command_executor="false" --http_credentials="/tmp/Endpoint_SlaveEndpointTest_UnauthorizedRequest_2_DszjvW/http_credentials"
--http_heartbeat_interval="30secs" --initialize_driver_logging="true" --isolation="posix/cpu,posix/mem"
--launcher="posix" --launcher_dir="/mesos/mesos-1.5.0/_build/src" --logbufsecs="0" --logging_level="INFO"
--max_completed_executors_per_framework="150" --oversubscribed_resources_interval="15secs"
--perf_duration="10secs" --perf_interval="1mins" --port="5051" --qos_correction_interval_min="0ns"
--quiet="false" --recover="reconnect" --recovery_timeout="15mins" --registration_backoff_factor="10ms"
--resources="cpus:2;gpus:0;mem:1024;disk:1024;ports:[31000-32000]" --revocable_cpu_low_priority="true"
--runtime_dir="/tmp/Endpoint_SlaveEndpointTest_UnauthorizedRequest_2_DszjvW" --sandbox_directory="/mnt/mesos/sandbox"
--strict="true" --switch_user="true" --systemd_enable_support="true" --systemd_runtime_directory="/run/systemd/system"
--version="false" --work_dir="/tmp/Endpoint_SlaveEndpointTest_UnauthorizedRequest_2_uaHGNU"
--zk_session_timeout="10secs"
I0830 14:17:02.291532 30385 credentials.hpp:86] Loading credential for authentication from
'/tmp/Endpoint_SlaveEndpointTest_UnauthorizedRequest_2_DszjvW/credential'
I0830 14:17:02.291688 30385 slave.cpp:285] Agent using credential for: test-principal
I0830 14:17:02.291712 30385 credentials.hpp:37] Loading credentials for authentication from
'/tmp/Endpoint_SlaveEndpointTest_UnauthorizedRequest_2_DszjvW/http_credentials'
I0830 14:17:02.291988 30385 http.cpp:1045] Creating default 'basic' HTTP authenticator for
realm 'mesos-agent-executor'
I0830 14:17:02.292110 30385 http.cpp:1066] Creating default 'jwt' HTTP authenticator for realm
'mesos-agent-executor'
I0830 14:17:02.292315 30385 http.cpp:1045] Creating default 'basic' HTTP authenticator for
realm 'mesos-agent-readonly'
I0830 14:17:02.292414 30385 http.cpp:1066] Creating default 'jwt' HTTP authenticator for realm
'mesos-agent-readonly'
I0830 14:17:02.292595 30385 http.cpp:1045] Creating default 'basic' HTTP authenticator for
realm 'mesos-agent-readwrite'
I0830 14:17:02.292695 30385 http.cpp:1066] Creating default 'jwt' HTTP authenticator for realm
'mesos-agent-readwrite'
I0830 14:17:02.294095 30385 slave.cpp:581] Agent resources: [{"name":"cpus","scalar":{"value":2.0},"type":"SCALAR"},{"name":"mem","scalar":{"value":1024.0},"type":"SCALAR"},{"name":"disk","scalar":{"value":1024.0},"type":"SCALAR"},{"name":"ports","ranges":{"range":[{"begin":31000,"end":32000}]},"type":"RANGES"}]
I0830 14:17:02.294354 30385 slave.cpp:589] Agent attributes: [  ]
I0830 14:17:02.294369 30385 slave.cpp:598] Agent hostname: 487418f2b5e6
I0830 14:17:02.294497 30380 status_update_manager.cpp:177] Pausing sending status updates
I0830 14:17:02.295976 30388 state.cpp:64] Recovering state from '/tmp/Endpoint_SlaveEndpointTest_UnauthorizedRequest_2_uaHGNU/meta'
I0830 14:17:02.296283 30392 status_update_manager.cpp:203] Recovering status update manager
I0830 14:17:02.296458 30373 containerizer.cpp:646] Recovering containerizer
I0830 14:17:02.297660 30381 provisioner.cpp:416] Provisioner recovery complete
I0830 14:17:02.297982 30372 slave.cpp:6296] Finished recovery
I0830 14:17:02.298482 30372 slave.cpp:6478] Querying resource estimator for oversubscribable
resources
I0830 14:17:02.298737 30371 slave.cpp:6492] Received oversubscribable resources {} from the
resource estimator
I0830 14:17:02.300910 30389 process.cpp:3956] Handling HTTP event for process 'slave(812)'
with path: '/slave(812)/containers'
I0830 14:17:02.302614 30377 http.cpp:1185] HTTP GET for /slave(812)/containers from 172.17.0.7:36292
I0830 14:17:02.302688 30377 http.cpp:976] Authorizing principal 'test-principal' to GET the
'/containers' endpoint
I0830 14:17:02.304448 30377 slave.cpp:859] Agent terminating
[       OK ] Endpoint/SlaveEndpointTest.UnauthorizedRequest/2 (29 ms)
[ RUN      ] Endpoint/SlaveEndpointTest.NoAuthorizer/0
I0830 14:17:02.316678  9655 containerizer.cpp:290] Using isolation { environment_secret, posix/cpu,
posix/mem, filesystem/posix, network/cni }
W0830 14:17:02.317211  9655 backend.cpp:76] Failed to create 'aufs' backend: AufsBackend requires
root privileges
W0830 14:17:02.317337  9655 backend.cpp:76] Failed to create 'bind' backend: BindBackend requires
root privileges
I0830 14:17:02.317378  9655 provisioner.cpp:255] Using default backend 'copy'
I0830 14:17:02.319057  9655 cluster.cpp:448] Creating default 'local' authorizer
I0830 14:17:02.321033 30382 slave.cpp:252] Mesos agent started on (813)@172.17.0.7:44926
I0830 14:17:02.321058 30382 slave.cpp:253] Flags at startup: --acls="" --appc_simple_discovery_uri_prefix="http://"
--appc_store_dir="/tmp/Endpoint_SlaveEndpointTest_NoAuthorizer_0_LG8Ry3/store/appc" --authenticate_http_executors="true"
--authenticate_http_readonly="true" --authenticate_http_readwrite="true" --authenticatee="crammd5"
--authentication_backoff_factor="1secs" --authorizer="local" --cgroups_cpu_enable_pids_and_tids_count="false"
--cgroups_enable_cfs="false" --cgroups_hierarchy="/sys/fs/cgroup" --cgroups_limit_swap="false"
--cgroups_root="mesos" --container_disk_watch_interval="15secs" --containerizers="mesos" --credential="/tmp/Endpoint_SlaveEndpointTest_NoAuthorizer_0_LG8Ry3/credential"
--default_role="*" --disallow_sharing_agent_pid_namespace="false" --disk_watch_interval="1mins"
--docker="docker" --docker_kill_orphans="true" --docker_registry="https://registry-1.docker.io"
--docker_remove_delay="6hrs" --docker_socket="/var/run/docker.sock" --docker_stop_timeout="0ns"
--docker_store_dir="/tmp/Endpoint_SlaveEndpointTest_NoAuthorizer_0_LG8Ry3/store/docker" --docker_volume_checkpoint_dir="/var/run/mesos/isolators/docker/volume"
--enforce_container_disk_quota="false" --executor_registration_timeout="1mins" --executor_reregistration_timeout="2secs"
--executor_secret_key="/tmp/Endpoint_SlaveEndpointTest_NoAuthorizer_0_LG8Ry3/executor_secret_key"
--executor_shutdown_grace_period="5secs" --fetcher_cache_dir="/tmp/Endpoint_SlaveEndpointTest_NoAuthorizer_0_LG8Ry3/fetch"
--fetcher_cache_size="2GB" --frameworks_home="" --gc_delay="1weeks" --gc_disk_headroom="0.1"
--hadoop_home="" --help="false" --hostname_lookup="true" --http_command_executor="false" --http_credentials="/tmp/Endpoint_SlaveEndpointTest_NoAuthorizer_0_LG8Ry3/http_credentials"
--http_heartbeat_interval="30secs" --initialize_driver_logging="true" --isolation="posix/cpu,posix/mem"
--launcher="posix" --launcher_dir="/mesos/mesos-1.5.0/_build/src" --logbufsecs="0" --logging_level="INFO"
--max_completed_executors_per_framework="150" --oversubscribed_resources_interval="15secs"
--perf_duration="10secs" --perf_interval="1mins" --port="5051" --qos_correction_interval_min="0ns"
--quiet="false" --recover="reconnect" --recovery_timeout="15mins" --registration_backoff_factor="10ms"
--resources="cpus:2;gpus:0;mem:1024;disk:1024;ports:[31000-32000]" --revocable_cpu_low_priority="true"
--runtime_dir="/tmp/Endpoint_SlaveEndpointTest_NoAuthorizer_0_LG8Ry3" --sandbox_directory="/mnt/mesos/sandbox"
--strict="true" --switch_user="true" --systemd_enable_support="true" --systemd_runtime_directory="/run/systemd/system"
--version="false" --work_dir="/tmp/Endpoint_SlaveEndpointTest_NoAuthorizer_0_o5EPM1" --zk_session_timeout="10secs"
I0830 14:17:02.321575 30382 credentials.hpp:86] Loading credential for authentication from
'/tmp/Endpoint_SlaveEndpointTest_NoAuthorizer_0_LG8Ry3/credential'
I0830 14:17:02.321760 30382 slave.cpp:285] Agent using credential for: test-principal
I0830 14:17:02.321790 30382 credentials.hpp:37] Loading credentials for authentication from
'/tmp/Endpoint_SlaveEndpointTest_NoAuthorizer_0_LG8Ry3/http_credentials'
I0830 14:17:02.322149 30382 http.cpp:1045] Creating default 'basic' HTTP authenticator for
realm 'mesos-agent-executor'
I0830 14:17:02.322319 30382 http.cpp:1066] Creating default 'jwt' HTTP authenticator for realm
'mesos-agent-executor'
I0830 14:17:02.322547 30382 http.cpp:1045] Creating default 'basic' HTTP authenticator for
realm 'mesos-agent-readonly'
I0830 14:17:02.322662 30382 http.cpp:1066] Creating default 'jwt' HTTP authenticator for realm
'mesos-agent-readonly'
I0830 14:17:02.322862 30382 http.cpp:1045] Creating default 'basic' HTTP authenticator for
realm 'mesos-agent-readwrite'
I0830 14:17:02.322983 30382 http.cpp:1066] Creating default 'jwt' HTTP authenticator for realm
'mesos-agent-readwrite'
I0830 14:17:02.324585 30382 slave.cpp:581] Agent resources: [{"name":"cpus","scalar":{"value":2.0},"type":"SCALAR"},{"name":"mem","scalar":{"value":1024.0},"type":"SCALAR"},{"name":"disk","scalar":{"value":1024.0},"type":"SCALAR"},{"name":"ports","ranges":{"range":[{"begin":31000,"end":32000}]},"type":"RANGES"}]
I0830 14:17:02.324995 30382 slave.cpp:589] Agent attributes: [  ]
I0830 14:17:02.325026 30382 slave.cpp:598] Agent hostname: 487418f2b5e6
I0830 14:17:02.325156 30377 status_update_manager.cpp:177] Pausing sending status updates
I0830 14:17:02.327522 30386 state.cpp:64] Recovering state from '/tmp/Endpoint_SlaveEndpointTest_NoAuthorizer_0_o5EPM1/meta'
I0830 14:17:02.327788 30380 status_update_manager.cpp:203] Recovering status update manager
I0830 14:17:02.327988 30390 containerizer.cpp:646] Recovering containerizer
I0830 14:17:02.329238 30387 provisioner.cpp:416] Provisioner recovery complete
I0830 14:17:02.329567 30371 slave.cpp:6296] Finished recovery
I0830 14:17:02.330005 30371 slave.cpp:6478] Querying resource estimator for oversubscribable
resources
I0830 14:17:02.330292 30379 slave.cpp:6492] Received oversubscribable resources {} from the
resource estimator
I0830 14:17:02.332259 30385 process.cpp:3956] Handling HTTP event for process 'slave(813)'
with path: '/slave(813)/monitor/statistics'
I0830 14:17:02.333984 30389 http.cpp:1185] HTTP GET for /slave(813)/monitor/statistics from
172.17.0.7:36296
I0830 14:17:02.334058 30389 http.cpp:976] Authorizing principal 'test-principal' to GET the
'/monitor/statistics' endpoint
I0830 14:17:02.336779 30380 slave.cpp:859] Agent terminating
[       OK ] Endpoint/SlaveEndpointTest.NoAuthorizer/0 (31 ms)
[ RUN      ] Endpoint/SlaveEndpointTest.NoAuthorizer/1
I0830 14:17:02.348630  9655 containerizer.cpp:290] Using isolation { environment_secret, posix/cpu,
posix/mem, filesystem/posix, network/cni }
W0830 14:17:02.349124  9655 backend.cpp:76] Failed to create 'aufs' backend: AufsBackend requires
root privileges
W0830 14:17:02.349246  9655 backend.cpp:76] Failed to create 'bind' backend: BindBackend requires
root privileges
I0830 14:17:02.349283  9655 provisioner.cpp:255] Using default backend 'copy'
I0830 14:17:02.350981  9655 cluster.cpp:448] Creating default 'local' authorizer
I0830 14:17:02.352910 30384 slave.cpp:252] Mesos agent started on (814)@172.17.0.7:44926
I0830 14:17:02.352936 30384 slave.cpp:253] Flags at startup: --acls="" --appc_simple_discovery_uri_prefix="http://"
--appc_store_dir="/tmp/Endpoint_SlaveEndpointTest_NoAuthorizer_1_1INmVa/store/appc" --authenticate_http_executors="true"
--authenticate_http_readonly="true" --authenticate_http_readwrite="true" --authenticatee="crammd5"
--authentication_backoff_factor="1secs" --authorizer="local" --cgroups_cpu_enable_pids_and_tids_count="false"
--cgroups_enable_cfs="false" --cgroups_hierarchy="/sys/fs/cgroup" --cgroups_limit_swap="false"
--cgroups_root="mesos" --container_disk_watch_interval="15secs" --containerizers="mesos" --credential="/tmp/Endpoint_SlaveEndpointTest_NoAuthorizer_1_1INmVa/credential"
--default_role="*" --disallow_sharing_agent_pid_namespace="false" --disk_watch_interval="1mins"
--docker="docker" --docker_kill_orphans="true" --docker_registry="https://registry-1.docker.io"
--docker_remove_delay="6hrs" --docker_socket="/var/run/docker.sock" --docker_stop_timeout="0ns"
--docker_store_dir="/tmp/Endpoint_SlaveEndpointTest_NoAuthorizer_1_1INmVa/store/docker" --docker_volume_checkpoint_dir="/var/run/mesos/isolators/docker/volume"
--enforce_container_disk_quota="false" --executor_registration_timeout="1mins" --executor_reregistration_timeout="2secs"
--executor_secret_key="/tmp/Endpoint_SlaveEndpointTest_NoAuthorizer_1_1INmVa/executor_secret_key"
--executor_shutdown_grace_period="5secs" --fetcher_cache_dir="/tmp/Endpoint_SlaveEndpointTest_NoAuthorizer_1_1INmVa/fetch"
--fetcher_cache_size="2GB" --frameworks_home="" --gc_delay="1weeks" --gc_disk_headroom="0.1"
--hadoop_home="" --help="false" --hostname_lookup="true" --http_command_executor="false" --http_credentials="/tmp/Endpoint_SlaveEndpointTest_NoAuthorizer_1_1INmVa/http_credentials"
--http_heartbeat_interval="30secs" --initialize_driver_logging="true" --isolation="posix/cpu,posix/mem"
--launcher="posix" --launcher_dir="/mesos/mesos-1.5.0/_build/src" --logbufsecs="0" --logging_level="INFO"
--max_completed_executors_per_framework="150" --oversubscribed_resources_interval="15secs"
--perf_duration="10secs" --perf_interval="1mins" --port="5051" --qos_correction_interval_min="0ns"
--quiet="false" --recover="reconnect" --recovery_timeout="15mins" --registration_backoff_factor="10ms"
--resources="cpus:2;gpus:0;mem:1024;disk:1024;ports:[31000-32000]" --revocable_cpu_low_priority="true"
--runtime_dir="/tmp/Endpoint_SlaveEndpointTest_NoAuthorizer_1_1INmVa" --sandbox_directory="/mnt/mesos/sandbox"
--strict="true" --switch_user="true" --systemd_enable_support="true" --systemd_runtime_directory="/run/systemd/system"
--version="false" --work_dir="/tmp/Endpoint_SlaveEndpointTest_NoAuthorizer_1_29bA48" --zk_session_timeout="10secs"
I0830 14:17:02.353333 30384 credentials.hpp:86] Loading credential for authentication from
'/tmp/Endpoint_SlaveEndpointTest_NoAuthorizer_1_1INmVa/credential'
I0830 14:17:02.353500 30384 slave.cpp:285] Agent using credential for: test-principal
I0830 14:17:02.353523 30384 credentials.hpp:37] Loading credentials for authentication from
'/tmp/Endpoint_SlaveEndpointTest_NoAuthorizer_1_1INmVa/http_credentials'
I0830 14:17:02.353813 30384 http.cpp:1045] Creating default 'basic' HTTP authenticator for
realm 'mesos-agent-executor'
I0830 14:17:02.353955 30384 http.cpp:1066] Creating default 'jwt' HTTP authenticator for realm
'mesos-agent-executor'
I0830 14:17:02.354169 30384 http.cpp:1045] Creating default 'basic' HTTP authenticator for
realm 'mesos-agent-readonly'
I0830 14:17:02.354295 30384 http.cpp:1066] Creating default 'jwt' HTTP authenticator for realm
'mesos-agent-readonly'
I0830 14:17:02.354485 30384 http.cpp:1045] Creating default 'basic' HTTP authenticator for
realm 'mesos-agent-readwrite'
I0830 14:17:02.354591 30384 http.cpp:1066] Creating default 'jwt' HTTP authenticator for realm
'mesos-agent-readwrite'
I0830 14:17:02.356004 30384 slave.cpp:581] Agent resources: [{"name":"cpus","scalar":{"value":2.0},"type":"SCALAR"},{"name":"mem","scalar":{"value":1024.0},"type":"SCALAR"},{"name":"disk","scalar":{"value":1024.0},"type":"SCALAR"},{"name":"ports","ranges":{"range":[{"begin":31000,"end":32000}]},"type":"RANGES"}]
I0830 14:17:02.356243 30384 slave.cpp:589] Agent attributes: [  ]
I0830 14:17:02.356259 30384 slave.cpp:598] Agent hostname: 487418f2b5e6
I0830 14:17:02.356408 30378 status_update_manager.cpp:177] Pausing sending status updates
I0830 14:17:02.357944 30385 state.cpp:64] Recovering state from '/tmp/Endpoint_SlaveEndpointTest_NoAuthorizer_1_29bA48/meta'
I0830 14:17:02.358253 30385 status_update_manager.cpp:203] Recovering status update manager
I0830 14:17:02.358474 30370 containerizer.cpp:646] Recovering containerizer
I0830 14:17:02.359791 30372 provisioner.cpp:416] Provisioner recovery complete
I0830 14:17:02.360088 30384 slave.cpp:6296] Finished recovery
I0830 14:17:02.360528 30384 slave.cpp:6478] Querying resource estimator for oversubscribable
resources
I0830 14:17:02.360788 30386 slave.cpp:6492] Received oversubscribable resources {} from the
resource estimator
I0830 14:17:02.363097 30388 process.cpp:3956] Handling HTTP event for process 'slave(814)'
with path: '/slave(814)/monitor/statistics.json'
I0830 14:17:02.364884 30387 http.cpp:1185] HTTP GET for /slave(814)/monitor/statistics.json
from 172.17.0.7:36302
I0830 14:17:02.364960 30387 http.cpp:976] Authorizing principal 'test-principal' to GET the
'/monitor/statistics.json' endpoint
I0830 14:17:02.367647 30393 slave.cpp:859] Agent terminating
[       OK ] Endpoint/SlaveEndpointTest.NoAuthorizer/1 (30 ms)
[ RUN      ] Endpoint/SlaveEndpointTest.NoAuthorizer/2
I0830 14:17:02.379287  9655 containerizer.cpp:290] Using isolation { environment_secret, posix/cpu,
posix/mem, filesystem/posix, network/cni }
W0830 14:17:02.379802  9655 backend.cpp:76] Failed to create 'aufs' backend: AufsBackend requires
root privileges
W0830 14:17:02.379941  9655 backend.cpp:76] Failed to create 'bind' backend: BindBackend requires
root privileges
I0830 14:17:02.379984  9655 provisioner.cpp:255] Using default backend 'copy'
I0830 14:17:02.381660  9655 cluster.cpp:448] Creating default 'local' authorizer
I0830 14:17:02.383589 30389 slave.cpp:252] Mesos agent started on (815)@172.17.0.7:44926
I0830 14:17:02.383613 30389 slave.cpp:253] Flags at startup: --acls="" --appc_simple_discovery_uri_prefix="http://"
--appc_store_dir="/tmp/Endpoint_SlaveEndpointTest_NoAuthorizer_2_9sc7zi/store/appc" --authenticate_http_executors="true"
--authenticate_http_readonly="true" --authenticate_http_readwrite="true" --authenticatee="crammd5"
--authentication_backoff_factor="1secs" --authorizer="local" --cgroups_cpu_enable_pids_and_tids_count="false"
--cgroups_enable_cfs="false" --cgroups_hierarchy="/sys/fs/cgroup" --cgroups_limit_swap="false"
--cgroups_root="mesos" --container_disk_watch_interval="15secs" --containerizers="mesos" --credential="/tmp/Endpoint_SlaveEndpointTest_NoAuthorizer_2_9sc7zi/credential"
--default_role="*" --disallow_sharing_agent_pid_namespace="false" --disk_watch_interval="1mins"
--docker="docker" --docker_kill_orphans="true" --docker_registry="https://registry-1.docker.io"
--docker_remove_delay="6hrs" --docker_socket="/var/run/docker.sock" --docker_stop_timeout="0ns"
--docker_store_dir="/tmp/Endpoint_SlaveEndpointTest_NoAuthorizer_2_9sc7zi/store/docker" --docker_volume_checkpoint_dir="/var/run/mesos/isolators/docker/volume"
--enforce_container_disk_quota="false" --executor_registration_timeout="1mins" --executor_reregistration_timeout="2secs"
--executor_secret_key="/tmp/Endpoint_SlaveEndpointTest_NoAuthorizer_2_9sc7zi/executor_secret_key"
--executor_shutdown_grace_period="5secs" --fetcher_cache_dir="/tmp/Endpoint_SlaveEndpointTest_NoAuthorizer_2_9sc7zi/fetch"
--fetcher_cache_size="2GB" --frameworks_home="" --gc_delay="1weeks" --gc_disk_headroom="0.1"
--hadoop_home="" --help="false" --hostname_lookup="true" --http_command_executor="false" --http_credentials="/tmp/Endpoint_SlaveEndpointTest_NoAuthorizer_2_9sc7zi/http_credentials"
--http_heartbeat_interval="30secs" --initialize_driver_logging="true" --isolation="posix/cpu,posix/mem"
--launcher="posix" --launcher_dir="/mesos/mesos-1.5.0/_build/src" --logbufsecs="0" --logging_level="INFO"
--max_completed_executors_per_framework="150" --oversubscribed_resources_interval="15secs"
--perf_duration="10secs" --perf_interval="1mins" --port="5051" --qos_correction_interval_min="0ns"
--quiet="false" --recover="reconnect" --recovery_timeout="15mins" --registration_backoff_factor="10ms"
--resources="cpus:2;gpus:0;mem:1024;disk:1024;ports:[31000-32000]" --revocable_cpu_low_priority="true"
--runtime_dir="/tmp/Endpoint_SlaveEndpointTest_NoAuthorizer_2_9sc7zi" --sandbox_directory="/mnt/mesos/sandbox"
--strict="true" --switch_user="true" --systemd_enable_support="true" --systemd_runtime_directory="/run/systemd/system"
--version="false" --work_dir="/tmp/Endpoint_SlaveEndpointTest_NoAuthorizer_2_Us0KEg" --zk_session_timeout="10secs"
I0830 14:17:02.384047 30389 credentials.hpp:86] Loading credential for authentication from
'/tmp/Endpoint_SlaveEndpointTest_NoAuthorizer_2_9sc7zi/credential'
I0830 14:17:02.384244 30389 slave.cpp:285] Agent using credential for: test-principal
I0830 14:17:02.384276 30389 credentials.hpp:37] Loading credentials for authentication from
'/tmp/Endpoint_SlaveEndpointTest_NoAuthorizer_2_9sc7zi/http_credentials'
I0830 14:17:02.384598 30389 http.cpp:1045] Creating default 'basic' HTTP authenticator for
realm 'mesos-agent-executor'
I0830 14:17:02.384728 30389 http.cpp:1066] Creating default 'jwt' HTTP authenticator for realm
'mesos-agent-executor'
I0830 14:17:02.384965 30389 http.cpp:1045] Creating default 'basic' HTTP authenticator for
realm 'mesos-agent-readonly'
I0830 14:17:02.385092 30389 http.cpp:1066] Creating default 'jwt' HTTP authenticator for realm
'mesos-agent-readonly'
I0830 14:17:02.385279 30389 http.cpp:1045] Creating default 'basic' HTTP authenticator for
realm 'mesos-agent-readwrite'
I0830 14:17:02.385380 30389 http.cpp:1066] Creating default 'jwt' HTTP authenticator for realm
'mesos-agent-readwrite'
I0830 14:17:02.386818 30389 slave.cpp:581] Agent resources: [{"name":"cpus","scalar":{"value":2.0},"type":"SCALAR"},{"name":"mem","scalar":{"value":1024.0},"type":"SCALAR"},{"name":"disk","scalar":{"value":1024.0},"type":"SCALAR"},{"name":"ports","ranges":{"range":[{"begin":31000,"end":32000}]},"type":"RANGES"}]
I0830 14:17:02.387053 30389 slave.cpp:589] Agent attributes: [  ]
I0830 14:17:02.387065 30389 slave.cpp:598] Agent hostname: 487418f2b5e6
I0830 14:17:02.387221 30378 status_update_manager.cpp:177] Pausing sending status updates
I0830 14:17:02.389197 30390 state.cpp:64] Recovering state from '/tmp/Endpoint_SlaveEndpointTest_NoAuthorizer_2_Us0KEg/meta'
I0830 14:17:02.389508 30390 status_update_manager.cpp:203] Recovering status update manager
I0830 14:17:02.389695 30390 containerizer.cpp:646] Recovering containerizer
I0830 14:17:02.391060 30381 provisioner.cpp:416] Provisioner recovery complete
I0830 14:17:02.391458 30389 slave.cpp:6296] Finished recovery
I0830 14:17:02.391959 30389 slave.cpp:6478] Querying resource estimator for oversubscribable
resources
I0830 14:17:02.392228 30380 slave.cpp:6492] Received oversubscribable resources {} from the
resource estimator
I0830 14:17:02.394556 30385 process.cpp:3956] Handling HTTP event for process 'slave(815)'
with path: '/slave(815)/containers'
I0830 14:17:02.396364 30383 http.cpp:1185] HTTP GET for /slave(815)/containers from 172.17.0.7:36304
I0830 14:17:02.396443 30383 http.cpp:976] Authorizing principal 'test-principal' to GET the
'/containers' endpoint
I0830 14:17:02.400174 30370 slave.cpp:859] Agent terminating
[       OK ] Endpoint/SlaveEndpointTest.NoAuthorizer/2 (33 ms)
[----------] 9 tests from Endpoint/SlaveEndpointTest (279 ms total)

[----------] 2 tests from ContainerizerType/DefaultContainerDNSFlagTest
[ RUN      ] ContainerizerType/DefaultContainerDNSFlagTest.ValidateFlag/0
[       OK ] ContainerizerType/DefaultContainerDNSFlagTest.ValidateFlag/0 (11 ms)
[ RUN      ] ContainerizerType/DefaultContainerDNSFlagTest.ValidateFlag/1
[       OK ] ContainerizerType/DefaultContainerDNSFlagTest.ValidateFlag/1 (10 ms)
[----------] 2 tests from ContainerizerType/DefaultContainerDNSFlagTest (21 ms total)

[----------] Global test environment tear-down
[==========] 1668 tests from 185 test cases ran. (519078 ms total)
[  PASSED  ] 1667 tests.
[  FAILED  ] 1 test, listed below:
[  FAILED  ] ExamplesTest.NoExecutorFramework

 1 FAILED TEST
  YOU HAVE 20 DISABLED TESTS

I0830 14:17:02.492846 30394 process.cpp:1072] Failed to accept socket: future discarded
make[4]: *** [check-local] Error 1
make[4]: Leaving directory `/mesos/mesos-1.5.0/_build/src'
make[3]: *** [check-am] Error 2
make[3]: Leaving directory `/mesos/mesos-1.5.0/_build/src'
make[2]: *** [check] Error 2
make[2]: Leaving directory `/mesos/mesos-1.5.0/_build/src'
make[1]: *** [check-recursive] Error 1
make[1]: Leaving directory `/mesos/mesos-1.5.0/_build'
make: *** [distcheck] Error 1
+ docker rmi mesos-1504100022-16314
Untagged: mesos-1504100022-16314:latest
Deleted: sha256:db074df4413488c981b789569d6eba8fdaf120a95f470c41e690979faff4882f
Deleted: sha256:4a5b56ed6b3654becc947e38b6960b33aef2ddc2857c3906dfbf4b848675b26d
Deleted: sha256:6051b1fade20142bec5592583b1097f22d660974463913f5755ad1fc0e3daa92
Deleted: sha256:dbe4113bec9c51abc61af88dc158cf67397787311620eebf388f40a79b36d3b1
Deleted: sha256:128b7e635392eb0b4cc6447c74a63662d034a483f6085cb42888b2a25fe96b6f
Deleted: sha256:5a10fcb989459bcd5b948b227aacd1ad87f9747a4358c7bd60b40676a8e23e9d
Deleted: sha256:fc84df2cae1292e03e5c6ae0e5a325d3c0865502ec8f46b914781e588ec5957b
Deleted: sha256:1308d2cff77892b1f3b54815de3fefd3ab36a9018089884511e305a88ebff00f
Deleted: sha256:7174f5e64f9e717f69b6b54d72595784848dc3f026e56efb8fe6ac2f625a2a87
Deleted: sha256:6428a804020ce49d3fee6f9dbe69e3703af51f146c7c2bc8eb2a61fe918df0c8
Deleted: sha256:be1b0e9b4695fb7c4b353e150529c3316d1a0eda70cd464eb64567bf2ba155af
Deleted: sha256:60db994e3b17a9cc023cd1ed09c14b774bf323673d11ac8cc833a9cd41ae3a82
Deleted: sha256:9772e41633a5bb4446fb1b6955ae022a83ccc25e9bb0bfa3deca711d9d674216
Deleted: sha256:0989330962c83367b0d1125d6023f750949f1c80303d9aa55a17ba0aafdfd186
Deleted: sha256:7316640d2b223b5dfd029c1c3f56821453b3c7fe6288b1babd53c4a6b67fbdbf
Deleted: sha256:2e42fe581376c294ecebe09547b8fcc16fae60f9d72dd067963f5c94c72b53ad
Deleted: sha256:e6d321e845e8e4cf8ab1fd1d81e10e2e56e28327d279e6502a09a6dca63ad983
Deleted: sha256:e43528914cc23fbcf1c769f25a6301af146b71faba08d1a05cde30ee109be31b
Deleted: sha256:b324dcc935d868a6f03bce89da32cf701530d33d7daae7abaa101ac5cc20ae62
Deleted: sha256:b327333b2ad827df967c96541d5a0f5b61987b949ea8b0a319667212ac9a879d
Deleted: sha256:ac7b9ce44b95d4e5e3053e653ceec65b1b3c9331b0a5567d035cff6757797544
Deleted: sha256:4c4ce723e5ddd98248ec313d8ad00f20f918862ca372fcca6a1ad7e8d5644530
Deleted: sha256:1da2364c832ab964fb6884f59f26adff6cfb8a938b62fc8b9309d2cf20dc3f0e
Deleted: sha256:df45c4a3628e5e7897d2d4deb467bd46db9f59c2a644018c32d77d55a32dfedc
Deleted: sha256:46089fe39af725178c7334130f18439951667cc04e337ffdbc67154bb105ef5d
Build step 'Execute shell' marked build as failure
Not sending mail to unregistered user yujie.jay@gmail.com
Not sending mail to unregistered user benjamin.hindman@gmail.com
Not sending mail to unregistered user xujyan@apple.com

Mime
View raw message