mesos-builds mailing list archives

Site index · List index
Message view « Date » · « Thread »
Top « Date » · « Thread »
From Apache Jenkins Server <jenk...@builds.apache.org>
Subject Build failed in Jenkins: Mesos-Buildbot » autotools,clang,--verbose --enable-libevent --enable-ssl,GLOG_v=1 MESOS_VERBOSE=1,ubuntu:14.04,(ubuntu)&&(!ubuntu-us1)&&(!ubuntu-eu2) #4145
Date Thu, 24 Aug 2017 07:35:33 GMT
See <https://builds.apache.org/job/Mesos-Buildbot/BUILDTOOL=autotools,COMPILER=clang,CONFIGURATION=--verbose%20--enable-libevent%20--enable-ssl,ENVIRONMENT=GLOG_v=1%20MESOS_VERBOSE=1,OS=ubuntu%3A14.04,label_exp=(ubuntu)&&(!ubuntu-us1)&&(!ubuntu-eu2)/4145/display/redirect?page=changes>

Changes:

[bmahler] Fixed a bug where the agent kills and still launches a task.

[bmahler] Added MESOS-7865 to the 1.4.1 CHANGELOG.

[bmahler] Improved the reason and message for tasks killed before delivery.

[bmahler] Updated Framework::removePendingTask to take only a TaskID.

[bmahler] Introduced a Framework::idle function in the agent.

[bmahler] Renamed Framework::pending to Framework::pendingTasks in agent.

[bmahler] Introduced a CHECK_NOTNONE.

[bmahler] Fixed a bug where TASK_KILLED updates can be dropped by the agent.

[bmahler] Added a missing return statement from 45c2444ad.

[bmahler] Added MESOS-7863 to the 1.4.1 CHANGELOG.

[yujie.jay] Adjusted the ContainerLaunchInfo.command merge logic.

[yujie.jay] Added MESOS-7909 to 1.4.1 CHANGELOG.

------------------------------------------
[...truncated 32.05 MB...]
W0824 07:35:22.870347  6701 backend.cpp:76] Failed to create 'aufs' backend: AufsBackend requires
root privileges
W0824 07:35:22.870463  6701 backend.cpp:76] Failed to create 'bind' backend: BindBackend requires
root privileges
I0824 07:35:22.870502  6701 provisioner.cpp:255] Using default backend 'copy'
I0824 07:35:22.873953 27601 slave.cpp:250] Mesos agent started on (806)@172.17.0.4:39236
I0824 07:35:22.873988 27601 slave.cpp:251] Flags at startup: --acls="" --appc_simple_discovery_uri_prefix="http://"
--appc_store_dir="/tmp/Endpoint_SlaveEndpointTest_UnauthorizedRequest_0_LGjjDM/store/appc"
--authenticate_http_executors="true" --authenticate_http_readonly="true" --authenticate_http_readwrite="true"
--authenticatee="crammd5" --authentication_backoff_factor="1secs" --authorizer="local" --cgroups_cpu_enable_pids_and_tids_count="false"
--cgroups_enable_cfs="false" --cgroups_hierarchy="/sys/fs/cgroup" --cgroups_limit_swap="false"
--cgroups_root="mesos" --container_disk_watch_interval="15secs" --containerizers="mesos" --credential="/tmp/Endpoint_SlaveEndpointTest_UnauthorizedRequest_0_LGjjDM/credential"
--default_role="*" --disallow_sharing_agent_pid_namespace="false" --disk_watch_interval="1mins"
--docker="docker" --docker_kill_orphans="true" --docker_registry="https://registry-1.docker.io"
--docker_remove_delay="6hrs" --docker_socket="/var/run/docker.sock" --docker_stop_timeout="0ns"
--docker_store_dir="/tmp/Endpoint_SlaveEndpointTest_UnauthorizedRequest_0_LGjjDM/store/docker"
--docker_volume_checkpoint_dir="/var/run/mesos/isolators/docker/volume" --enforce_container_disk_quota="false"
--executor_registration_timeout="1mins" --executor_reregistration_timeout="2secs" --executor_secret_key="/tmp/Endpoint_SlaveEndpointTest_UnauthorizedRequest_0_LGjjDM/executor_secret_key"
--executor_shutdown_grace_period="5secs" --fetcher_cache_dir="/tmp/Endpoint_SlaveEndpointTest_UnauthorizedRequest_0_LGjjDM/fetch"
--fetcher_cache_size="2GB" --frameworks_home="" --gc_delay="1weeks" --gc_disk_headroom="0.1"
--hadoop_home="" --help="false" --hostname_lookup="true" --http_command_executor="false" --http_credentials="/tmp/Endpoint_SlaveEndpointTest_UnauthorizedRequest_0_LGjjDM/http_credentials"
--http_heartbeat_interval="30secs" --initialize_driver_logging="true" --isolation="posix/cpu,posix/mem"
--launcher="posix" --launcher_dir="/mesos/mesos-1.4.0/_build/src" --logbufsecs="0" --logging_level="INFO"
--max_completed_executors_per_framework="150" --oversubscribed_resources_interval="15secs"
--perf_duration="10secs" --perf_interval="1mins" --port="5051" --qos_correction_interval_min="0ns"
--quiet="false" --recover="reconnect" --recovery_timeout="15mins" --registration_backoff_factor="10ms"
--resources="cpus:2;gpus:0;mem:1024;disk:1024;ports:[31000-32000]" --revocable_cpu_low_priority="true"
--runtime_dir="/tmp/Endpoint_SlaveEndpointTest_UnauthorizedRequest_0_LGjjDM" --sandbox_directory="/mnt/mesos/sandbox"
--strict="true" --switch_user="true" --systemd_enable_support="true" --systemd_runtime_directory="/run/systemd/system"
--version="false" --work_dir="/tmp/Endpoint_SlaveEndpointTest_UnauthorizedRequest_0_MQVkwy"
I0824 07:35:22.874337 27601 credentials.hpp:86] Loading credential for authentication from
'/tmp/Endpoint_SlaveEndpointTest_UnauthorizedRequest_0_LGjjDM/credential'
I0824 07:35:22.874485 27601 slave.cpp:283] Agent using credential for: test-principal
I0824 07:35:22.874506 27601 credentials.hpp:37] Loading credentials for authentication from
'/tmp/Endpoint_SlaveEndpointTest_UnauthorizedRequest_0_LGjjDM/http_credentials'
I0824 07:35:22.874765 27601 http.cpp:1026] Creating default 'basic' HTTP authenticator for
realm 'mesos-agent-executor'
I0824 07:35:22.874887 27601 http.cpp:1047] Creating default 'jwt' HTTP authenticator for realm
'mesos-agent-executor'
I0824 07:35:22.875077 27601 http.cpp:1026] Creating default 'basic' HTTP authenticator for
realm 'mesos-agent-readonly'
I0824 07:35:22.875174 27601 http.cpp:1047] Creating default 'jwt' HTTP authenticator for realm
'mesos-agent-readonly'
I0824 07:35:22.875349 27601 http.cpp:1026] Creating default 'basic' HTTP authenticator for
realm 'mesos-agent-readwrite'
I0824 07:35:22.875447 27601 http.cpp:1047] Creating default 'jwt' HTTP authenticator for realm
'mesos-agent-readwrite'
I0824 07:35:22.876865 27601 slave.cpp:565] Agent resources: [{"name":"cpus","scalar":{"value":2.0},"type":"SCALAR"},{"name":"mem","scalar":{"value":1024.0},"type":"SCALAR"},{"name":"disk","scalar":{"value":1024.0},"type":"SCALAR"},{"name":"ports","ranges":{"range":[{"begin":31000,"end":32000}]},"type":"RANGES"}]
I0824 07:35:22.877089 27601 slave.cpp:573] Agent attributes: [  ]
I0824 07:35:22.877101 27601 slave.cpp:582] Agent hostname: bfacdca9d48b
I0824 07:35:22.877229 27609 status_update_manager.cpp:177] Pausing sending status updates
I0824 07:35:22.878631 27607 state.cpp:64] Recovering state from '/tmp/Endpoint_SlaveEndpointTest_UnauthorizedRequest_0_MQVkwy/meta'
I0824 07:35:22.878888 27600 status_update_manager.cpp:203] Recovering status update manager
I0824 07:35:22.879060 27618 containerizer.cpp:609] Recovering containerizer
I0824 07:35:22.880255 27598 provisioner.cpp:416] Provisioner recovery complete
I0824 07:35:22.880537 27606 slave.cpp:6242] Finished recovery
I0824 07:35:22.880959 27606 slave.cpp:6424] Querying resource estimator for oversubscribable
resources
I0824 07:35:22.881142 27613 slave.cpp:6438] Received oversubscribable resources {} from the
resource estimator
I0824 07:35:22.883286 27604 process.cpp:3933] Handling HTTP event for process 'slave(806)'
with path: '/slave(806)/monitor/statistics'
I0824 07:35:22.885140 27608 http.cpp:1166] HTTP GET for /slave(806)/monitor/statistics from
172.17.0.4:54554
I0824 07:35:22.885220 27608 http.cpp:957] Authorizing principal 'test-principal' to GET the
'/monitor/statistics' endpoint
I0824 07:35:22.886930 27608 slave.cpp:843] Agent terminating
[       OK ] Endpoint/SlaveEndpointTest.UnauthorizedRequest/0 (27 ms)
[ RUN      ] Endpoint/SlaveEndpointTest.UnauthorizedRequest/1
I0824 07:35:22.897121  6701 containerizer.cpp:246] Using isolation: posix/cpu,posix/mem,filesystem/posix,network/cni,environment_secret
W0824 07:35:22.897573  6701 backend.cpp:76] Failed to create 'aufs' backend: AufsBackend requires
root privileges
W0824 07:35:22.897680  6701 backend.cpp:76] Failed to create 'bind' backend: BindBackend requires
root privileges
I0824 07:35:22.897714  6701 provisioner.cpp:255] Using default backend 'copy'
I0824 07:35:22.901029 27609 slave.cpp:250] Mesos agent started on (807)@172.17.0.4:39236
I0824 07:35:22.901062 27609 slave.cpp:251] Flags at startup: --acls="" --appc_simple_discovery_uri_prefix="http://"
--appc_store_dir="/tmp/Endpoint_SlaveEndpointTest_UnauthorizedRequest_1_nGz7iH/store/appc"
--authenticate_http_executors="true" --authenticate_http_readonly="true" --authenticate_http_readwrite="true"
--authenticatee="crammd5" --authentication_backoff_factor="1secs" --authorizer="local" --cgroups_cpu_enable_pids_and_tids_count="false"
--cgroups_enable_cfs="false" --cgroups_hierarchy="/sys/fs/cgroup" --cgroups_limit_swap="false"
--cgroups_root="mesos" --container_disk_watch_interval="15secs" --containerizers="mesos" --credential="/tmp/Endpoint_SlaveEndpointTest_UnauthorizedRequest_1_nGz7iH/credential"
--default_role="*" --disallow_sharing_agent_pid_namespace="false" --disk_watch_interval="1mins"
--docker="docker" --docker_kill_orphans="true" --docker_registry="https://registry-1.docker.io"
--docker_remove_delay="6hrs" --docker_socket="/var/run/docker.sock" --docker_stop_timeout="0ns"
--docker_store_dir="/tmp/Endpoint_SlaveEndpointTest_UnauthorizedRequest_1_nGz7iH/store/docker"
--docker_volume_checkpoint_dir="/var/run/mesos/isolators/docker/volume" --enforce_container_disk_quota="false"
--executor_registration_timeout="1mins" --executor_reregistration_timeout="2secs" --executor_secret_key="/tmp/Endpoint_SlaveEndpointTest_UnauthorizedRequest_1_nGz7iH/executor_secret_key"
--executor_shutdown_grace_period="5secs" --fetcher_cache_dir="/tmp/Endpoint_SlaveEndpointTest_UnauthorizedRequest_1_nGz7iH/fetch"
--fetcher_cache_size="2GB" --frameworks_home="" --gc_delay="1weeks" --gc_disk_headroom="0.1"
--hadoop_home="" --help="false" --hostname_lookup="true" --http_command_executor="false" --http_credentials="/tmp/Endpoint_SlaveEndpointTest_UnauthorizedRequest_1_nGz7iH/http_credentials"
--http_heartbeat_interval="30secs" --initialize_driver_logging="true" --isolation="posix/cpu,posix/mem"
--launcher="posix" --launcher_dir="/mesos/mesos-1.4.0/_build/src" --logbufsecs="0" --logging_level="INFO"
--max_completed_executors_per_framework="150" --oversubscribed_resources_interval="15secs"
--perf_duration="10secs" --perf_interval="1mins" --port="5051" --qos_correction_interval_min="0ns"
--quiet="false" --recover="reconnect" --recovery_timeout="15mins" --registration_backoff_factor="10ms"
--resources="cpus:2;gpus:0;mem:1024;disk:1024;ports:[31000-32000]" --revocable_cpu_low_priority="true"
--runtime_dir="/tmp/Endpoint_SlaveEndpointTest_UnauthorizedRequest_1_nGz7iH" --sandbox_directory="/mnt/mesos/sandbox"
--strict="true" --switch_user="true" --systemd_enable_support="true" --systemd_runtime_directory="/run/systemd/system"
--version="false" --work_dir="/tmp/Endpoint_SlaveEndpointTest_UnauthorizedRequest_1_cY447s"
I0824 07:35:22.901427 27609 credentials.hpp:86] Loading credential for authentication from
'/tmp/Endpoint_SlaveEndpointTest_UnauthorizedRequest_1_nGz7iH/credential'
I0824 07:35:22.901577 27609 slave.cpp:283] Agent using credential for: test-principal
I0824 07:35:22.901604 27609 credentials.hpp:37] Loading credentials for authentication from
'/tmp/Endpoint_SlaveEndpointTest_UnauthorizedRequest_1_nGz7iH/http_credentials'
I0824 07:35:22.901883 27609 http.cpp:1026] Creating default 'basic' HTTP authenticator for
realm 'mesos-agent-executor'
I0824 07:35:22.902001 27609 http.cpp:1047] Creating default 'jwt' HTTP authenticator for realm
'mesos-agent-executor'
I0824 07:35:22.902217 27609 http.cpp:1026] Creating default 'basic' HTTP authenticator for
realm 'mesos-agent-readonly'
I0824 07:35:22.902318 27609 http.cpp:1047] Creating default 'jwt' HTTP authenticator for realm
'mesos-agent-readonly'
I0824 07:35:22.902514 27609 http.cpp:1026] Creating default 'basic' HTTP authenticator for
realm 'mesos-agent-readwrite'
I0824 07:35:22.902621 27609 http.cpp:1047] Creating default 'jwt' HTTP authenticator for realm
'mesos-agent-readwrite'
I0824 07:35:22.903934 27609 slave.cpp:565] Agent resources: [{"name":"cpus","scalar":{"value":2.0},"type":"SCALAR"},{"name":"mem","scalar":{"value":1024.0},"type":"SCALAR"},{"name":"disk","scalar":{"value":1024.0},"type":"SCALAR"},{"name":"ports","ranges":{"range":[{"begin":31000,"end":32000}]},"type":"RANGES"}]
I0824 07:35:22.904151 27609 slave.cpp:573] Agent attributes: [  ]
I0824 07:35:22.904165 27609 slave.cpp:582] Agent hostname: bfacdca9d48b
I0824 07:35:22.904271 27598 status_update_manager.cpp:177] Pausing sending status updates
I0824 07:35:22.905678 27596 state.cpp:64] Recovering state from '/tmp/Endpoint_SlaveEndpointTest_UnauthorizedRequest_1_cY447s/meta'
I0824 07:35:22.905972 27596 status_update_manager.cpp:203] Recovering status update manager
I0824 07:35:22.906133 27602 containerizer.cpp:609] Recovering containerizer
I0824 07:35:22.907305 27601 provisioner.cpp:416] Provisioner recovery complete
I0824 07:35:22.907661 27597 slave.cpp:6242] Finished recovery
I0824 07:35:22.908064 27597 slave.cpp:6424] Querying resource estimator for oversubscribable
resources
I0824 07:35:22.908260 27617 slave.cpp:6438] Received oversubscribable resources {} from the
resource estimator
I0824 07:35:22.910229 27598 process.cpp:3933] Handling HTTP event for process 'slave(807)'
with path: '/slave(807)/monitor/statistics.json'
I0824 07:35:22.911708 27596 http.cpp:1166] HTTP GET for /slave(807)/monitor/statistics.json
from 172.17.0.4:54556
I0824 07:35:22.911777 27596 http.cpp:957] Authorizing principal 'test-principal' to GET the
'/monitor/statistics.json' endpoint
I0824 07:35:22.913478 27612 slave.cpp:843] Agent terminating
[       OK ] Endpoint/SlaveEndpointTest.UnauthorizedRequest/1 (26 ms)
[ RUN      ] Endpoint/SlaveEndpointTest.UnauthorizedRequest/2
I0824 07:35:22.923864  6701 containerizer.cpp:246] Using isolation: posix/cpu,posix/mem,filesystem/posix,network/cni,environment_secret
W0824 07:35:22.924337  6701 backend.cpp:76] Failed to create 'aufs' backend: AufsBackend requires
root privileges
W0824 07:35:22.924445  6701 backend.cpp:76] Failed to create 'bind' backend: BindBackend requires
root privileges
I0824 07:35:22.924479  6701 provisioner.cpp:255] Using default backend 'copy'
I0824 07:35:22.927824 27605 slave.cpp:250] Mesos agent started on (808)@172.17.0.4:39236
I0824 07:35:22.927860 27605 slave.cpp:251] Flags at startup: --acls="" --appc_simple_discovery_uri_prefix="http://"
--appc_store_dir="/tmp/Endpoint_SlaveEndpointTest_UnauthorizedRequest_2_7N9OeC/store/appc"
--authenticate_http_executors="true" --authenticate_http_readonly="true" --authenticate_http_readwrite="true"
--authenticatee="crammd5" --authentication_backoff_factor="1secs" --authorizer="local" --cgroups_cpu_enable_pids_and_tids_count="false"
--cgroups_enable_cfs="false" --cgroups_hierarchy="/sys/fs/cgroup" --cgroups_limit_swap="false"
--cgroups_root="mesos" --container_disk_watch_interval="15secs" --containerizers="mesos" --credential="/tmp/Endpoint_SlaveEndpointTest_UnauthorizedRequest_2_7N9OeC/credential"
--default_role="*" --disallow_sharing_agent_pid_namespace="false" --disk_watch_interval="1mins"
--docker="docker" --docker_kill_orphans="true" --docker_registry="https://registry-1.docker.io"
--docker_remove_delay="6hrs" --docker_socket="/var/run/docker.sock" --docker_stop_timeout="0ns"
--docker_store_dir="/tmp/Endpoint_SlaveEndpointTest_UnauthorizedRequest_2_7N9OeC/store/docker"
--docker_volume_checkpoint_dir="/var/run/mesos/isolators/docker/volume" --enforce_container_disk_quota="false"
--executor_registration_timeout="1mins" --executor_reregistration_timeout="2secs" --executor_secret_key="/tmp/Endpoint_SlaveEndpointTest_UnauthorizedRequest_2_7N9OeC/executor_secret_key"
--executor_shutdown_grace_period="5secs" --fetcher_cache_dir="/tmp/Endpoint_SlaveEndpointTest_UnauthorizedRequest_2_7N9OeC/fetch"
--fetcher_cache_size="2GB" --frameworks_home="" --gc_delay="1weeks" --gc_disk_headroom="0.1"
--hadoop_home="" --help="false" --hostname_lookup="true" --http_command_executor="false" --http_credentials="/tmp/Endpoint_SlaveEndpointTest_UnauthorizedRequest_2_7N9OeC/http_credentials"
--http_heartbeat_interval="30secs" --initialize_driver_logging="true" --isolation="posix/cpu,posix/mem"
--launcher="posix" --launcher_dir="/mesos/mesos-1.4.0/_build/src" --logbufsecs="0" --logging_level="INFO"
--max_completed_executors_per_framework="150" --oversubscribed_resources_interval="15secs"
--perf_duration="10secs" --perf_interval="1mins" --port="5051" --qos_correction_interval_min="0ns"
--quiet="false" --recover="reconnect" --recovery_timeout="15mins" --registration_backoff_factor="10ms"
--resources="cpus:2;gpus:0;mem:1024;disk:1024;ports:[31000-32000]" --revocable_cpu_low_priority="true"
--runtime_dir="/tmp/Endpoint_SlaveEndpointTest_UnauthorizedRequest_2_7N9OeC" --sandbox_directory="/mnt/mesos/sandbox"
--strict="true" --switch_user="true" --systemd_enable_support="true" --systemd_runtime_directory="/run/systemd/system"
--version="false" --work_dir="/tmp/Endpoint_SlaveEndpointTest_UnauthorizedRequest_2_wi4PZn"
I0824 07:35:22.928272 27605 credentials.hpp:86] Loading credential for authentication from
'/tmp/Endpoint_SlaveEndpointTest_UnauthorizedRequest_2_7N9OeC/credential'
I0824 07:35:22.928433 27605 slave.cpp:283] Agent using credential for: test-principal
I0824 07:35:22.928455 27605 credentials.hpp:37] Loading credentials for authentication from
'/tmp/Endpoint_SlaveEndpointTest_UnauthorizedRequest_2_7N9OeC/http_credentials'
I0824 07:35:22.928764 27605 http.cpp:1026] Creating default 'basic' HTTP authenticator for
realm 'mesos-agent-executor'
I0824 07:35:22.928879 27605 http.cpp:1047] Creating default 'jwt' HTTP authenticator for realm
'mesos-agent-executor'
I0824 07:35:22.929103 27605 http.cpp:1026] Creating default 'basic' HTTP authenticator for
realm 'mesos-agent-readonly'
I0824 07:35:22.929209 27605 http.cpp:1047] Creating default 'jwt' HTTP authenticator for realm
'mesos-agent-readonly'
I0824 07:35:22.929427 27605 http.cpp:1026] Creating default 'basic' HTTP authenticator for
realm 'mesos-agent-readwrite'
I0824 07:35:22.929543 27605 http.cpp:1047] Creating default 'jwt' HTTP authenticator for realm
'mesos-agent-readwrite'
I0824 07:35:22.931017 27605 slave.cpp:565] Agent resources: [{"name":"cpus","scalar":{"value":2.0},"type":"SCALAR"},{"name":"mem","scalar":{"value":1024.0},"type":"SCALAR"},{"name":"disk","scalar":{"value":1024.0},"type":"SCALAR"},{"name":"ports","ranges":{"range":[{"begin":31000,"end":32000}]},"type":"RANGES"}]
I0824 07:35:22.931231 27605 slave.cpp:573] Agent attributes: [  ]
I0824 07:35:22.931246 27605 slave.cpp:582] Agent hostname: bfacdca9d48b
I0824 07:35:22.931360 27602 status_update_manager.cpp:177] Pausing sending status updates
I0824 07:35:22.932708 27599 state.cpp:64] Recovering state from '/tmp/Endpoint_SlaveEndpointTest_UnauthorizedRequest_2_wi4PZn/meta'
I0824 07:35:22.932976 27599 status_update_manager.cpp:203] Recovering status update manager
I0824 07:35:22.933148 27606 containerizer.cpp:609] Recovering containerizer
I0824 07:35:22.934259 27601 provisioner.cpp:416] Provisioner recovery complete
I0824 07:35:22.934562 27610 slave.cpp:6242] Finished recovery
I0824 07:35:22.934993 27610 slave.cpp:6424] Querying resource estimator for oversubscribable
resources
I0824 07:35:22.935173 27600 slave.cpp:6438] Received oversubscribable resources {} from the
resource estimator
I0824 07:35:22.937044 27611 process.cpp:3933] Handling HTTP event for process 'slave(808)'
with path: '/slave(808)/containers'
I0824 07:35:22.938647 27618 http.cpp:1166] HTTP GET for /slave(808)/containers from 172.17.0.4:54558
I0824 07:35:22.938773 27618 http.cpp:957] Authorizing principal 'test-principal' to GET the
'/containers' endpoint
I0824 07:35:22.940623  6701 slave.cpp:843] Agent terminating
[       OK ] Endpoint/SlaveEndpointTest.UnauthorizedRequest/2 (27 ms)
[ RUN      ] Endpoint/SlaveEndpointTest.NoAuthorizer/0
I0824 07:35:22.951161  6701 containerizer.cpp:246] Using isolation: posix/cpu,posix/mem,filesystem/posix,network/cni,environment_secret
W0824 07:35:22.951614  6701 backend.cpp:76] Failed to create 'aufs' backend: AufsBackend requires
root privileges
W0824 07:35:22.951735  6701 backend.cpp:76] Failed to create 'bind' backend: BindBackend requires
root privileges
I0824 07:35:22.951776  6701 provisioner.cpp:255] Using default backend 'copy'
I0824 07:35:22.953528  6701 cluster.cpp:448] Creating default 'local' authorizer
I0824 07:35:22.955353 27599 slave.cpp:250] Mesos agent started on (809)@172.17.0.4:39236
I0824 07:35:22.955394 27599 slave.cpp:251] Flags at startup: --acls="" --appc_simple_discovery_uri_prefix="http://"
--appc_store_dir="/tmp/Endpoint_SlaveEndpointTest_NoAuthorizer_0_JTpJqx/store/appc" --authenticate_http_executors="true"
--authenticate_http_readonly="true" --authenticate_http_readwrite="true" --authenticatee="crammd5"
--authentication_backoff_factor="1secs" --authorizer="local" --cgroups_cpu_enable_pids_and_tids_count="false"
--cgroups_enable_cfs="false" --cgroups_hierarchy="/sys/fs/cgroup" --cgroups_limit_swap="false"
--cgroups_root="mesos" --container_disk_watch_interval="15secs" --containerizers="mesos" --credential="/tmp/Endpoint_SlaveEndpointTest_NoAuthorizer_0_JTpJqx/credential"
--default_role="*" --disallow_sharing_agent_pid_namespace="false" --disk_watch_interval="1mins"
--docker="docker" --docker_kill_orphans="true" --docker_registry="https://registry-1.docker.io"
--docker_remove_delay="6hrs" --docker_socket="/var/run/docker.sock" --docker_stop_timeout="0ns"
--docker_store_dir="/tmp/Endpoint_SlaveEndpointTest_NoAuthorizer_0_JTpJqx/store/docker" --docker_volume_checkpoint_dir="/var/run/mesos/isolators/docker/volume"
--enforce_container_disk_quota="false" --executor_registration_timeout="1mins" --executor_reregistration_timeout="2secs"
--executor_secret_key="/tmp/Endpoint_SlaveEndpointTest_NoAuthorizer_0_JTpJqx/executor_secret_key"
--executor_shutdown_grace_period="5secs" --fetcher_cache_dir="/tmp/Endpoint_SlaveEndpointTest_NoAuthorizer_0_JTpJqx/fetch"
--fetcher_cache_size="2GB" --frameworks_home="" --gc_delay="1weeks" --gc_disk_headroom="0.1"
--hadoop_home="" --help="false" --hostname_lookup="true" --http_command_executor="false" --http_credentials="/tmp/Endpoint_SlaveEndpointTest_NoAuthorizer_0_JTpJqx/http_credentials"
--http_heartbeat_interval="30secs" --initialize_driver_logging="true" --isolation="posix/cpu,posix/mem"
--launcher="posix" --launcher_dir="/mesos/mesos-1.4.0/_build/src" --logbufsecs="0" --logging_level="INFO"
--max_completed_executors_per_framework="150" --oversubscribed_resources_interval="15secs"
--perf_duration="10secs" --perf_interval="1mins" --port="5051" --qos_correction_interval_min="0ns"
--quiet="false" --recover="reconnect" --recovery_timeout="15mins" --registration_backoff_factor="10ms"
--resources="cpus:2;gpus:0;mem:1024;disk:1024;ports:[31000-32000]" --revocable_cpu_low_priority="true"
--runtime_dir="/tmp/Endpoint_SlaveEndpointTest_NoAuthorizer_0_JTpJqx" --sandbox_directory="/mnt/mesos/sandbox"
--strict="true" --switch_user="true" --systemd_enable_support="true" --systemd_runtime_directory="/run/systemd/system"
--version="false" --work_dir="/tmp/Endpoint_SlaveEndpointTest_NoAuthorizer_0_MmCG7i"
I0824 07:35:22.955961 27599 credentials.hpp:86] Loading credential for authentication from
'/tmp/Endpoint_SlaveEndpointTest_NoAuthorizer_0_JTpJqx/credential'
I0824 07:35:22.956100 27599 slave.cpp:283] Agent using credential for: test-principal
I0824 07:35:22.956121 27599 credentials.hpp:37] Loading credentials for authentication from
'/tmp/Endpoint_SlaveEndpointTest_NoAuthorizer_0_JTpJqx/http_credentials'
I0824 07:35:22.956377 27599 http.cpp:1026] Creating default 'basic' HTTP authenticator for
realm 'mesos-agent-executor'
I0824 07:35:22.956490 27599 http.cpp:1047] Creating default 'jwt' HTTP authenticator for realm
'mesos-agent-executor'
I0824 07:35:22.956701 27599 http.cpp:1026] Creating default 'basic' HTTP authenticator for
realm 'mesos-agent-readonly'
I0824 07:35:22.956801 27599 http.cpp:1047] Creating default 'jwt' HTTP authenticator for realm
'mesos-agent-readonly'
I0824 07:35:22.956979 27599 http.cpp:1026] Creating default 'basic' HTTP authenticator for
realm 'mesos-agent-readwrite'
I0824 07:35:22.957078 27599 http.cpp:1047] Creating default 'jwt' HTTP authenticator for realm
'mesos-agent-readwrite'
I0824 07:35:22.958372 27599 slave.cpp:565] Agent resources: [{"name":"cpus","scalar":{"value":2.0},"type":"SCALAR"},{"name":"mem","scalar":{"value":1024.0},"type":"SCALAR"},{"name":"disk","scalar":{"value":1024.0},"type":"SCALAR"},{"name":"ports","ranges":{"range":[{"begin":31000,"end":32000}]},"type":"RANGES"}]
I0824 07:35:22.958593 27599 slave.cpp:573] Agent attributes: [  ]
I0824 07:35:22.958608 27599 slave.cpp:582] Agent hostname: bfacdca9d48b
I0824 07:35:22.958721 27611 status_update_manager.cpp:177] Pausing sending status updates
I0824 07:35:22.960069 27618 state.cpp:64] Recovering state from '/tmp/Endpoint_SlaveEndpointTest_NoAuthorizer_0_MmCG7i/meta'
I0824 07:35:22.960327 27603 status_update_manager.cpp:203] Recovering status update manager
I0824 07:35:22.960500 27608 containerizer.cpp:609] Recovering containerizer
I0824 07:35:22.961802 27605 provisioner.cpp:416] Provisioner recovery complete
I0824 07:35:22.962121 27599 slave.cpp:6242] Finished recovery
I0824 07:35:22.962550 27599 slave.cpp:6424] Querying resource estimator for oversubscribable
resources
I0824 07:35:22.962749 27613 slave.cpp:6438] Received oversubscribable resources {} from the
resource estimator
I0824 07:35:22.964435 27602 process.cpp:3933] Handling HTTP event for process 'slave(809)'
with path: '/slave(809)/monitor/statistics'
I0824 07:35:22.966071 27616 http.cpp:1166] HTTP GET for /slave(809)/monitor/statistics from
172.17.0.4:54560
I0824 07:35:22.966142 27616 http.cpp:957] Authorizing principal 'test-principal' to GET the
'/monitor/statistics' endpoint
I0824 07:35:22.968626 27609 slave.cpp:843] Agent terminating
[       OK ] Endpoint/SlaveEndpointTest.NoAuthorizer/0 (27 ms)
[ RUN      ] Endpoint/SlaveEndpointTest.NoAuthorizer/1
I0824 07:35:22.979099  6701 containerizer.cpp:246] Using isolation: posix/cpu,posix/mem,filesystem/posix,network/cni,environment_secret
W0824 07:35:22.979564  6701 backend.cpp:76] Failed to create 'aufs' backend: AufsBackend requires
root privileges
W0824 07:35:22.979679  6701 backend.cpp:76] Failed to create 'bind' backend: BindBackend requires
root privileges
I0824 07:35:22.979720  6701 provisioner.cpp:255] Using default backend 'copy'
I0824 07:35:22.981464  6701 cluster.cpp:448] Creating default 'local' authorizer
I0824 07:35:22.983180 27618 slave.cpp:250] Mesos agent started on (810)@172.17.0.4:39236
I0824 07:35:22.983223 27618 slave.cpp:251] Flags at startup: --acls="" --appc_simple_discovery_uri_prefix="http://"
--appc_store_dir="/tmp/Endpoint_SlaveEndpointTest_NoAuthorizer_1_JojcTs/store/appc" --authenticate_http_executors="true"
--authenticate_http_readonly="true" --authenticate_http_readwrite="true" --authenticatee="crammd5"
--authentication_backoff_factor="1secs" --authorizer="local" --cgroups_cpu_enable_pids_and_tids_count="false"
--cgroups_enable_cfs="false" --cgroups_hierarchy="/sys/fs/cgroup" --cgroups_limit_swap="false"
--cgroups_root="mesos" --container_disk_watch_interval="15secs" --containerizers="mesos" --credential="/tmp/Endpoint_SlaveEndpointTest_NoAuthorizer_1_JojcTs/credential"
--default_role="*" --disallow_sharing_agent_pid_namespace="false" --disk_watch_interval="1mins"
--docker="docker" --docker_kill_orphans="true" --docker_registry="https://registry-1.docker.io"
--docker_remove_delay="6hrs" --docker_socket="/var/run/docker.sock" --docker_stop_timeout="0ns"
--docker_store_dir="/tmp/Endpoint_SlaveEndpointTest_NoAuthorizer_1_JojcTs/store/docker" --docker_volume_checkpoint_dir="/var/run/mesos/isolators/docker/volume"
--enforce_container_disk_quota="false" --executor_registration_timeout="1mins" --executor_reregistration_timeout="2secs"
--executor_secret_key="/tmp/Endpoint_SlaveEndpointTest_NoAuthorizer_1_JojcTs/executor_secret_key"
--executor_shutdown_grace_period="5secs" --fetcher_cache_dir="/tmp/Endpoint_SlaveEndpointTest_NoAuthorizer_1_JojcTs/fetch"
--fetcher_cache_size="2GB" --frameworks_home="" --gc_delay="1weeks" --gc_disk_headroom="0.1"
--hadoop_home="" --help="false" --hostname_lookup="true" --http_command_executor="false" --http_credentials="/tmp/Endpoint_SlaveEndpointTest_NoAuthorizer_1_JojcTs/http_credentials"
--http_heartbeat_interval="30secs" --initialize_driver_logging="true" --isolation="posix/cpu,posix/mem"
--launcher="posix" --launcher_dir="/mesos/mesos-1.4.0/_build/src" --logbufsecs="0" --logging_level="INFO"
--max_completed_executors_per_framework="150" --oversubscribed_resources_interval="15secs"
--perf_duration="10secs" --perf_interval="1mins" --port="5051" --qos_correction_interval_min="0ns"
--quiet="false" --recover="reconnect" --recovery_timeout="15mins" --registration_backoff_factor="10ms"
--resources="cpus:2;gpus:0;mem:1024;disk:1024;ports:[31000-32000]" --revocable_cpu_low_priority="true"
--runtime_dir="/tmp/Endpoint_SlaveEndpointTest_NoAuthorizer_1_JojcTs" --sandbox_directory="/mnt/mesos/sandbox"
--strict="true" --switch_user="true" --systemd_enable_support="true" --systemd_runtime_directory="/run/systemd/system"
--version="false" --work_dir="/tmp/Endpoint_SlaveEndpointTest_NoAuthorizer_1_2UMZve"
I0824 07:35:22.983837 27618 credentials.hpp:86] Loading credential for authentication from
'/tmp/Endpoint_SlaveEndpointTest_NoAuthorizer_1_JojcTs/credential'
I0824 07:35:22.984037 27618 slave.cpp:283] Agent using credential for: test-principal
I0824 07:35:22.984067 27618 credentials.hpp:37] Loading credentials for authentication from
'/tmp/Endpoint_SlaveEndpointTest_NoAuthorizer_1_JojcTs/http_credentials'
I0824 07:35:22.984419 27618 http.cpp:1026] Creating default 'basic' HTTP authenticator for
realm 'mesos-agent-executor'
I0824 07:35:22.984536 27618 http.cpp:1047] Creating default 'jwt' HTTP authenticator for realm
'mesos-agent-executor'
I0824 07:35:22.984750 27618 http.cpp:1026] Creating default 'basic' HTTP authenticator for
realm 'mesos-agent-readonly'
I0824 07:35:22.984851 27618 http.cpp:1047] Creating default 'jwt' HTTP authenticator for realm
'mesos-agent-readonly'
I0824 07:35:22.985028 27618 http.cpp:1026] Creating default 'basic' HTTP authenticator for
realm 'mesos-agent-readwrite'
I0824 07:35:22.985122 27618 http.cpp:1047] Creating default 'jwt' HTTP authenticator for realm
'mesos-agent-readwrite'
I0824 07:35:22.987239 27618 slave.cpp:565] Agent resources: [{"name":"cpus","scalar":{"value":2.0},"type":"SCALAR"},{"name":"mem","scalar":{"value":1024.0},"type":"SCALAR"},{"name":"disk","scalar":{"value":1024.0},"type":"SCALAR"},{"name":"ports","ranges":{"range":[{"begin":31000,"end":32000}]},"type":"RANGES"}]
I0824 07:35:22.987460 27618 slave.cpp:573] Agent attributes: [  ]
I0824 07:35:22.987476 27618 slave.cpp:582] Agent hostname: bfacdca9d48b
I0824 07:35:22.987602 27614 status_update_manager.cpp:177] Pausing sending status updates
I0824 07:35:22.989693 27599 state.cpp:64] Recovering state from '/tmp/Endpoint_SlaveEndpointTest_NoAuthorizer_1_2UMZve/meta'
I0824 07:35:22.989925 27611 status_update_manager.cpp:203] Recovering status update manager
I0824 07:35:22.990137 27596 containerizer.cpp:609] Recovering containerizer
I0824 07:35:22.991364 27609 provisioner.cpp:416] Provisioner recovery complete
I0824 07:35:22.991653 27618 slave.cpp:6242] Finished recovery
I0824 07:35:22.992049 27618 slave.cpp:6424] Querying resource estimator for oversubscribable
resources
I0824 07:35:22.992250 27612 slave.cpp:6438] Received oversubscribable resources {} from the
resource estimator
I0824 07:35:22.994009 27603 process.cpp:3933] Handling HTTP event for process 'slave(810)'
with path: '/slave(810)/monitor/statistics.json'
I0824 07:35:22.995538 27615 http.cpp:1166] HTTP GET for /slave(810)/monitor/statistics.json
from 172.17.0.4:54562
I0824 07:35:22.995674 27615 http.cpp:957] Authorizing principal 'test-principal' to GET the
'/monitor/statistics.json' endpoint
I0824 07:35:22.998320  6701 slave.cpp:843] Agent terminating
[       OK ] Endpoint/SlaveEndpointTest.NoAuthorizer/1 (29 ms)
[ RUN      ] Endpoint/SlaveEndpointTest.NoAuthorizer/2
I0824 07:35:23.008759  6701 containerizer.cpp:246] Using isolation: posix/cpu,posix/mem,filesystem/posix,network/cni,environment_secret
W0824 07:35:23.009202  6701 backend.cpp:76] Failed to create 'aufs' backend: AufsBackend requires
root privileges
W0824 07:35:23.009310  6701 backend.cpp:76] Failed to create 'bind' backend: BindBackend requires
root privileges
I0824 07:35:23.009342  6701 provisioner.cpp:255] Using default backend 'copy'
I0824 07:35:23.011052  6701 cluster.cpp:448] Creating default 'local' authorizer
I0824 07:35:23.012841 27604 slave.cpp:250] Mesos agent started on (811)@172.17.0.4:39236
I0824 07:35:23.012879 27604 slave.cpp:251] Flags at startup: --acls="" --appc_simple_discovery_uri_prefix="http://"
--appc_store_dir="/tmp/Endpoint_SlaveEndpointTest_NoAuthorizer_2_fyBhDo/store/appc" --authenticate_http_executors="true"
--authenticate_http_readonly="true" --authenticate_http_readwrite="true" --authenticatee="crammd5"
--authentication_backoff_factor="1secs" --authorizer="local" --cgroups_cpu_enable_pids_and_tids_count="false"
--cgroups_enable_cfs="false" --cgroups_hierarchy="/sys/fs/cgroup" --cgroups_limit_swap="false"
--cgroups_root="mesos" --container_disk_watch_interval="15secs" --containerizers="mesos" --credential="/tmp/Endpoint_SlaveEndpointTest_NoAuthorizer_2_fyBhDo/credential"
--default_role="*" --disallow_sharing_agent_pid_namespace="false" --disk_watch_interval="1mins"
--docker="docker" --docker_kill_orphans="true" --docker_registry="https://registry-1.docker.io"
--docker_remove_delay="6hrs" --docker_socket="/var/run/docker.sock" --docker_stop_timeout="0ns"
--docker_store_dir="/tmp/Endpoint_SlaveEndpointTest_NoAuthorizer_2_fyBhDo/store/docker" --docker_volume_checkpoint_dir="/var/run/mesos/isolators/docker/volume"
--enforce_container_disk_quota="false" --executor_registration_timeout="1mins" --executor_reregistration_timeout="2secs"
--executor_secret_key="/tmp/Endpoint_SlaveEndpointTest_NoAuthorizer_2_fyBhDo/executor_secret_key"
--executor_shutdown_grace_period="5secs" --fetcher_cache_dir="/tmp/Endpoint_SlaveEndpointTest_NoAuthorizer_2_fyBhDo/fetch"
--fetcher_cache_size="2GB" --frameworks_home="" --gc_delay="1weeks" --gc_disk_headroom="0.1"
--hadoop_home="" --help="false" --hostname_lookup="true" --http_command_executor="false" --http_credentials="/tmp/Endpoint_SlaveEndpointTest_NoAuthorizer_2_fyBhDo/http_credentials"
--http_heartbeat_interval="30secs" --initialize_driver_logging="true" --isolation="posix/cpu,posix/mem"
--launcher="posix" --launcher_dir="/mesos/mesos-1.4.0/_build/src" --logbufsecs="0" --logging_level="INFO"
--max_completed_executors_per_framework="150" --oversubscribed_resources_interval="15secs"
--perf_duration="10secs" --perf_interval="1mins" --port="5051" --qos_correction_interval_min="0ns"
--quiet="false" --recover="reconnect" --recovery_timeout="15mins" --registration_backoff_factor="10ms"
--resources="cpus:2;gpus:0;mem:1024;disk:1024;ports:[31000-32000]" --revocable_cpu_low_priority="true"
--runtime_dir="/tmp/Endpoint_SlaveEndpointTest_NoAuthorizer_2_fyBhDo" --sandbox_directory="/mnt/mesos/sandbox"
--strict="true" --switch_user="true" --systemd_enable_support="true" --systemd_runtime_directory="/run/systemd/system"
--version="false" --work_dir="/tmp/Endpoint_SlaveEndpointTest_NoAuthorizer_2_yVVFba"
I0824 07:35:23.013285 27604 credentials.hpp:86] Loading credential for authentication from
'/tmp/Endpoint_SlaveEndpointTest_NoAuthorizer_2_fyBhDo/credential'
I0824 07:35:23.013445 27604 slave.cpp:283] Agent using credential for: test-principal
I0824 07:35:23.013473 27604 credentials.hpp:37] Loading credentials for authentication from
'/tmp/Endpoint_SlaveEndpointTest_NoAuthorizer_2_fyBhDo/http_credentials'
I0824 07:35:23.013813 27604 http.cpp:1026] Creating default 'basic' HTTP authenticator for
realm 'mesos-agent-executor'
I0824 07:35:23.013934 27604 http.cpp:1047] Creating default 'jwt' HTTP authenticator for realm
'mesos-agent-executor'
I0824 07:35:23.014159 27604 http.cpp:1026] Creating default 'basic' HTTP authenticator for
realm 'mesos-agent-readonly'
I0824 07:35:23.014264 27604 http.cpp:1047] Creating default 'jwt' HTTP authenticator for realm
'mesos-agent-readonly'
I0824 07:35:23.014475 27604 http.cpp:1026] Creating default 'basic' HTTP authenticator for
realm 'mesos-agent-readwrite'
I0824 07:35:23.014590 27604 http.cpp:1047] Creating default 'jwt' HTTP authenticator for realm
'mesos-agent-readwrite'
I0824 07:35:23.015913 27604 slave.cpp:565] Agent resources: [{"name":"cpus","scalar":{"value":2.0},"type":"SCALAR"},{"name":"mem","scalar":{"value":1024.0},"type":"SCALAR"},{"name":"disk","scalar":{"value":1024.0},"type":"SCALAR"},{"name":"ports","ranges":{"range":[{"begin":31000,"end":32000}]},"type":"RANGES"}]
I0824 07:35:23.016135 27604 slave.cpp:573] Agent attributes: [  ]
I0824 07:35:23.016150 27604 slave.cpp:582] Agent hostname: bfacdca9d48b
I0824 07:35:23.016268 27610 status_update_manager.cpp:177] Pausing sending status updates
I0824 07:35:23.017658 27614 state.cpp:64] Recovering state from '/tmp/Endpoint_SlaveEndpointTest_NoAuthorizer_2_yVVFba/meta'
I0824 07:35:23.017936 27618 status_update_manager.cpp:203] Recovering status update manager
I0824 07:35:23.018120 27607 containerizer.cpp:609] Recovering containerizer
I0824 07:35:23.019284 27599 provisioner.cpp:416] Provisioner recovery complete
I0824 07:35:23.019593 27617 slave.cpp:6242] Finished recovery
I0824 07:35:23.019989 27617 slave.cpp:6424] Querying resource estimator for oversubscribable
resources
I0824 07:35:23.020200 27606 slave.cpp:6438] Received oversubscribable resources {} from the
resource estimator
I0824 07:35:23.022110 27610 process.cpp:3933] Handling HTTP event for process 'slave(811)'
with path: '/slave(811)/containers'
I0824 07:35:23.023612 27612 http.cpp:1166] HTTP GET for /slave(811)/containers from 172.17.0.4:54564
I0824 07:35:23.023679 27612 http.cpp:957] Authorizing principal 'test-principal' to GET the
'/containers' endpoint
I0824 07:35:23.026288 27605 slave.cpp:843] Agent terminating
[       OK ] Endpoint/SlaveEndpointTest.NoAuthorizer/2 (28 ms)
[----------] 9 tests from Endpoint/SlaveEndpointTest (256 ms total)

[----------] 2 tests from ContainerizerType/DefaultContainerDNSFlagTest
[ RUN      ] ContainerizerType/DefaultContainerDNSFlagTest.ValidateFlag/0
[       OK ] ContainerizerType/DefaultContainerDNSFlagTest.ValidateFlag/0 (9 ms)
[ RUN      ] ContainerizerType/DefaultContainerDNSFlagTest.ValidateFlag/1
[       OK ] ContainerizerType/DefaultContainerDNSFlagTest.ValidateFlag/1 (9 ms)
[----------] 2 tests from ContainerizerType/DefaultContainerDNSFlagTest (19 ms total)

[----------] Global test environment tear-down
[==========] 1663 tests from 184 test cases ran. (496056 ms total)
[  PASSED  ] 1662 tests.
[  FAILED  ] 1 test, listed below:
[  FAILED  ] ExamplesTest.DynamicReservationFramework

 1 FAILED TEST
  YOU HAVE 20 DISABLED TESTS

I0824 07:35:23.110455 27620 process.cpp:1072] Failed to accept socket: future discarded
make[4]: *** [check-local] Error 1
make[4]: Leaving directory `/mesos/mesos-1.4.0/_build/src'
make[3]: *** [check-am] Error 2
make[3]: Leaving directory `/mesos/mesos-1.4.0/_build/src'
make[2]: *** [check] Error 2
make[2]: Leaving directory `/mesos/mesos-1.4.0/_build/src'
make[1]: *** [check-recursive] Error 1
make[1]: Leaving directory `/mesos/mesos-1.4.0/_build'
make: *** [distcheck] Error 1
+ docker rmi mesos-1503557267-18086
Untagged: mesos-1503557267-18086:latest
Deleted: sha256:09421a18465d5284e12f581d7db47f82807f768410aa1371f43f8574a0f07709
Deleted: sha256:1cbea924fdb5789299b69b20ec082c0c3c591d076ed220c6085e7518062ba1d0
Deleted: sha256:a554052da25a5202aae9db06be719f526b1be31d3767096329d9cea9d28ce2a5
Deleted: sha256:095b7d71874305d42298c2c9f77cfe8f4f654bdee4b75a80ad582d75707c80fd
Deleted: sha256:d7e0d7a32a33dfe369525e14dbeb2be9567465b270992efb10618aa462330aec
Deleted: sha256:f02356d8c224f55d161338545768d896c7035932c56b18ae78aa3394453a5d4a
Deleted: sha256:aff7c6a262d924715d7ec0d9d7801fad5bcc1d6cb5e8522b621d651f27866d45
Deleted: sha256:3987cb83d69c342175c79972b16e9d55245315d9129b27b148d59ce043f63366
Deleted: sha256:e0faa49bb47b6e4a51201455f16421807b28dfde5fb217a09bd4c06eaed863b5
Deleted: sha256:b6eb8afc9b8c9c83939f4c63e133f6ec0cc5bab73edda383fe74ca54b9b93464
Deleted: sha256:c21cf46f31fb6c2b48504c2257a5f728cd468351390f6c740fc1a5476d79bcf8
Deleted: sha256:ec013175e8d14b03bacfa583c5663685b3e2ef0dd3f8572e1979a514f318ee02
Deleted: sha256:b30f5119fbaf3a47aac4e4b4da2b4ab370dd47a0bbb62bc79b8d6f46c544f343
Deleted: sha256:2d35de9af5e1019ed33c35baf772d35ed3a6e69292caafb268959e7e20e91f83
Deleted: sha256:632e6b33274032e03fa1ef5944c385b41c55e278dde86302ef1864f87c200bad
Deleted: sha256:a5f4dfab38f999d65a7f5b16c00dee70a5a01d5d704aa8be7d38eb667d14d211
Deleted: sha256:22901b0639807f5f5a7fae9cdcec0d54c5097f82530297178e3123b3b1ef7344
Deleted: sha256:9cc2069f478f4ad618d4f7eb72ca219809099b0a4e77d448ef0e4aa12a76737a
Deleted: sha256:0f2b09265ccc545711756336da0135fd04a99806e3d8f404ad94a7c6877eddf8
Deleted: sha256:e0854c0abe3b0a477ac979e1ddbf2733ea02af2a2c53532ace45d8c6d4183542
Deleted: sha256:2efe48f1ab3e456c04da4b773672d7e708c3d94b83d2cff851287fb8d2fabdfc
Deleted: sha256:9f51f15d59c711fe65d4815f107193dcaee86da08941c82480dc40898133c341
Deleted: sha256:95633f77143a2b427f9e7995b3610dee36ad99199138a5f9278c07d251cdcc56
Deleted: sha256:6f460bd0466b8f9e71e3000441bd147cc59f4334bfc9dff13598754b68ccc592
Build step 'Execute shell' marked build as failure
Not sending mail to unregistered user yujie.jay@gmail.com

Mime
View raw message