mesos-builds mailing list archives

Site index · List index
Message view « Date » · « Thread »
Top « Date » · « Thread »
From Apache Jenkins Server <jenk...@builds.apache.org>
Subject Build failed in Jenkins: Mesos-Buildbot » autotools,gcc,--verbose,GLOG_v=1 MESOS_VERBOSE=1,ubuntu:14.04,(ubuntu)&&(!ubuntu-us1)&&(!ubuntu-eu2) #4130
Date Sat, 19 Aug 2017 06:20:10 GMT
See <https://builds.apache.org/job/Mesos-Buildbot/BUILDTOOL=autotools,COMPILER=gcc,CONFIGURATION=--verbose,ENVIRONMENT=GLOG_v=1%20MESOS_VERBOSE=1,OS=ubuntu%3A14.04,label_exp=(ubuntu)&&(!ubuntu-us1)&&(!ubuntu-eu2)/4130/display/redirect?page=changes>

Changes:

[yujie.jay] Added a URL parameter to the resource provider driver.

[yujie.jay] Added a stream ID to resource provider manager connections.

[yujie.jay] Implemented HTTP connection handling for the resource provider driver.

[yujie.jay] Added a MockResourceProvider.

[yujie.jay] Added 'devolve' overload for 'ResourceProviderID'.

[yujie.jay] Added a resource providers total resources to the subscribe call.

[yujie.jay] Stored subscribed resources in resource provider manager.

[yujie.jay] Moved and renamed resource provider manager-related tests.

[yujie.jay] Fixed some style issues.

[gregorywmann] Added a heartbeat event to the operator API.

------------------------------------------
[...truncated 31.06 MB...]
I0819 06:18:25.830497  5337 http.cpp:1026] Creating default 'basic' HTTP authenticator for
realm 'mesos-agent-readwrite'
I0819 06:18:25.832757  5337 slave.cpp:581] Agent resources: [{"name":"cpus","scalar":{"value":2.0},"type":"SCALAR"},{"name":"mem","scalar":{"value":1024.0},"type":"SCALAR"},{"name":"disk","scalar":{"value":1024.0},"type":"SCALAR"},{"name":"ports","ranges":{"range":[{"begin":31000,"end":32000}]},"type":"RANGES"}]
I0819 06:18:25.833252  5337 slave.cpp:589] Agent attributes: [  ]
I0819 06:18:25.833276  5337 slave.cpp:598] Agent hostname: fa239d6ea28b
I0819 06:18:25.833657  5336 status_update_manager.cpp:177] Pausing sending status updates
I0819 06:18:25.835675  5338 state.cpp:64] Recovering state from '/tmp/Endpoint_SlaveEndpointTest_AuthorizedRequest_2_ElZmZA/meta'
I0819 06:18:25.836222  5342 status_update_manager.cpp:203] Recovering status update manager
I0819 06:18:25.836624  5339 containerizer.cpp:609] Recovering containerizer
I0819 06:18:25.838763  5340 provisioner.cpp:416] Provisioner recovery complete
I0819 06:18:25.839203  5337 slave.cpp:6226] Finished recovery
I0819 06:18:25.839830  5337 slave.cpp:6408] Querying resource estimator for oversubscribable
resources
I0819 06:18:25.840193  5341 slave.cpp:6422] Received oversubscribable resources {} from the
resource estimator
I0819 06:18:25.844259  5342 process.cpp:3933] Handling HTTP event for process 'slave(799)'
with path: '/slave(799)/containers'
I0819 06:18:25.846067  5341 http.cpp:1166] HTTP GET for /slave(799)/containers from 172.17.0.4:48614
I0819 06:18:25.846180  5341 http.cpp:957] Authorizing principal 'test-principal' to GET the
'/containers' endpoint
I0819 06:18:25.851444  5342 slave.cpp:859] Agent terminating
[       OK ] Endpoint/SlaveEndpointTest.AuthorizedRequest/2 (45 ms)
[ RUN      ] Endpoint/SlaveEndpointTest.UnauthorizedRequest/0
I0819 06:18:25.868552  5317 containerizer.cpp:246] Using isolation: posix/cpu,posix/mem,filesystem/posix,network/cni,environment_secret
W0819 06:18:25.869303  5317 backend.cpp:76] Failed to create 'overlay' backend: OverlayBackend
requires root privileges
W0819 06:18:25.869498  5317 backend.cpp:76] Failed to create 'bind' backend: BindBackend requires
root privileges
I0819 06:18:25.869539  5317 provisioner.cpp:255] Using default backend 'copy'
I0819 06:18:25.875340  5337 slave.cpp:252] Mesos agent started on (800)@172.17.0.4:32775
I0819 06:18:25.875382  5337 slave.cpp:253] Flags at startup: --acls="" --appc_simple_discovery_uri_prefix="http://"
--appc_store_dir="/tmp/Endpoint_SlaveEndpointTest_UnauthorizedRequest_0_vqiG4U/store/appc"
--authenticate_http_readonly="true" --authenticate_http_readwrite="true" --authenticatee="crammd5"
--authentication_backoff_factor="1secs" --authorizer="local" --cgroups_cpu_enable_pids_and_tids_count="false"
--cgroups_enable_cfs="false" --cgroups_hierarchy="/sys/fs/cgroup" --cgroups_limit_swap="false"
--cgroups_root="mesos" --container_disk_watch_interval="15secs" --containerizers="mesos" --credential="/tmp/Endpoint_SlaveEndpointTest_UnauthorizedRequest_0_vqiG4U/credential"
--default_role="*" --disallow_sharing_agent_pid_namespace="false" --disk_watch_interval="1mins"
--docker="docker" --docker_kill_orphans="true" --docker_registry="https://registry-1.docker.io"
--docker_remove_delay="6hrs" --docker_socket="/var/run/docker.sock" --docker_stop_timeout="0ns"
--docker_store_dir="/tmp/Endpoint_SlaveEndpointTest_UnauthorizedRequest_0_vqiG4U/store/docker"
--docker_volume_checkpoint_dir="/var/run/mesos/isolators/docker/volume" --enforce_container_disk_quota="false"
--executor_registration_timeout="1mins" --executor_reregistration_timeout="2secs" --executor_shutdown_grace_period="5secs"
--fetcher_cache_dir="/tmp/Endpoint_SlaveEndpointTest_UnauthorizedRequest_0_vqiG4U/fetch" --fetcher_cache_size="2GB"
--frameworks_home="" --gc_delay="1weeks" --gc_disk_headroom="0.1" --hadoop_home="" --help="false"
--hostname_lookup="true" --http_command_executor="false" --http_credentials="/tmp/Endpoint_SlaveEndpointTest_UnauthorizedRequest_0_vqiG4U/http_credentials"
--http_heartbeat_interval="30secs" --initialize_driver_logging="true" --isolation="posix/cpu,posix/mem"
--launcher="posix" --launcher_dir="/mesos/mesos-1.5.0/_build/src" --logbufsecs="0" --logging_level="INFO"
--max_completed_executors_per_framework="150" --oversubscribed_resources_interval="15secs"
--perf_duration="10secs" --perf_interval="1mins" --port="5051" --qos_correction_interval_min="0ns"
--quiet="false" --recover="reconnect" --recovery_timeout="15mins" --registration_backoff_factor="10ms"
--resources="cpus:2;gpus:0;mem:1024;disk:1024;ports:[31000-32000]" --revocable_cpu_low_priority="true"
--runtime_dir="/tmp/Endpoint_SlaveEndpointTest_UnauthorizedRequest_0_vqiG4U" --sandbox_directory="/mnt/mesos/sandbox"
--strict="true" --switch_user="true" --systemd_enable_support="true" --systemd_runtime_directory="/run/systemd/system"
--version="false" --work_dir="/tmp/Endpoint_SlaveEndpointTest_UnauthorizedRequest_0_qW01p3"
I0819 06:18:25.876101  5337 credentials.hpp:86] Loading credential for authentication from
'/tmp/Endpoint_SlaveEndpointTest_UnauthorizedRequest_0_vqiG4U/credential'
I0819 06:18:25.876350  5337 slave.cpp:285] Agent using credential for: test-principal
I0819 06:18:25.876374  5337 credentials.hpp:37] Loading credentials for authentication from
'/tmp/Endpoint_SlaveEndpointTest_UnauthorizedRequest_0_vqiG4U/http_credentials'
I0819 06:18:25.876721  5337 http.cpp:1026] Creating default 'basic' HTTP authenticator for
realm 'mesos-agent-readonly'
I0819 06:18:25.876987  5337 http.cpp:1026] Creating default 'basic' HTTP authenticator for
realm 'mesos-agent-readwrite'
I0819 06:18:25.879246  5337 slave.cpp:581] Agent resources: [{"name":"cpus","scalar":{"value":2.0},"type":"SCALAR"},{"name":"mem","scalar":{"value":1024.0},"type":"SCALAR"},{"name":"disk","scalar":{"value":1024.0},"type":"SCALAR"},{"name":"ports","ranges":{"range":[{"begin":31000,"end":32000}]},"type":"RANGES"}]
I0819 06:18:25.879678  5337 slave.cpp:589] Agent attributes: [  ]
I0819 06:18:25.879699  5337 slave.cpp:598] Agent hostname: fa239d6ea28b
I0819 06:18:25.879910  5339 status_update_manager.cpp:177] Pausing sending status updates
I0819 06:18:25.882072  5342 state.cpp:64] Recovering state from '/tmp/Endpoint_SlaveEndpointTest_UnauthorizedRequest_0_qW01p3/meta'
I0819 06:18:25.882493  5339 status_update_manager.cpp:203] Recovering status update manager
I0819 06:18:25.882771  5341 containerizer.cpp:609] Recovering containerizer
I0819 06:18:25.884985  5343 provisioner.cpp:416] Provisioner recovery complete
I0819 06:18:25.885529  5340 slave.cpp:6226] Finished recovery
I0819 06:18:25.886222  5340 slave.cpp:6408] Querying resource estimator for oversubscribable
resources
I0819 06:18:25.886636  5339 slave.cpp:6422] Received oversubscribable resources {} from the
resource estimator
I0819 06:18:25.890894  5338 process.cpp:3933] Handling HTTP event for process 'slave(800)'
with path: '/slave(800)/monitor/statistics'
I0819 06:18:25.892791  5339 http.cpp:1166] HTTP GET for /slave(800)/monitor/statistics from
172.17.0.4:48616
I0819 06:18:25.892912  5339 http.cpp:957] Authorizing principal 'test-principal' to GET the
'/monitor/statistics' endpoint
I0819 06:18:25.896628  5336 slave.cpp:859] Agent terminating
[       OK ] Endpoint/SlaveEndpointTest.UnauthorizedRequest/0 (45 ms)
[ RUN      ] Endpoint/SlaveEndpointTest.UnauthorizedRequest/1
I0819 06:18:25.914002  5317 containerizer.cpp:246] Using isolation: posix/cpu,posix/mem,filesystem/posix,network/cni,environment_secret
W0819 06:18:25.914749  5317 backend.cpp:76] Failed to create 'overlay' backend: OverlayBackend
requires root privileges
W0819 06:18:25.914947  5317 backend.cpp:76] Failed to create 'bind' backend: BindBackend requires
root privileges
I0819 06:18:25.914988  5317 provisioner.cpp:255] Using default backend 'copy'
I0819 06:18:25.920486  5341 slave.cpp:252] Mesos agent started on (801)@172.17.0.4:32775
I0819 06:18:25.920524  5341 slave.cpp:253] Flags at startup: --acls="" --appc_simple_discovery_uri_prefix="http://"
--appc_store_dir="/tmp/Endpoint_SlaveEndpointTest_UnauthorizedRequest_1_BxHi6n/store/appc"
--authenticate_http_readonly="true" --authenticate_http_readwrite="true" --authenticatee="crammd5"
--authentication_backoff_factor="1secs" --authorizer="local" --cgroups_cpu_enable_pids_and_tids_count="false"
--cgroups_enable_cfs="false" --cgroups_hierarchy="/sys/fs/cgroup" --cgroups_limit_swap="false"
--cgroups_root="mesos" --container_disk_watch_interval="15secs" --containerizers="mesos" --credential="/tmp/Endpoint_SlaveEndpointTest_UnauthorizedRequest_1_BxHi6n/credential"
--default_role="*" --disallow_sharing_agent_pid_namespace="false" --disk_watch_interval="1mins"
--docker="docker" --docker_kill_orphans="true" --docker_registry="https://registry-1.docker.io"
--docker_remove_delay="6hrs" --docker_socket="/var/run/docker.sock" --docker_stop_timeout="0ns"
--docker_store_dir="/tmp/Endpoint_SlaveEndpointTest_UnauthorizedRequest_1_BxHi6n/store/docker"
--docker_volume_checkpoint_dir="/var/run/mesos/isolators/docker/volume" --enforce_container_disk_quota="false"
--executor_registration_timeout="1mins" --executor_reregistration_timeout="2secs" --executor_shutdown_grace_period="5secs"
--fetcher_cache_dir="/tmp/Endpoint_SlaveEndpointTest_UnauthorizedRequest_1_BxHi6n/fetch" --fetcher_cache_size="2GB"
--frameworks_home="" --gc_delay="1weeks" --gc_disk_headroom="0.1" --hadoop_home="" --help="false"
--hostname_lookup="true" --http_command_executor="false" --http_credentials="/tmp/Endpoint_SlaveEndpointTest_UnauthorizedRequest_1_BxHi6n/http_credentials"
--http_heartbeat_interval="30secs" --initialize_driver_logging="true" --isolation="posix/cpu,posix/mem"
--launcher="posix" --launcher_dir="/mesos/mesos-1.5.0/_build/src" --logbufsecs="0" --logging_level="INFO"
--max_completed_executors_per_framework="150" --oversubscribed_resources_interval="15secs"
--perf_duration="10secs" --perf_interval="1mins" --port="5051" --qos_correction_interval_min="0ns"
--quiet="false" --recover="reconnect" --recovery_timeout="15mins" --registration_backoff_factor="10ms"
--resources="cpus:2;gpus:0;mem:1024;disk:1024;ports:[31000-32000]" --revocable_cpu_low_priority="true"
--runtime_dir="/tmp/Endpoint_SlaveEndpointTest_UnauthorizedRequest_1_BxHi6n" --sandbox_directory="/mnt/mesos/sandbox"
--strict="true" --switch_user="true" --systemd_enable_support="true" --systemd_runtime_directory="/run/systemd/system"
--version="false" --work_dir="/tmp/Endpoint_SlaveEndpointTest_UnauthorizedRequest_1_Alalkw"
I0819 06:18:25.921248  5341 credentials.hpp:86] Loading credential for authentication from
'/tmp/Endpoint_SlaveEndpointTest_UnauthorizedRequest_1_BxHi6n/credential'
I0819 06:18:25.921507  5341 slave.cpp:285] Agent using credential for: test-principal
I0819 06:18:25.921532  5341 credentials.hpp:37] Loading credentials for authentication from
'/tmp/Endpoint_SlaveEndpointTest_UnauthorizedRequest_1_BxHi6n/http_credentials'
I0819 06:18:25.921890  5341 http.cpp:1026] Creating default 'basic' HTTP authenticator for
realm 'mesos-agent-readonly'
I0819 06:18:25.922163  5341 http.cpp:1026] Creating default 'basic' HTTP authenticator for
realm 'mesos-agent-readwrite'
I0819 06:18:25.924377  5341 slave.cpp:581] Agent resources: [{"name":"cpus","scalar":{"value":2.0},"type":"SCALAR"},{"name":"mem","scalar":{"value":1024.0},"type":"SCALAR"},{"name":"disk","scalar":{"value":1024.0},"type":"SCALAR"},{"name":"ports","ranges":{"range":[{"begin":31000,"end":32000}]},"type":"RANGES"}]
I0819 06:18:25.924809  5341 slave.cpp:589] Agent attributes: [  ]
I0819 06:18:25.924832  5341 slave.cpp:598] Agent hostname: fa239d6ea28b
I0819 06:18:25.925082  5338 status_update_manager.cpp:177] Pausing sending status updates
I0819 06:18:25.926983  5342 state.cpp:64] Recovering state from '/tmp/Endpoint_SlaveEndpointTest_UnauthorizedRequest_1_Alalkw/meta'
I0819 06:18:25.927425  5338 status_update_manager.cpp:203] Recovering status update manager
I0819 06:18:25.927768  5337 containerizer.cpp:609] Recovering containerizer
I0819 06:18:25.929839  5336 provisioner.cpp:416] Provisioner recovery complete
I0819 06:18:25.930382  5339 slave.cpp:6226] Finished recovery
I0819 06:18:25.931000  5339 slave.cpp:6408] Querying resource estimator for oversubscribable
resources
I0819 06:18:25.931417  5342 slave.cpp:6422] Received oversubscribable resources {} from the
resource estimator
I0819 06:18:25.935663  5340 process.cpp:3933] Handling HTTP event for process 'slave(801)'
with path: '/slave(801)/monitor/statistics.json'
I0819 06:18:25.937600  5337 http.cpp:1166] HTTP GET for /slave(801)/monitor/statistics.json
from 172.17.0.4:48620
I0819 06:18:25.937721  5337 http.cpp:957] Authorizing principal 'test-principal' to GET the
'/monitor/statistics.json' endpoint
I0819 06:18:25.944778  5317 slave.cpp:859] Agent terminating
[       OK ] Endpoint/SlaveEndpointTest.UnauthorizedRequest/1 (48 ms)
[ RUN      ] Endpoint/SlaveEndpointTest.UnauthorizedRequest/2
I0819 06:18:25.961783  5317 containerizer.cpp:246] Using isolation: posix/cpu,posix/mem,filesystem/posix,network/cni,environment_secret
W0819 06:18:25.962529  5317 backend.cpp:76] Failed to create 'overlay' backend: OverlayBackend
requires root privileges
W0819 06:18:25.962719  5317 backend.cpp:76] Failed to create 'bind' backend: BindBackend requires
root privileges
I0819 06:18:25.962760  5317 provisioner.cpp:255] Using default backend 'copy'
I0819 06:18:25.968462  5342 slave.cpp:252] Mesos agent started on (802)@172.17.0.4:32775
I0819 06:18:25.968505  5342 slave.cpp:253] Flags at startup: --acls="" --appc_simple_discovery_uri_prefix="http://"
--appc_store_dir="/tmp/Endpoint_SlaveEndpointTest_UnauthorizedRequest_2_F1WBCR/store/appc"
--authenticate_http_readonly="true" --authenticate_http_readwrite="true" --authenticatee="crammd5"
--authentication_backoff_factor="1secs" --authorizer="local" --cgroups_cpu_enable_pids_and_tids_count="false"
--cgroups_enable_cfs="false" --cgroups_hierarchy="/sys/fs/cgroup" --cgroups_limit_swap="false"
--cgroups_root="mesos" --container_disk_watch_interval="15secs" --containerizers="mesos" --credential="/tmp/Endpoint_SlaveEndpointTest_UnauthorizedRequest_2_F1WBCR/credential"
--default_role="*" --disallow_sharing_agent_pid_namespace="false" --disk_watch_interval="1mins"
--docker="docker" --docker_kill_orphans="true" --docker_registry="https://registry-1.docker.io"
--docker_remove_delay="6hrs" --docker_socket="/var/run/docker.sock" --docker_stop_timeout="0ns"
--docker_store_dir="/tmp/Endpoint_SlaveEndpointTest_UnauthorizedRequest_2_F1WBCR/store/docker"
--docker_volume_checkpoint_dir="/var/run/mesos/isolators/docker/volume" --enforce_container_disk_quota="false"
--executor_registration_timeout="1mins" --executor_reregistration_timeout="2secs" --executor_shutdown_grace_period="5secs"
--fetcher_cache_dir="/tmp/Endpoint_SlaveEndpointTest_UnauthorizedRequest_2_F1WBCR/fetch" --fetcher_cache_size="2GB"
--frameworks_home="" --gc_delay="1weeks" --gc_disk_headroom="0.1" --hadoop_home="" --help="false"
--hostname_lookup="true" --http_command_executor="false" --http_credentials="/tmp/Endpoint_SlaveEndpointTest_UnauthorizedRequest_2_F1WBCR/http_credentials"
--http_heartbeat_interval="30secs" --initialize_driver_logging="true" --isolation="posix/cpu,posix/mem"
--launcher="posix" --launcher_dir="/mesos/mesos-1.5.0/_build/src" --logbufsecs="0" --logging_level="INFO"
--max_completed_executors_per_framework="150" --oversubscribed_resources_interval="15secs"
--perf_duration="10secs" --perf_interval="1mins" --port="5051" --qos_correction_interval_min="0ns"
--quiet="false" --recover="reconnect" --recovery_timeout="15mins" --registration_backoff_factor="10ms"
--resources="cpus:2;gpus:0;mem:1024;disk:1024;ports:[31000-32000]" --revocable_cpu_low_priority="true"
--runtime_dir="/tmp/Endpoint_SlaveEndpointTest_UnauthorizedRequest_2_F1WBCR" --sandbox_directory="/mnt/mesos/sandbox"
--strict="true" --switch_user="true" --systemd_enable_support="true" --systemd_runtime_directory="/run/systemd/system"
--version="false" --work_dir="/tmp/Endpoint_SlaveEndpointTest_UnauthorizedRequest_2_QdVPIZ"
I0819 06:18:25.969307  5342 credentials.hpp:86] Loading credential for authentication from
'/tmp/Endpoint_SlaveEndpointTest_UnauthorizedRequest_2_F1WBCR/credential'
I0819 06:18:25.969583  5342 slave.cpp:285] Agent using credential for: test-principal
I0819 06:18:25.969635  5342 credentials.hpp:37] Loading credentials for authentication from
'/tmp/Endpoint_SlaveEndpointTest_UnauthorizedRequest_2_F1WBCR/http_credentials'
I0819 06:18:25.970016  5342 http.cpp:1026] Creating default 'basic' HTTP authenticator for
realm 'mesos-agent-readonly'
I0819 06:18:25.970319  5342 http.cpp:1026] Creating default 'basic' HTTP authenticator for
realm 'mesos-agent-readwrite'
I0819 06:18:25.972558  5342 slave.cpp:581] Agent resources: [{"name":"cpus","scalar":{"value":2.0},"type":"SCALAR"},{"name":"mem","scalar":{"value":1024.0},"type":"SCALAR"},{"name":"disk","scalar":{"value":1024.0},"type":"SCALAR"},{"name":"ports","ranges":{"range":[{"begin":31000,"end":32000}]},"type":"RANGES"}]
I0819 06:18:25.972991  5342 slave.cpp:589] Agent attributes: [  ]
I0819 06:18:25.973105  5342 slave.cpp:598] Agent hostname: fa239d6ea28b
I0819 06:18:25.973457  5340 status_update_manager.cpp:177] Pausing sending status updates
I0819 06:18:25.975404  5339 state.cpp:64] Recovering state from '/tmp/Endpoint_SlaveEndpointTest_UnauthorizedRequest_2_QdVPIZ/meta'
I0819 06:18:25.975790  5338 status_update_manager.cpp:203] Recovering status update manager
I0819 06:18:25.976114  5343 containerizer.cpp:609] Recovering containerizer
I0819 06:18:25.978158  5343 provisioner.cpp:416] Provisioner recovery complete
I0819 06:18:25.978631  5340 slave.cpp:6226] Finished recovery
I0819 06:18:25.979271  5340 slave.cpp:6408] Querying resource estimator for oversubscribable
resources
I0819 06:18:25.979672  5339 slave.cpp:6422] Received oversubscribable resources {} from the
resource estimator
I0819 06:18:25.983916  5336 process.cpp:3933] Handling HTTP event for process 'slave(802)'
with path: '/slave(802)/containers'
I0819 06:18:25.985905  5339 http.cpp:1166] HTTP GET for /slave(802)/containers from 172.17.0.4:48622
I0819 06:18:25.986024  5339 http.cpp:957] Authorizing principal 'test-principal' to GET the
'/containers' endpoint
I0819 06:18:25.989187  5317 slave.cpp:859] Agent terminating
[       OK ] Endpoint/SlaveEndpointTest.UnauthorizedRequest/2 (44 ms)
[ RUN      ] Endpoint/SlaveEndpointTest.NoAuthorizer/0
I0819 06:18:26.006953  5317 containerizer.cpp:246] Using isolation: posix/cpu,posix/mem,filesystem/posix,network/cni,environment_secret
W0819 06:18:26.007695  5317 backend.cpp:76] Failed to create 'overlay' backend: OverlayBackend
requires root privileges
W0819 06:18:26.007891  5317 backend.cpp:76] Failed to create 'bind' backend: BindBackend requires
root privileges
I0819 06:18:26.007932  5317 provisioner.cpp:255] Using default backend 'copy'
I0819 06:18:26.010663  5317 cluster.cpp:448] Creating default 'local' authorizer
I0819 06:18:26.013732  5341 slave.cpp:252] Mesos agent started on (803)@172.17.0.4:32775
I0819 06:18:26.013774  5341 slave.cpp:253] Flags at startup: --acls="" --appc_simple_discovery_uri_prefix="http://"
--appc_store_dir="/tmp/Endpoint_SlaveEndpointTest_NoAuthorizer_0_zaIpCl/store/appc" --authenticate_http_readonly="true"
--authenticate_http_readwrite="true" --authenticatee="crammd5" --authentication_backoff_factor="1secs"
--authorizer="local" --cgroups_cpu_enable_pids_and_tids_count="false" --cgroups_enable_cfs="false"
--cgroups_hierarchy="/sys/fs/cgroup" --cgroups_limit_swap="false" --cgroups_root="mesos" --container_disk_watch_interval="15secs"
--containerizers="mesos" --credential="/tmp/Endpoint_SlaveEndpointTest_NoAuthorizer_0_zaIpCl/credential"
--default_role="*" --disallow_sharing_agent_pid_namespace="false" --disk_watch_interval="1mins"
--docker="docker" --docker_kill_orphans="true" --docker_registry="https://registry-1.docker.io"
--docker_remove_delay="6hrs" --docker_socket="/var/run/docker.sock" --docker_stop_timeout="0ns"
--docker_store_dir="/tmp/Endpoint_SlaveEndpointTest_NoAuthorizer_0_zaIpCl/store/docker" --docker_volume_checkpoint_dir="/var/run/mesos/isolators/docker/volume"
--enforce_container_disk_quota="false" --executor_registration_timeout="1mins" --executor_reregistration_timeout="2secs"
--executor_shutdown_grace_period="5secs" --fetcher_cache_dir="/tmp/Endpoint_SlaveEndpointTest_NoAuthorizer_0_zaIpCl/fetch"
--fetcher_cache_size="2GB" --frameworks_home="" --gc_delay="1weeks" --gc_disk_headroom="0.1"
--hadoop_home="" --help="false" --hostname_lookup="true" --http_command_executor="false" --http_credentials="/tmp/Endpoint_SlaveEndpointTest_NoAuthorizer_0_zaIpCl/http_credentials"
--http_heartbeat_interval="30secs" --initialize_driver_logging="true" --isolation="posix/cpu,posix/mem"
--launcher="posix" --launcher_dir="/mesos/mesos-1.5.0/_build/src" --logbufsecs="0" --logging_level="INFO"
--max_completed_executors_per_framework="150" --oversubscribed_resources_interval="15secs"
--perf_duration="10secs" --perf_interval="1mins" --port="5051" --qos_correction_interval_min="0ns"
--quiet="false" --recover="reconnect" --recovery_timeout="15mins" --registration_backoff_factor="10ms"
--resources="cpus:2;gpus:0;mem:1024;disk:1024;ports:[31000-32000]" --revocable_cpu_low_priority="true"
--runtime_dir="/tmp/Endpoint_SlaveEndpointTest_NoAuthorizer_0_zaIpCl" --sandbox_directory="/mnt/mesos/sandbox"
--strict="true" --switch_user="true" --systemd_enable_support="true" --systemd_runtime_directory="/run/systemd/system"
--version="false" --work_dir="/tmp/Endpoint_SlaveEndpointTest_NoAuthorizer_0_ykcqBt"
I0819 06:18:26.014524  5341 credentials.hpp:86] Loading credential for authentication from
'/tmp/Endpoint_SlaveEndpointTest_NoAuthorizer_0_zaIpCl/credential'
I0819 06:18:26.014786  5341 slave.cpp:285] Agent using credential for: test-principal
I0819 06:18:26.014812  5341 credentials.hpp:37] Loading credentials for authentication from
'/tmp/Endpoint_SlaveEndpointTest_NoAuthorizer_0_zaIpCl/http_credentials'
I0819 06:18:26.015172  5341 http.cpp:1026] Creating default 'basic' HTTP authenticator for
realm 'mesos-agent-readonly'
I0819 06:18:26.015445  5341 http.cpp:1026] Creating default 'basic' HTTP authenticator for
realm 'mesos-agent-readwrite'
I0819 06:18:26.017652  5341 slave.cpp:581] Agent resources: [{"name":"cpus","scalar":{"value":2.0},"type":"SCALAR"},{"name":"mem","scalar":{"value":1024.0},"type":"SCALAR"},{"name":"disk","scalar":{"value":1024.0},"type":"SCALAR"},{"name":"ports","ranges":{"range":[{"begin":31000,"end":32000}]},"type":"RANGES"}]
I0819 06:18:26.018084  5341 slave.cpp:589] Agent attributes: [  ]
I0819 06:18:26.018105  5341 slave.cpp:598] Agent hostname: fa239d6ea28b
I0819 06:18:26.018349  5339 status_update_manager.cpp:177] Pausing sending status updates
I0819 06:18:26.020297  5338 state.cpp:64] Recovering state from '/tmp/Endpoint_SlaveEndpointTest_NoAuthorizer_0_ykcqBt/meta'
I0819 06:18:26.020860  5342 status_update_manager.cpp:203] Recovering status update manager
I0819 06:18:26.021111  5343 containerizer.cpp:609] Recovering containerizer
I0819 06:18:26.023167  5340 provisioner.cpp:416] Provisioner recovery complete
I0819 06:18:26.023686  5338 slave.cpp:6226] Finished recovery
I0819 06:18:26.024392  5338 slave.cpp:6408] Querying resource estimator for oversubscribable
resources
I0819 06:18:26.024770  5338 slave.cpp:6422] Received oversubscribable resources {} from the
resource estimator
I0819 06:18:26.029534  5342 process.cpp:3933] Handling HTTP event for process 'slave(803)'
with path: '/slave(803)/monitor/statistics'
I0819 06:18:26.031373  5338 http.cpp:1166] HTTP GET for /slave(803)/monitor/statistics from
172.17.0.4:48624
I0819 06:18:26.031522  5338 http.cpp:957] Authorizing principal 'test-principal' to GET the
'/monitor/statistics' endpoint
I0819 06:18:26.045769  5339 slave.cpp:859] Agent terminating
[       OK ] Endpoint/SlaveEndpointTest.NoAuthorizer/0 (56 ms)
[ RUN      ] Endpoint/SlaveEndpointTest.NoAuthorizer/1
I0819 06:18:26.063599  5317 containerizer.cpp:246] Using isolation: posix/cpu,posix/mem,filesystem/posix,network/cni,environment_secret
W0819 06:18:26.064343  5317 backend.cpp:76] Failed to create 'overlay' backend: OverlayBackend
requires root privileges
W0819 06:18:26.064538  5317 backend.cpp:76] Failed to create 'bind' backend: BindBackend requires
root privileges
I0819 06:18:26.064579  5317 provisioner.cpp:255] Using default backend 'copy'
I0819 06:18:26.067276  5317 cluster.cpp:448] Creating default 'local' authorizer
I0819 06:18:26.070300  5341 slave.cpp:252] Mesos agent started on (804)@172.17.0.4:32775
I0819 06:18:26.070343  5341 slave.cpp:253] Flags at startup: --acls="" --appc_simple_discovery_uri_prefix="http://"
--appc_store_dir="/tmp/Endpoint_SlaveEndpointTest_NoAuthorizer_1_ZhI0aQ/store/appc" --authenticate_http_readonly="true"
--authenticate_http_readwrite="true" --authenticatee="crammd5" --authentication_backoff_factor="1secs"
--authorizer="local" --cgroups_cpu_enable_pids_and_tids_count="false" --cgroups_enable_cfs="false"
--cgroups_hierarchy="/sys/fs/cgroup" --cgroups_limit_swap="false" --cgroups_root="mesos" --container_disk_watch_interval="15secs"
--containerizers="mesos" --credential="/tmp/Endpoint_SlaveEndpointTest_NoAuthorizer_1_ZhI0aQ/credential"
--default_role="*" --disallow_sharing_agent_pid_namespace="false" --disk_watch_interval="1mins"
--docker="docker" --docker_kill_orphans="true" --docker_registry="https://registry-1.docker.io"
--docker_remove_delay="6hrs" --docker_socket="/var/run/docker.sock" --docker_stop_timeout="0ns"
--docker_store_dir="/tmp/Endpoint_SlaveEndpointTest_NoAuthorizer_1_ZhI0aQ/store/docker" --docker_volume_checkpoint_dir="/var/run/mesos/isolators/docker/volume"
--enforce_container_disk_quota="false" --executor_registration_timeout="1mins" --executor_reregistration_timeout="2secs"
--executor_shutdown_grace_period="5secs" --fetcher_cache_dir="/tmp/Endpoint_SlaveEndpointTest_NoAuthorizer_1_ZhI0aQ/fetch"
--fetcher_cache_size="2GB" --frameworks_home="" --gc_delay="1weeks" --gc_disk_headroom="0.1"
--hadoop_home="" --help="false" --hostname_lookup="true" --http_command_executor="false" --http_credentials="/tmp/Endpoint_SlaveEndpointTest_NoAuthorizer_1_ZhI0aQ/http_credentials"
--http_heartbeat_interval="30secs" --initialize_driver_logging="true" --isolation="posix/cpu,posix/mem"
--launcher="posix" --launcher_dir="/mesos/mesos-1.5.0/_build/src" --logbufsecs="0" --logging_level="INFO"
--max_completed_executors_per_framework="150" --oversubscribed_resources_interval="15secs"
--perf_duration="10secs" --perf_interval="1mins" --port="5051" --qos_correction_interval_min="0ns"
--quiet="false" --recover="reconnect" --recovery_timeout="15mins" --registration_backoff_factor="10ms"
--resources="cpus:2;gpus:0;mem:1024;disk:1024;ports:[31000-32000]" --revocable_cpu_low_priority="true"
--runtime_dir="/tmp/Endpoint_SlaveEndpointTest_NoAuthorizer_1_ZhI0aQ" --sandbox_directory="/mnt/mesos/sandbox"
--strict="true" --switch_user="true" --systemd_enable_support="true" --systemd_runtime_directory="/run/systemd/system"
--version="false" --work_dir="/tmp/Endpoint_SlaveEndpointTest_NoAuthorizer_1_w5bR0X"
I0819 06:18:26.071060  5341 credentials.hpp:86] Loading credential for authentication from
'/tmp/Endpoint_SlaveEndpointTest_NoAuthorizer_1_ZhI0aQ/credential'
I0819 06:18:26.071321  5341 slave.cpp:285] Agent using credential for: test-principal
I0819 06:18:26.071347  5341 credentials.hpp:37] Loading credentials for authentication from
'/tmp/Endpoint_SlaveEndpointTest_NoAuthorizer_1_ZhI0aQ/http_credentials'
I0819 06:18:26.071713  5341 http.cpp:1026] Creating default 'basic' HTTP authenticator for
realm 'mesos-agent-readonly'
I0819 06:18:26.071985  5341 http.cpp:1026] Creating default 'basic' HTTP authenticator for
realm 'mesos-agent-readwrite'
I0819 06:18:26.074275  5341 slave.cpp:581] Agent resources: [{"name":"cpus","scalar":{"value":2.0},"type":"SCALAR"},{"name":"mem","scalar":{"value":1024.0},"type":"SCALAR"},{"name":"disk","scalar":{"value":1024.0},"type":"SCALAR"},{"name":"ports","ranges":{"range":[{"begin":31000,"end":32000}]},"type":"RANGES"}]
I0819 06:18:26.074704  5341 slave.cpp:589] Agent attributes: [  ]
I0819 06:18:26.074728  5341 slave.cpp:598] Agent hostname: fa239d6ea28b
I0819 06:18:26.074985  5336 status_update_manager.cpp:177] Pausing sending status updates
I0819 06:18:26.077019  5342 state.cpp:64] Recovering state from '/tmp/Endpoint_SlaveEndpointTest_NoAuthorizer_1_w5bR0X/meta'
I0819 06:18:26.077460  5343 status_update_manager.cpp:203] Recovering status update manager
I0819 06:18:26.077744  5340 containerizer.cpp:609] Recovering containerizer
I0819 06:18:26.079836  5341 provisioner.cpp:416] Provisioner recovery complete
I0819 06:18:26.080348  5342 slave.cpp:6226] Finished recovery
I0819 06:18:26.080986  5342 slave.cpp:6408] Querying resource estimator for oversubscribable
resources
I0819 06:18:26.081320  5338 slave.cpp:6422] Received oversubscribable resources {} from the
resource estimator
I0819 06:18:26.085265  5342 process.cpp:3933] Handling HTTP event for process 'slave(804)'
with path: '/slave(804)/monitor/statistics.json'
I0819 06:18:26.087158  5336 http.cpp:1166] HTTP GET for /slave(804)/monitor/statistics.json
from 172.17.0.4:48630
I0819 06:18:26.087321  5336 http.cpp:957] Authorizing principal 'test-principal' to GET the
'/monitor/statistics.json' endpoint
I0819 06:18:26.092201  5317 slave.cpp:859] Agent terminating
[       OK ] Endpoint/SlaveEndpointTest.NoAuthorizer/1 (46 ms)
[ RUN      ] Endpoint/SlaveEndpointTest.NoAuthorizer/2
I0819 06:18:26.109990  5317 containerizer.cpp:246] Using isolation: posix/cpu,posix/mem,filesystem/posix,network/cni,environment_secret
W0819 06:18:26.110740  5317 backend.cpp:76] Failed to create 'overlay' backend: OverlayBackend
requires root privileges
W0819 06:18:26.110939  5317 backend.cpp:76] Failed to create 'bind' backend: BindBackend requires
root privileges
I0819 06:18:26.110980  5317 provisioner.cpp:255] Using default backend 'copy'
I0819 06:18:26.113749  5317 cluster.cpp:448] Creating default 'local' authorizer
I0819 06:18:26.116838  5340 slave.cpp:252] Mesos agent started on (805)@172.17.0.4:32775
I0819 06:18:26.116881  5340 slave.cpp:253] Flags at startup: --acls="" --appc_simple_discovery_uri_prefix="http://"
--appc_store_dir="/tmp/Endpoint_SlaveEndpointTest_NoAuthorizer_2_XGqofl/store/appc" --authenticate_http_readonly="true"
--authenticate_http_readwrite="true" --authenticatee="crammd5" --authentication_backoff_factor="1secs"
--authorizer="local" --cgroups_cpu_enable_pids_and_tids_count="false" --cgroups_enable_cfs="false"
--cgroups_hierarchy="/sys/fs/cgroup" --cgroups_limit_swap="false" --cgroups_root="mesos" --container_disk_watch_interval="15secs"
--containerizers="mesos" --credential="/tmp/Endpoint_SlaveEndpointTest_NoAuthorizer_2_XGqofl/credential"
--default_role="*" --disallow_sharing_agent_pid_namespace="false" --disk_watch_interval="1mins"
--docker="docker" --docker_kill_orphans="true" --docker_registry="https://registry-1.docker.io"
--docker_remove_delay="6hrs" --docker_socket="/var/run/docker.sock" --docker_stop_timeout="0ns"
--docker_store_dir="/tmp/Endpoint_SlaveEndpointTest_NoAuthorizer_2_XGqofl/store/docker" --docker_volume_checkpoint_dir="/var/run/mesos/isolators/docker/volume"
--enforce_container_disk_quota="false" --executor_registration_timeout="1mins" --executor_reregistration_timeout="2secs"
--executor_shutdown_grace_period="5secs" --fetcher_cache_dir="/tmp/Endpoint_SlaveEndpointTest_NoAuthorizer_2_XGqofl/fetch"
--fetcher_cache_size="2GB" --frameworks_home="" --gc_delay="1weeks" --gc_disk_headroom="0.1"
--hadoop_home="" --help="false" --hostname_lookup="true" --http_command_executor="false" --http_credentials="/tmp/Endpoint_SlaveEndpointTest_NoAuthorizer_2_XGqofl/http_credentials"
--http_heartbeat_interval="30secs" --initialize_driver_logging="true" --isolation="posix/cpu,posix/mem"
--launcher="posix" --launcher_dir="/mesos/mesos-1.5.0/_build/src" --logbufsecs="0" --logging_level="INFO"
--max_completed_executors_per_framework="150" --oversubscribed_resources_interval="15secs"
--perf_duration="10secs" --perf_interval="1mins" --port="5051" --qos_correction_interval_min="0ns"
--quiet="false" --recover="reconnect" --recovery_timeout="15mins" --registration_backoff_factor="10ms"
--resources="cpus:2;gpus:0;mem:1024;disk:1024;ports:[31000-32000]" --revocable_cpu_low_priority="true"
--runtime_dir="/tmp/Endpoint_SlaveEndpointTest_NoAuthorizer_2_XGqofl" --sandbox_directory="/mnt/mesos/sandbox"
--strict="true" --switch_user="true" --systemd_enable_support="true" --systemd_runtime_directory="/run/systemd/system"
--version="false" --work_dir="/tmp/Endpoint_SlaveEndpointTest_NoAuthorizer_2_2b2GXs"
I0819 06:18:26.117733  5340 credentials.hpp:86] Loading credential for authentication from
'/tmp/Endpoint_SlaveEndpointTest_NoAuthorizer_2_XGqofl/credential'
I0819 06:18:26.118201  5340 slave.cpp:285] Agent using credential for: test-principal
I0819 06:18:26.118232  5340 credentials.hpp:37] Loading credentials for authentication from
'/tmp/Endpoint_SlaveEndpointTest_NoAuthorizer_2_XGqofl/http_credentials'
I0819 06:18:26.118680  5340 http.cpp:1026] Creating default 'basic' HTTP authenticator for
realm 'mesos-agent-readonly'
I0819 06:18:26.119021  5340 http.cpp:1026] Creating default 'basic' HTTP authenticator for
realm 'mesos-agent-readwrite'
I0819 06:18:26.121273  5340 slave.cpp:581] Agent resources: [{"name":"cpus","scalar":{"value":2.0},"type":"SCALAR"},{"name":"mem","scalar":{"value":1024.0},"type":"SCALAR"},{"name":"disk","scalar":{"value":1024.0},"type":"SCALAR"},{"name":"ports","ranges":{"range":[{"begin":31000,"end":32000}]},"type":"RANGES"}]
I0819 06:18:26.121701  5340 slave.cpp:589] Agent attributes: [  ]
I0819 06:18:26.121721  5340 slave.cpp:598] Agent hostname: fa239d6ea28b
I0819 06:18:26.121951  5342 status_update_manager.cpp:177] Pausing sending status updates
I0819 06:18:26.123968  5338 state.cpp:64] Recovering state from '/tmp/Endpoint_SlaveEndpointTest_NoAuthorizer_2_2b2GXs/meta'
I0819 06:18:26.124390  5341 status_update_manager.cpp:203] Recovering status update manager
I0819 06:18:26.124704  5339 containerizer.cpp:609] Recovering containerizer
I0819 06:18:26.126705  5339 provisioner.cpp:416] Provisioner recovery complete
I0819 06:18:26.127142  5340 slave.cpp:6226] Finished recovery
I0819 06:18:26.127791  5340 slave.cpp:6408] Querying resource estimator for oversubscribable
resources
I0819 06:18:26.128219  5337 slave.cpp:6422] Received oversubscribable resources {} from the
resource estimator
I0819 06:18:26.132179  5340 process.cpp:3933] Handling HTTP event for process 'slave(805)'
with path: '/slave(805)/containers'
I0819 06:18:26.134419  5338 http.cpp:1166] HTTP GET for /slave(805)/containers from 172.17.0.4:48632
I0819 06:18:26.134542  5338 http.cpp:957] Authorizing principal 'test-principal' to GET the
'/containers' endpoint
I0819 06:18:26.140276  5317 slave.cpp:859] Agent terminating
[       OK ] Endpoint/SlaveEndpointTest.NoAuthorizer/2 (47 ms)
[----------] 9 tests from Endpoint/SlaveEndpointTest (429 ms total)

[----------] 2 tests from ContainerizerType/DefaultContainerDNSFlagTest
[ RUN      ] ContainerizerType/DefaultContainerDNSFlagTest.ValidateFlag/0
[       OK ] ContainerizerType/DefaultContainerDNSFlagTest.ValidateFlag/0 (18 ms)
[ RUN      ] ContainerizerType/DefaultContainerDNSFlagTest.ValidateFlag/1
[       OK ] ContainerizerType/DefaultContainerDNSFlagTest.ValidateFlag/1 (20 ms)
[----------] 2 tests from ContainerizerType/DefaultContainerDNSFlagTest (38 ms total)

[----------] Global test environment tear-down
[==========] 1657 tests from 182 test cases ran. (761961 ms total)
[  PASSED  ] 1653 tests.
[  FAILED  ] 4 tests, listed below:
[  FAILED  ] DefaultExecutorCheckTest.CommandCheckDeliveredAndReconciled
[  FAILED  ] DefaultExecutorCheckTest.CommandCheckStatusChange
[  FAILED  ] DefaultExecutorCheckTest.CommandCheckSeesParentsEnv
[  FAILED  ] DefaultExecutorCheckTest.CommandCheckSharesWorkDirWithTask

 4 FAILED TESTS
  YOU HAVE 20 DISABLED TESTS

I0819 06:18:26.324914  5344 process.cpp:1072] Failed to accept socket: future discarded
make[4]: *** [check-local] Error 1
make[4]: Leaving directory `/mesos/mesos-1.5.0/_build/src'
make[3]: *** [check-am] Error 2
make[3]: Leaving directory `/mesos/mesos-1.5.0/_build/src'
make[2]: *** [check] Error 2
make[2]: Leaving directory `/mesos/mesos-1.5.0/_build/src'
make[1]: *** [check-recursive] Error 1
make[1]: Leaving directory `/mesos/mesos-1.5.0/_build'
make: *** [distcheck] Error 1
+ docker rmi mesos-1503115972-18936
Untagged: mesos-1503115972-18936:latest
Deleted: sha256:160bde52473a7cbf56e80e772e373aca8e92c025c68a720c364f00f3bbe92980
Deleted: sha256:fcbce55729c34911a5db16e7b3a8f78bdd0e36ba6d080315f4e9cea6751f4bc2
Deleted: sha256:f8201e0b039f8a5c89f7a344448eb49024c6d995ce62b0bcd169b628f02e0c77
Deleted: sha256:bd27f6e2b9e31540ef14d51d02a9b8de2a5525d53e8d6cc717c3a12e60fc1544
Deleted: sha256:16a5711e32e8911bd7280e5298ac5d243d8d449511c5bee56321c9c66c971f06
Deleted: sha256:47cae7f2e99deb5deab4f3ba47e4a86c41a67d27feb6caba7f9ea5ea872460a1
Deleted: sha256:020e6999724d08cfd46094ab0244ccdfbdaa5bb8040f90ecac634113347dae4b
Deleted: sha256:1fd353f3df91df043290c501d446f494e1267d944b3608180481fdbe4ab27ab9
Deleted: sha256:30e820e6d3ae88e677a331add39d7d90eea9126eb626289e90271a98d3e759c1
Deleted: sha256:9e5129779ee24d76e1f0cf72ddab5859c05d03425c5b5349f60b8725d16b6f83
Deleted: sha256:7b91646703a8635b866cf96289f983aa4128b23dc35add001d5ed31a2cd1b63e
Deleted: sha256:1ceb569b70f7dc6437aae4dcc6e42c9198d2f6eaf7d29d90b188632e872cbc01
Deleted: sha256:89ab020931d67b7ccae3014beca0ae945c5ef3b0f458deff7999335d6682743b
Deleted: sha256:3480e38e7fc5fb4da959cc1257e70c467ef2e75b7e377ba86dd638980007bb1e
Deleted: sha256:7e86d75aad9502334b9efad1d7b8185c596f97d951fcf6c7d7e030b6a040d169
Deleted: sha256:877613dc436e8d14132a09a71d9cb364e3ad59d172cfabf5c95ac0a7cd08de21
Deleted: sha256:7e4d4f5136f74bb598fe49286c5b825f2d7ab8b1213e9f015c65be08ad45d878
Deleted: sha256:e838be7d277b135c509da4189496d97cb47554e077bdb6edc38c612655a27f71
Deleted: sha256:b4ccfc4f31c6b2bdb291ae6d830231f97a8e2981f63a4e5269aff9baa5df48d4
Deleted: sha256:66ba44cf17a8a26b04387d5d28a6ff1f12bed4316f64b653025cb046856139d7
Deleted: sha256:9e5b09e7d0b530d7be3894beb6db1e1714229f58eba13d3b848ec3eaa70a7748
Deleted: sha256:f2b50ebe8cc3adfe816fe817544a9e4744a8b030b9086d7a1a6fb90c296f78bf
Deleted: sha256:0caa2da8854468790ace3bed4731323bcd9b6f1d4048a22e4c575677ff3190ea
Deleted: sha256:a37477f78a537fd520e73c19c01d2754dac575d9cc8ef55be1f75d71995deb46
Build step 'Execute shell' marked build as failure
Not sending mail to unregistered user toenshoff@me.com
Not sending mail to unregistered user yujie.jay@gmail.com
Not sending mail to unregistered user gregorywmann@gmail.com

Mime
View raw message