mesos-builds mailing list archives

Site index · List index
Message view « Date » · « Thread »
Top « Date » · « Thread »
From Apache Jenkins Server <jenk...@builds.apache.org>
Subject Build failed in Jenkins: Mesos-Buildbot » autotools,gcc,--verbose,GLOG_v=1 MESOS_VERBOSE=1,centos:7,(ubuntu)&&(!ubuntu-us1)&&(!ubuntu-eu2) #4063
Date Thu, 03 Aug 2017 18:04:23 GMT
See <https://builds.apache.org/job/Mesos-Buildbot/BUILDTOOL=autotools,COMPILER=gcc,CONFIGURATION=--verbose,ENVIRONMENT=GLOG_v=1%20MESOS_VERBOSE=1,OS=centos%3A7,label_exp=(ubuntu)&&(!ubuntu-us1)&&(!ubuntu-eu2)/4063/display/redirect?page=changes>

Changes:

[zhq527725] Replaced raw string with normal string for `DefaultContainerDNSCniTest`.

------------------------------------------
[...truncated 30.58 MB...]
I0803 18:03:54.482456  6457 http.cpp:1026] Creating default 'basic' HTTP authenticator for
realm 'mesos-agent-readwrite'
I0803 18:03:54.483945  6457 slave.cpp:565] Agent resources: [{"name":"cpus","scalar":{"value":2.0},"type":"SCALAR"},{"name":"mem","scalar":{"value":1024.0},"type":"SCALAR"},{"name":"disk","scalar":{"value":1024.0},"type":"SCALAR"},{"name":"ports","ranges":{"range":[{"begin":31000,"end":32000}]},"type":"RANGES"}]
I0803 18:03:54.484205  6457 slave.cpp:573] Agent attributes: [  ]
I0803 18:03:54.484220  6457 slave.cpp:582] Agent hostname: 8465ccf114ec
I0803 18:03:54.484403  6468 status_update_manager.cpp:177] Pausing sending status updates
I0803 18:03:54.486073  6453 state.cpp:64] Recovering state from '/tmp/Endpoint_SlaveEndpointTest_AuthorizedRequest_2_ffNS2y/meta'
I0803 18:03:54.486439  6463 status_update_manager.cpp:203] Recovering status update manager
I0803 18:03:54.486659  6463 containerizer.cpp:598] Recovering containerizer
I0803 18:03:54.488212  6468 provisioner.cpp:416] Provisioner recovery complete
I0803 18:03:54.488667  6470 slave.cpp:6207] Finished recovery
I0803 18:03:54.489372  6470 slave.cpp:6389] Querying resource estimator for oversubscribable
resources
I0803 18:03:54.489639  6461 slave.cpp:6403] Received oversubscribable resources {} from the
resource estimator
I0803 18:03:54.492271  6449 process.cpp:3938] Handling HTTP event for process 'slave(794)'
with path: '/slave(794)/containers'
I0803 18:03:54.493674  6457 http.cpp:1166] HTTP GET for /slave(794)/containers from 172.17.0.11:38028
I0803 18:03:54.493749  6457 http.cpp:957] Authorizing principal 'test-principal' to GET the
'/containers' endpoint
I0803 18:03:54.497458  6469 slave.cpp:843] Agent terminating
[       OK ] Endpoint/SlaveEndpointTest.AuthorizedRequest/2 (33 ms)
[ RUN      ] Endpoint/SlaveEndpointTest.UnauthorizedRequest/0
I0803 18:03:54.509477  6430 containerizer.cpp:246] Using isolation: posix/cpu,posix/mem,filesystem/posix,network/cni,environment_secret
W0803 18:03:54.509964  6430 backend.cpp:76] Failed to create 'aufs' backend: AufsBackend requires
root privileges
W0803 18:03:54.510066  6430 backend.cpp:76] Failed to create 'bind' backend: BindBackend requires
root privileges
I0803 18:03:54.510107  6430 provisioner.cpp:255] Using default backend 'copy'
I0803 18:03:54.515276  6465 slave.cpp:250] Mesos agent started on (795)@172.17.0.11:44560
I0803 18:03:54.515302  6465 slave.cpp:251] Flags at startup: --acls="" --appc_simple_discovery_uri_prefix="http://"
--appc_store_dir="/tmp/Endpoint_SlaveEndpointTest_UnauthorizedRequest_0_r8LGrp/store/appc"
--authenticate_http_readonly="true" --authenticate_http_readwrite="true" --authenticatee="crammd5"
--authentication_backoff_factor="1secs" --authorizer="local" --cgroups_cpu_enable_pids_and_tids_count="false"
--cgroups_enable_cfs="false" --cgroups_hierarchy="/sys/fs/cgroup" --cgroups_limit_swap="false"
--cgroups_root="mesos" --container_disk_watch_interval="15secs" --containerizers="mesos" --credential="/tmp/Endpoint_SlaveEndpointTest_UnauthorizedRequest_0_r8LGrp/credential"
--default_role="*" --disk_watch_interval="1mins" --docker="docker" --docker_kill_orphans="true"
--docker_registry="https://registry-1.docker.io" --docker_remove_delay="6hrs" --docker_socket="/var/run/docker.sock"
--docker_stop_timeout="0ns" --docker_store_dir="/tmp/Endpoint_SlaveEndpointTest_UnauthorizedRequest_0_r8LGrp/store/docker"
--docker_volume_checkpoint_dir="/var/run/mesos/isolators/docker/volume" --enforce_container_disk_quota="false"
--executor_registration_timeout="1mins" --executor_reregistration_timeout="2secs" --executor_shutdown_grace_period="5secs"
--fetcher_cache_dir="/tmp/Endpoint_SlaveEndpointTest_UnauthorizedRequest_0_r8LGrp/fetch" --fetcher_cache_size="2GB"
--frameworks_home="" --gc_delay="1weeks" --gc_disk_headroom="0.1" --hadoop_home="" --help="false"
--hostname_lookup="true" --http_command_executor="false" --http_credentials="/tmp/Endpoint_SlaveEndpointTest_UnauthorizedRequest_0_r8LGrp/http_credentials"
--http_heartbeat_interval="30secs" --initialize_driver_logging="true" --isolation="posix/cpu,posix/mem"
--launcher="posix" --launcher_dir="/mesos/mesos-1.4.0/_build/src" --logbufsecs="0" --logging_level="INFO"
--max_completed_executors_per_framework="150" --oversubscribed_resources_interval="15secs"
--perf_duration="10secs" --perf_interval="1mins" --port="5051" --qos_correction_interval_min="0ns"
--quiet="false" --recover="reconnect" --recovery_timeout="15mins" --registration_backoff_factor="10ms"
--resources="cpus:2;gpus:0;mem:1024;disk:1024;ports:[31000-32000]" --revocable_cpu_low_priority="true"
--runtime_dir="/tmp/Endpoint_SlaveEndpointTest_UnauthorizedRequest_0_r8LGrp" --sandbox_directory="/mnt/mesos/sandbox"
--strict="true" --switch_user="true" --systemd_enable_support="true" --systemd_runtime_directory="/run/systemd/system"
--version="false" --work_dir="/tmp/Endpoint_SlaveEndpointTest_UnauthorizedRequest_0_DMvVJD"
I0803 18:03:54.515858  6465 credentials.hpp:86] Loading credential for authentication from
'/tmp/Endpoint_SlaveEndpointTest_UnauthorizedRequest_0_r8LGrp/credential'
I0803 18:03:54.516044  6465 slave.cpp:283] Agent using credential for: test-principal
I0803 18:03:54.516072  6465 credentials.hpp:37] Loading credentials for authentication from
'/tmp/Endpoint_SlaveEndpointTest_UnauthorizedRequest_0_r8LGrp/http_credentials'
I0803 18:03:54.516381  6465 http.cpp:1026] Creating default 'basic' HTTP authenticator for
realm 'mesos-agent-readonly'
I0803 18:03:54.516538  6465 http.cpp:1026] Creating default 'basic' HTTP authenticator for
realm 'mesos-agent-readwrite'
I0803 18:03:54.518023  6465 slave.cpp:565] Agent resources: [{"name":"cpus","scalar":{"value":2.0},"type":"SCALAR"},{"name":"mem","scalar":{"value":1024.0},"type":"SCALAR"},{"name":"disk","scalar":{"value":1024.0},"type":"SCALAR"},{"name":"ports","ranges":{"range":[{"begin":31000,"end":32000}]},"type":"RANGES"}]
I0803 18:03:54.518244  6465 slave.cpp:573] Agent attributes: [  ]
I0803 18:03:54.518256  6465 slave.cpp:582] Agent hostname: 8465ccf114ec
I0803 18:03:54.518474  6459 status_update_manager.cpp:177] Pausing sending status updates
I0803 18:03:54.519706  6466 state.cpp:64] Recovering state from '/tmp/Endpoint_SlaveEndpointTest_UnauthorizedRequest_0_DMvVJD/meta'
I0803 18:03:54.519984  6466 status_update_manager.cpp:203] Recovering status update manager
I0803 18:03:54.520220  6469 containerizer.cpp:598] Recovering containerizer
I0803 18:03:54.521966  6457 provisioner.cpp:416] Provisioner recovery complete
I0803 18:03:54.522392  6465 slave.cpp:6207] Finished recovery
I0803 18:03:54.522855  6465 slave.cpp:6389] Querying resource estimator for oversubscribable
resources
I0803 18:03:54.523069  6454 slave.cpp:6403] Received oversubscribable resources {} from the
resource estimator
I0803 18:03:54.525885  6450 process.cpp:3938] Handling HTTP event for process 'slave(795)'
with path: '/slave(795)/monitor/statistics'
I0803 18:03:54.527261  6457 http.cpp:1166] HTTP GET for /slave(795)/monitor/statistics from
172.17.0.11:38030
I0803 18:03:54.527357  6457 http.cpp:957] Authorizing principal 'test-principal' to GET the
'/monitor/statistics' endpoint
I0803 18:03:54.529963  6430 slave.cpp:843] Agent terminating
[       OK ] Endpoint/SlaveEndpointTest.UnauthorizedRequest/0 (31 ms)
[ RUN      ] Endpoint/SlaveEndpointTest.UnauthorizedRequest/1
I0803 18:03:54.542505  6430 containerizer.cpp:246] Using isolation: posix/cpu,posix/mem,filesystem/posix,network/cni,environment_secret
W0803 18:03:54.543100  6430 backend.cpp:76] Failed to create 'aufs' backend: AufsBackend requires
root privileges
W0803 18:03:54.543226  6430 backend.cpp:76] Failed to create 'bind' backend: BindBackend requires
root privileges
I0803 18:03:54.543261  6430 provisioner.cpp:255] Using default backend 'copy'
I0803 18:03:54.548960  6456 slave.cpp:250] Mesos agent started on (796)@172.17.0.11:44560
I0803 18:03:54.548988  6456 slave.cpp:251] Flags at startup: --acls="" --appc_simple_discovery_uri_prefix="http://"
--appc_store_dir="/tmp/Endpoint_SlaveEndpointTest_UnauthorizedRequest_1_7mr5wu/store/appc"
--authenticate_http_readonly="true" --authenticate_http_readwrite="true" --authenticatee="crammd5"
--authentication_backoff_factor="1secs" --authorizer="local" --cgroups_cpu_enable_pids_and_tids_count="false"
--cgroups_enable_cfs="false" --cgroups_hierarchy="/sys/fs/cgroup" --cgroups_limit_swap="false"
--cgroups_root="mesos" --container_disk_watch_interval="15secs" --containerizers="mesos" --credential="/tmp/Endpoint_SlaveEndpointTest_UnauthorizedRequest_1_7mr5wu/credential"
--default_role="*" --disk_watch_interval="1mins" --docker="docker" --docker_kill_orphans="true"
--docker_registry="https://registry-1.docker.io" --docker_remove_delay="6hrs" --docker_socket="/var/run/docker.sock"
--docker_stop_timeout="0ns" --docker_store_dir="/tmp/Endpoint_SlaveEndpointTest_UnauthorizedRequest_1_7mr5wu/store/docker"
--docker_volume_checkpoint_dir="/var/run/mesos/isolators/docker/volume" --enforce_container_disk_quota="false"
--executor_registration_timeout="1mins" --executor_reregistration_timeout="2secs" --executor_shutdown_grace_period="5secs"
--fetcher_cache_dir="/tmp/Endpoint_SlaveEndpointTest_UnauthorizedRequest_1_7mr5wu/fetch" --fetcher_cache_size="2GB"
--frameworks_home="" --gc_delay="1weeks" --gc_disk_headroom="0.1" --hadoop_home="" --help="false"
--hostname_lookup="true" --http_command_executor="false" --http_credentials="/tmp/Endpoint_SlaveEndpointTest_UnauthorizedRequest_1_7mr5wu/http_credentials"
--http_heartbeat_interval="30secs" --initialize_driver_logging="true" --isolation="posix/cpu,posix/mem"
--launcher="posix" --launcher_dir="/mesos/mesos-1.4.0/_build/src" --logbufsecs="0" --logging_level="INFO"
--max_completed_executors_per_framework="150" --oversubscribed_resources_interval="15secs"
--perf_duration="10secs" --perf_interval="1mins" --port="5051" --qos_correction_interval_min="0ns"
--quiet="false" --recover="reconnect" --recovery_timeout="15mins" --registration_backoff_factor="10ms"
--resources="cpus:2;gpus:0;mem:1024;disk:1024;ports:[31000-32000]" --revocable_cpu_low_priority="true"
--runtime_dir="/tmp/Endpoint_SlaveEndpointTest_UnauthorizedRequest_1_7mr5wu" --sandbox_directory="/mnt/mesos/sandbox"
--strict="true" --switch_user="true" --systemd_enable_support="true" --systemd_runtime_directory="/run/systemd/system"
--version="false" --work_dir="/tmp/Endpoint_SlaveEndpointTest_UnauthorizedRequest_1_j9fxKI"
I0803 18:03:54.549482  6456 credentials.hpp:86] Loading credential for authentication from
'/tmp/Endpoint_SlaveEndpointTest_UnauthorizedRequest_1_7mr5wu/credential'
I0803 18:03:54.549652  6456 slave.cpp:283] Agent using credential for: test-principal
I0803 18:03:54.549676  6456 credentials.hpp:37] Loading credentials for authentication from
'/tmp/Endpoint_SlaveEndpointTest_UnauthorizedRequest_1_7mr5wu/http_credentials'
I0803 18:03:54.549926  6456 http.cpp:1026] Creating default 'basic' HTTP authenticator for
realm 'mesos-agent-readonly'
I0803 18:03:54.550101  6456 http.cpp:1026] Creating default 'basic' HTTP authenticator for
realm 'mesos-agent-readwrite'
I0803 18:03:54.551518  6456 slave.cpp:565] Agent resources: [{"name":"cpus","scalar":{"value":2.0},"type":"SCALAR"},{"name":"mem","scalar":{"value":1024.0},"type":"SCALAR"},{"name":"disk","scalar":{"value":1024.0},"type":"SCALAR"},{"name":"ports","ranges":{"range":[{"begin":31000,"end":32000}]},"type":"RANGES"}]
I0803 18:03:54.551753  6456 slave.cpp:573] Agent attributes: [  ]
I0803 18:03:54.551767  6456 slave.cpp:582] Agent hostname: 8465ccf114ec
I0803 18:03:54.551926  6455 status_update_manager.cpp:177] Pausing sending status updates
I0803 18:03:54.553557  6466 state.cpp:64] Recovering state from '/tmp/Endpoint_SlaveEndpointTest_UnauthorizedRequest_1_j9fxKI/meta'
I0803 18:03:54.554033  6460 status_update_manager.cpp:203] Recovering status update manager
I0803 18:03:54.554219  6464 containerizer.cpp:598] Recovering containerizer
I0803 18:03:54.555883  6456 provisioner.cpp:416] Provisioner recovery complete
I0803 18:03:54.556268  6466 slave.cpp:6207] Finished recovery
I0803 18:03:54.556710  6466 slave.cpp:6389] Querying resource estimator for oversubscribable
resources
I0803 18:03:54.557025  6462 slave.cpp:6403] Received oversubscribable resources {} from the
resource estimator
I0803 18:03:54.559444  6455 process.cpp:3938] Handling HTTP event for process 'slave(796)'
with path: '/slave(796)/monitor/statistics.json'
I0803 18:03:54.560739  6458 http.cpp:1166] HTTP GET for /slave(796)/monitor/statistics.json
from 172.17.0.11:38032
I0803 18:03:54.560816  6458 http.cpp:957] Authorizing principal 'test-principal' to GET the
'/monitor/statistics.json' endpoint
I0803 18:03:54.564043  6430 slave.cpp:843] Agent terminating
[       OK ] Endpoint/SlaveEndpointTest.UnauthorizedRequest/1 (36 ms)
[ RUN      ] Endpoint/SlaveEndpointTest.UnauthorizedRequest/2
I0803 18:03:54.578737  6430 containerizer.cpp:246] Using isolation: posix/cpu,posix/mem,filesystem/posix,network/cni,environment_secret
W0803 18:03:54.579349  6430 backend.cpp:76] Failed to create 'aufs' backend: AufsBackend requires
root privileges
W0803 18:03:54.579470  6430 backend.cpp:76] Failed to create 'bind' backend: BindBackend requires
root privileges
I0803 18:03:54.579519  6430 provisioner.cpp:255] Using default backend 'copy'
I0803 18:03:54.583534  6472 slave.cpp:250] Mesos agent started on (797)@172.17.0.11:44560
I0803 18:03:54.583566  6472 slave.cpp:251] Flags at startup: --acls="" --appc_simple_discovery_uri_prefix="http://"
--appc_store_dir="/tmp/Endpoint_SlaveEndpointTest_UnauthorizedRequest_2_tiaUXz/store/appc"
--authenticate_http_readonly="true" --authenticate_http_readwrite="true" --authenticatee="crammd5"
--authentication_backoff_factor="1secs" --authorizer="local" --cgroups_cpu_enable_pids_and_tids_count="false"
--cgroups_enable_cfs="false" --cgroups_hierarchy="/sys/fs/cgroup" --cgroups_limit_swap="false"
--cgroups_root="mesos" --container_disk_watch_interval="15secs" --containerizers="mesos" --credential="/tmp/Endpoint_SlaveEndpointTest_UnauthorizedRequest_2_tiaUXz/credential"
--default_role="*" --disk_watch_interval="1mins" --docker="docker" --docker_kill_orphans="true"
--docker_registry="https://registry-1.docker.io" --docker_remove_delay="6hrs" --docker_socket="/var/run/docker.sock"
--docker_stop_timeout="0ns" --docker_store_dir="/tmp/Endpoint_SlaveEndpointTest_UnauthorizedRequest_2_tiaUXz/store/docker"
--docker_volume_checkpoint_dir="/var/run/mesos/isolators/docker/volume" --enforce_container_disk_quota="false"
--executor_registration_timeout="1mins" --executor_reregistration_timeout="2secs" --executor_shutdown_grace_period="5secs"
--fetcher_cache_dir="/tmp/Endpoint_SlaveEndpointTest_UnauthorizedRequest_2_tiaUXz/fetch" --fetcher_cache_size="2GB"
--frameworks_home="" --gc_delay="1weeks" --gc_disk_headroom="0.1" --hadoop_home="" --help="false"
--hostname_lookup="true" --http_command_executor="false" --http_credentials="/tmp/Endpoint_SlaveEndpointTest_UnauthorizedRequest_2_tiaUXz/http_credentials"
--http_heartbeat_interval="30secs" --initialize_driver_logging="true" --isolation="posix/cpu,posix/mem"
--launcher="posix" --launcher_dir="/mesos/mesos-1.4.0/_build/src" --logbufsecs="0" --logging_level="INFO"
--max_completed_executors_per_framework="150" --oversubscribed_resources_interval="15secs"
--perf_duration="10secs" --perf_interval="1mins" --port="5051" --qos_correction_interval_min="0ns"
--quiet="false" --recover="reconnect" --recovery_timeout="15mins" --registration_backoff_factor="10ms"
--resources="cpus:2;gpus:0;mem:1024;disk:1024;ports:[31000-32000]" --revocable_cpu_low_priority="true"
--runtime_dir="/tmp/Endpoint_SlaveEndpointTest_UnauthorizedRequest_2_tiaUXz" --sandbox_directory="/mnt/mesos/sandbox"
--strict="true" --switch_user="true" --systemd_enable_support="true" --systemd_runtime_directory="/run/systemd/system"
--version="false" --work_dir="/tmp/Endpoint_SlaveEndpointTest_UnauthorizedRequest_2_lrpT5N"
I0803 18:03:54.584071  6472 credentials.hpp:86] Loading credential for authentication from
'/tmp/Endpoint_SlaveEndpointTest_UnauthorizedRequest_2_tiaUXz/credential'
I0803 18:03:54.584237  6472 slave.cpp:283] Agent using credential for: test-principal
I0803 18:03:54.584261  6472 credentials.hpp:37] Loading credentials for authentication from
'/tmp/Endpoint_SlaveEndpointTest_UnauthorizedRequest_2_tiaUXz/http_credentials'
I0803 18:03:54.584516  6472 http.cpp:1026] Creating default 'basic' HTTP authenticator for
realm 'mesos-agent-readonly'
I0803 18:03:54.584712  6472 http.cpp:1026] Creating default 'basic' HTTP authenticator for
realm 'mesos-agent-readwrite'
I0803 18:03:54.586189  6472 slave.cpp:565] Agent resources: [{"name":"cpus","scalar":{"value":2.0},"type":"SCALAR"},{"name":"mem","scalar":{"value":1024.0},"type":"SCALAR"},{"name":"disk","scalar":{"value":1024.0},"type":"SCALAR"},{"name":"ports","ranges":{"range":[{"begin":31000,"end":32000}]},"type":"RANGES"}]
I0803 18:03:54.586433  6472 slave.cpp:573] Agent attributes: [  ]
I0803 18:03:54.586448  6472 slave.cpp:582] Agent hostname: 8465ccf114ec
I0803 18:03:54.586580  6471 status_update_manager.cpp:177] Pausing sending status updates
I0803 18:03:54.588270  6451 state.cpp:64] Recovering state from '/tmp/Endpoint_SlaveEndpointTest_UnauthorizedRequest_2_lrpT5N/meta'
I0803 18:03:54.588780  6460 status_update_manager.cpp:203] Recovering status update manager
I0803 18:03:54.589002  6470 containerizer.cpp:598] Recovering containerizer
I0803 18:03:54.590857  6466 provisioner.cpp:416] Provisioner recovery complete
I0803 18:03:54.591341  6450 slave.cpp:6207] Finished recovery
I0803 18:03:54.591974  6450 slave.cpp:6389] Querying resource estimator for oversubscribable
resources
I0803 18:03:54.592341  6468 slave.cpp:6403] Received oversubscribable resources {} from the
resource estimator
I0803 18:03:54.596173  6452 process.cpp:3938] Handling HTTP event for process 'slave(797)'
with path: '/slave(797)/containers'
I0803 18:03:54.598114  6449 http.cpp:1166] HTTP GET for /slave(797)/containers from 172.17.0.11:38036
I0803 18:03:54.598273  6449 http.cpp:957] Authorizing principal 'test-principal' to GET the
'/containers' endpoint
I0803 18:03:54.600880  6455 slave.cpp:843] Agent terminating
[       OK ] Endpoint/SlaveEndpointTest.UnauthorizedRequest/2 (39 ms)
[ RUN      ] Endpoint/SlaveEndpointTest.NoAuthorizer/0
I0803 18:03:54.619390  6430 containerizer.cpp:246] Using isolation: posix/cpu,posix/mem,filesystem/posix,network/cni,environment_secret
W0803 18:03:54.620245  6430 backend.cpp:76] Failed to create 'aufs' backend: AufsBackend requires
root privileges
W0803 18:03:54.620404  6430 backend.cpp:76] Failed to create 'bind' backend: BindBackend requires
root privileges
I0803 18:03:54.620450  6430 provisioner.cpp:255] Using default backend 'copy'
I0803 18:03:54.623100  6430 cluster.cpp:448] Creating default 'local' authorizer
I0803 18:03:54.625778  6468 slave.cpp:250] Mesos agent started on (798)@172.17.0.11:44560
I0803 18:03:54.625808  6468 slave.cpp:251] Flags at startup: --acls="" --appc_simple_discovery_uri_prefix="http://"
--appc_store_dir="/tmp/Endpoint_SlaveEndpointTest_NoAuthorizer_0_pPJrLF/store/appc" --authenticate_http_readonly="true"
--authenticate_http_readwrite="true" --authenticatee="crammd5" --authentication_backoff_factor="1secs"
--authorizer="local" --cgroups_cpu_enable_pids_and_tids_count="false" --cgroups_enable_cfs="false"
--cgroups_hierarchy="/sys/fs/cgroup" --cgroups_limit_swap="false" --cgroups_root="mesos" --container_disk_watch_interval="15secs"
--containerizers="mesos" --credential="/tmp/Endpoint_SlaveEndpointTest_NoAuthorizer_0_pPJrLF/credential"
--default_role="*" --disk_watch_interval="1mins" --docker="docker" --docker_kill_orphans="true"
--docker_registry="https://registry-1.docker.io" --docker_remove_delay="6hrs" --docker_socket="/var/run/docker.sock"
--docker_stop_timeout="0ns" --docker_store_dir="/tmp/Endpoint_SlaveEndpointTest_NoAuthorizer_0_pPJrLF/store/docker"
--docker_volume_checkpoint_dir="/var/run/mesos/isolators/docker/volume" --enforce_container_disk_quota="false"
--executor_registration_timeout="1mins" --executor_reregistration_timeout="2secs" --executor_shutdown_grace_period="5secs"
--fetcher_cache_dir="/tmp/Endpoint_SlaveEndpointTest_NoAuthorizer_0_pPJrLF/fetch" --fetcher_cache_size="2GB"
--frameworks_home="" --gc_delay="1weeks" --gc_disk_headroom="0.1" --hadoop_home="" --help="false"
--hostname_lookup="true" --http_command_executor="false" --http_credentials="/tmp/Endpoint_SlaveEndpointTest_NoAuthorizer_0_pPJrLF/http_credentials"
--http_heartbeat_interval="30secs" --initialize_driver_logging="true" --isolation="posix/cpu,posix/mem"
--launcher="posix" --launcher_dir="/mesos/mesos-1.4.0/_build/src" --logbufsecs="0" --logging_level="INFO"
--max_completed_executors_per_framework="150" --oversubscribed_resources_interval="15secs"
--perf_duration="10secs" --perf_interval="1mins" --port="5051" --qos_correction_interval_min="0ns"
--quiet="false" --recover="reconnect" --recovery_timeout="15mins" --registration_backoff_factor="10ms"
--resources="cpus:2;gpus:0;mem:1024;disk:1024;ports:[31000-32000]" --revocable_cpu_low_priority="true"
--runtime_dir="/tmp/Endpoint_SlaveEndpointTest_NoAuthorizer_0_pPJrLF" --sandbox_directory="/mnt/mesos/sandbox"
--strict="true" --switch_user="true" --systemd_enable_support="true" --systemd_runtime_directory="/run/systemd/system"
--version="false" --work_dir="/tmp/Endpoint_SlaveEndpointTest_NoAuthorizer_0_vAAzNT"
I0803 18:03:54.626303  6468 credentials.hpp:86] Loading credential for authentication from
'/tmp/Endpoint_SlaveEndpointTest_NoAuthorizer_0_pPJrLF/credential'
I0803 18:03:54.626559  6468 slave.cpp:283] Agent using credential for: test-principal
I0803 18:03:54.626583  6468 credentials.hpp:37] Loading credentials for authentication from
'/tmp/Endpoint_SlaveEndpointTest_NoAuthorizer_0_pPJrLF/http_credentials'
I0803 18:03:54.626899  6468 http.cpp:1026] Creating default 'basic' HTTP authenticator for
realm 'mesos-agent-readonly'
I0803 18:03:54.627089  6468 http.cpp:1026] Creating default 'basic' HTTP authenticator for
realm 'mesos-agent-readwrite'
I0803 18:03:54.628633  6468 slave.cpp:565] Agent resources: [{"name":"cpus","scalar":{"value":2.0},"type":"SCALAR"},{"name":"mem","scalar":{"value":1024.0},"type":"SCALAR"},{"name":"disk","scalar":{"value":1024.0},"type":"SCALAR"},{"name":"ports","ranges":{"range":[{"begin":31000,"end":32000}]},"type":"RANGES"}]
I0803 18:03:54.628888  6468 slave.cpp:573] Agent attributes: [  ]
I0803 18:03:54.628906  6468 slave.cpp:582] Agent hostname: 8465ccf114ec
I0803 18:03:54.629068  6454 status_update_manager.cpp:177] Pausing sending status updates
I0803 18:03:54.631022  6450 state.cpp:64] Recovering state from '/tmp/Endpoint_SlaveEndpointTest_NoAuthorizer_0_vAAzNT/meta'
I0803 18:03:54.631407  6458 status_update_manager.cpp:203] Recovering status update manager
I0803 18:03:54.631656  6464 containerizer.cpp:598] Recovering containerizer
I0803 18:03:54.633673  6456 provisioner.cpp:416] Provisioner recovery complete
I0803 18:03:54.634079  6472 slave.cpp:6207] Finished recovery
I0803 18:03:54.634712  6472 slave.cpp:6389] Querying resource estimator for oversubscribable
resources
I0803 18:03:54.635021  6453 slave.cpp:6403] Received oversubscribable resources {} from the
resource estimator
I0803 18:03:54.638591  6449 process.cpp:3938] Handling HTTP event for process 'slave(798)'
with path: '/slave(798)/monitor/statistics'
I0803 18:03:54.640065  6450 http.cpp:1166] HTTP GET for /slave(798)/monitor/statistics from
172.17.0.11:38038
I0803 18:03:54.640156  6450 http.cpp:957] Authorizing principal 'test-principal' to GET the
'/monitor/statistics' endpoint
I0803 18:03:54.644311  6430 slave.cpp:843] Agent terminating
[       OK ] Endpoint/SlaveEndpointTest.NoAuthorizer/0 (40 ms)
[ RUN      ] Endpoint/SlaveEndpointTest.NoAuthorizer/1
I0803 18:03:54.660434  6430 containerizer.cpp:246] Using isolation: posix/cpu,posix/mem,filesystem/posix,network/cni,environment_secret
W0803 18:03:54.661352  6430 backend.cpp:76] Failed to create 'aufs' backend: AufsBackend requires
root privileges
W0803 18:03:54.661571  6430 backend.cpp:76] Failed to create 'bind' backend: BindBackend requires
root privileges
I0803 18:03:54.661641  6430 provisioner.cpp:255] Using default backend 'copy'
I0803 18:03:54.664641  6430 cluster.cpp:448] Creating default 'local' authorizer
I0803 18:03:54.666760  6460 slave.cpp:250] Mesos agent started on (799)@172.17.0.11:44560
I0803 18:03:54.666790  6460 slave.cpp:251] Flags at startup: --acls="" --appc_simple_discovery_uri_prefix="http://"
--appc_store_dir="/tmp/Endpoint_SlaveEndpointTest_NoAuthorizer_1_n0P8WL/store/appc" --authenticate_http_readonly="true"
--authenticate_http_readwrite="true" --authenticatee="crammd5" --authentication_backoff_factor="1secs"
--authorizer="local" --cgroups_cpu_enable_pids_and_tids_count="false" --cgroups_enable_cfs="false"
--cgroups_hierarchy="/sys/fs/cgroup" --cgroups_limit_swap="false" --cgroups_root="mesos" --container_disk_watch_interval="15secs"
--containerizers="mesos" --credential="/tmp/Endpoint_SlaveEndpointTest_NoAuthorizer_1_n0P8WL/credential"
--default_role="*" --disk_watch_interval="1mins" --docker="docker" --docker_kill_orphans="true"
--docker_registry="https://registry-1.docker.io" --docker_remove_delay="6hrs" --docker_socket="/var/run/docker.sock"
--docker_stop_timeout="0ns" --docker_store_dir="/tmp/Endpoint_SlaveEndpointTest_NoAuthorizer_1_n0P8WL/store/docker"
--docker_volume_checkpoint_dir="/var/run/mesos/isolators/docker/volume" --enforce_container_disk_quota="false"
--executor_registration_timeout="1mins" --executor_reregistration_timeout="2secs" --executor_shutdown_grace_period="5secs"
--fetcher_cache_dir="/tmp/Endpoint_SlaveEndpointTest_NoAuthorizer_1_n0P8WL/fetch" --fetcher_cache_size="2GB"
--frameworks_home="" --gc_delay="1weeks" --gc_disk_headroom="0.1" --hadoop_home="" --help="false"
--hostname_lookup="true" --http_command_executor="false" --http_credentials="/tmp/Endpoint_SlaveEndpointTest_NoAuthorizer_1_n0P8WL/http_credentials"
--http_heartbeat_interval="30secs" --initialize_driver_logging="true" --isolation="posix/cpu,posix/mem"
--launcher="posix" --launcher_dir="/mesos/mesos-1.4.0/_build/src" --logbufsecs="0" --logging_level="INFO"
--max_completed_executors_per_framework="150" --oversubscribed_resources_interval="15secs"
--perf_duration="10secs" --perf_interval="1mins" --port="5051" --qos_correction_interval_min="0ns"
--quiet="false" --recover="reconnect" --recovery_timeout="15mins" --registration_backoff_factor="10ms"
--resources="cpus:2;gpus:0;mem:1024;disk:1024;ports:[31000-32000]" --revocable_cpu_low_priority="true"
--runtime_dir="/tmp/Endpoint_SlaveEndpointTest_NoAuthorizer_1_n0P8WL" --sandbox_directory="/mnt/mesos/sandbox"
--strict="true" --switch_user="true" --systemd_enable_support="true" --systemd_runtime_directory="/run/systemd/system"
--version="false" --work_dir="/tmp/Endpoint_SlaveEndpointTest_NoAuthorizer_1_Vp9kTZ"
I0803 18:03:54.667206  6460 credentials.hpp:86] Loading credential for authentication from
'/tmp/Endpoint_SlaveEndpointTest_NoAuthorizer_1_n0P8WL/credential'
I0803 18:03:54.667389  6460 slave.cpp:283] Agent using credential for: test-principal
I0803 18:03:54.667412  6460 credentials.hpp:37] Loading credentials for authentication from
'/tmp/Endpoint_SlaveEndpointTest_NoAuthorizer_1_n0P8WL/http_credentials'
I0803 18:03:54.667671  6460 http.cpp:1026] Creating default 'basic' HTTP authenticator for
realm 'mesos-agent-readonly'
I0803 18:03:54.667848  6460 http.cpp:1026] Creating default 'basic' HTTP authenticator for
realm 'mesos-agent-readwrite'
I0803 18:03:54.669522  6460 slave.cpp:565] Agent resources: [{"name":"cpus","scalar":{"value":2.0},"type":"SCALAR"},{"name":"mem","scalar":{"value":1024.0},"type":"SCALAR"},{"name":"disk","scalar":{"value":1024.0},"type":"SCALAR"},{"name":"ports","ranges":{"range":[{"begin":31000,"end":32000}]},"type":"RANGES"}]
I0803 18:03:54.669952  6460 slave.cpp:573] Agent attributes: [  ]
I0803 18:03:54.669991  6460 slave.cpp:582] Agent hostname: 8465ccf114ec
I0803 18:03:54.670181  6470 status_update_manager.cpp:177] Pausing sending status updates
I0803 18:03:54.672457  6469 state.cpp:64] Recovering state from '/tmp/Endpoint_SlaveEndpointTest_NoAuthorizer_1_Vp9kTZ/meta'
I0803 18:03:54.672900  6462 status_update_manager.cpp:203] Recovering status update manager
I0803 18:03:54.673142  6461 containerizer.cpp:598] Recovering containerizer
I0803 18:03:54.675144  6457 provisioner.cpp:416] Provisioner recovery complete
I0803 18:03:54.675611  6460 slave.cpp:6207] Finished recovery
I0803 18:03:54.676101  6460 slave.cpp:6389] Querying resource estimator for oversubscribable
resources
I0803 18:03:54.676399  6466 slave.cpp:6403] Received oversubscribable resources {} from the
resource estimator
I0803 18:03:54.680625  6465 process.cpp:3938] Handling HTTP event for process 'slave(799)'
with path: '/slave(799)/monitor/statistics.json'
I0803 18:03:54.682430  6472 http.cpp:1166] HTTP GET for /slave(799)/monitor/statistics.json
from 172.17.0.11:38042
I0803 18:03:54.682513  6472 http.cpp:957] Authorizing principal 'test-principal' to GET the
'/monitor/statistics.json' endpoint
I0803 18:03:54.686199  6466 slave.cpp:843] Agent terminating
[       OK ] Endpoint/SlaveEndpointTest.NoAuthorizer/1 (40 ms)
[ RUN      ] Endpoint/SlaveEndpointTest.NoAuthorizer/2
I0803 18:03:54.697788  6430 containerizer.cpp:246] Using isolation: posix/cpu,posix/mem,filesystem/posix,network/cni,environment_secret
W0803 18:03:54.698302  6430 backend.cpp:76] Failed to create 'aufs' backend: AufsBackend requires
root privileges
W0803 18:03:54.698415  6430 backend.cpp:76] Failed to create 'bind' backend: BindBackend requires
root privileges
I0803 18:03:54.698451  6430 provisioner.cpp:255] Using default backend 'copy'
I0803 18:03:54.700232  6430 cluster.cpp:448] Creating default 'local' authorizer
I0803 18:03:54.702425  6454 slave.cpp:250] Mesos agent started on (800)@172.17.0.11:44560
I0803 18:03:54.702492  6454 slave.cpp:251] Flags at startup: --acls="" --appc_simple_discovery_uri_prefix="http://"
--appc_store_dir="/tmp/Endpoint_SlaveEndpointTest_NoAuthorizer_2_VOAXwS/store/appc" --authenticate_http_readonly="true"
--authenticate_http_readwrite="true" --authenticatee="crammd5" --authentication_backoff_factor="1secs"
--authorizer="local" --cgroups_cpu_enable_pids_and_tids_count="false" --cgroups_enable_cfs="false"
--cgroups_hierarchy="/sys/fs/cgroup" --cgroups_limit_swap="false" --cgroups_root="mesos" --container_disk_watch_interval="15secs"
--containerizers="mesos" --credential="/tmp/Endpoint_SlaveEndpointTest_NoAuthorizer_2_VOAXwS/credential"
--default_role="*" --disk_watch_interval="1mins" --docker="docker" --docker_kill_orphans="true"
--docker_registry="https://registry-1.docker.io" --docker_remove_delay="6hrs" --docker_socket="/var/run/docker.sock"
--docker_stop_timeout="0ns" --docker_store_dir="/tmp/Endpoint_SlaveEndpointTest_NoAuthorizer_2_VOAXwS/store/docker"
--docker_volume_checkpoint_dir="/var/run/mesos/isolators/docker/volume" --enforce_container_disk_quota="false"
--executor_registration_timeout="1mins" --executor_reregistration_timeout="2secs" --executor_shutdown_grace_period="5secs"
--fetcher_cache_dir="/tmp/Endpoint_SlaveEndpointTest_NoAuthorizer_2_VOAXwS/fetch" --fetcher_cache_size="2GB"
--frameworks_home="" --gc_delay="1weeks" --gc_disk_headroom="0.1" --hadoop_home="" --help="false"
--hostname_lookup="true" --http_command_executor="false" --http_credentials="/tmp/Endpoint_SlaveEndpointTest_NoAuthorizer_2_VOAXwS/http_credentials"
--http_heartbeat_interval="30secs" --initialize_driver_logging="true" --isolation="posix/cpu,posix/mem"
--launcher="posix" --launcher_dir="/mesos/mesos-1.4.0/_build/src" --logbufsecs="0" --logging_level="INFO"
--max_completed_executors_per_framework="150" --oversubscribed_resources_interval="15secs"
--perf_duration="10secs" --perf_interval="1mins" --port="5051" --qos_correction_interval_min="0ns"
--quiet="false" --recover="reconnect" --recovery_timeout="15mins" --registration_backoff_factor="10ms"
--resources="cpus:2;gpus:0;mem:1024;disk:1024;ports:[31000-32000]" --revocable_cpu_low_priority="true"
--runtime_dir="/tmp/Endpoint_SlaveEndpointTest_NoAuthorizer_2_VOAXwS" --sandbox_directory="/mnt/mesos/sandbox"
--strict="true" --switch_user="true" --systemd_enable_support="true" --systemd_runtime_directory="/run/systemd/system"
--version="false" --work_dir="/tmp/Endpoint_SlaveEndpointTest_NoAuthorizer_2_nnjen6"
I0803 18:03:54.703130  6454 credentials.hpp:86] Loading credential for authentication from
'/tmp/Endpoint_SlaveEndpointTest_NoAuthorizer_2_VOAXwS/credential'
I0803 18:03:54.703454  6454 slave.cpp:283] Agent using credential for: test-principal
I0803 18:03:54.703510  6454 credentials.hpp:37] Loading credentials for authentication from
'/tmp/Endpoint_SlaveEndpointTest_NoAuthorizer_2_VOAXwS/http_credentials'
I0803 18:03:54.703883  6454 http.cpp:1026] Creating default 'basic' HTTP authenticator for
realm 'mesos-agent-readonly'
I0803 18:03:54.704109  6454 http.cpp:1026] Creating default 'basic' HTTP authenticator for
realm 'mesos-agent-readwrite'
I0803 18:03:54.706145  6454 slave.cpp:565] Agent resources: [{"name":"cpus","scalar":{"value":2.0},"type":"SCALAR"},{"name":"mem","scalar":{"value":1024.0},"type":"SCALAR"},{"name":"disk","scalar":{"value":1024.0},"type":"SCALAR"},{"name":"ports","ranges":{"range":[{"begin":31000,"end":32000}]},"type":"RANGES"}]
I0803 18:03:54.706583  6454 slave.cpp:573] Agent attributes: [  ]
I0803 18:03:54.706670  6454 slave.cpp:582] Agent hostname: 8465ccf114ec
I0803 18:03:54.706926  6471 status_update_manager.cpp:177] Pausing sending status updates
I0803 18:03:54.709341  6466 state.cpp:64] Recovering state from '/tmp/Endpoint_SlaveEndpointTest_NoAuthorizer_2_nnjen6/meta'
I0803 18:03:54.709708  6449 status_update_manager.cpp:203] Recovering status update manager
I0803 18:03:54.709997  6450 containerizer.cpp:598] Recovering containerizer
I0803 18:03:54.711894  6464 provisioner.cpp:416] Provisioner recovery complete
I0803 18:03:54.712309  6460 slave.cpp:6207] Finished recovery
I0803 18:03:54.712921  6460 slave.cpp:6389] Querying resource estimator for oversubscribable
resources
I0803 18:03:54.713233  6470 slave.cpp:6403] Received oversubscribable resources {} from the
resource estimator
I0803 18:03:54.716720  6463 process.cpp:3938] Handling HTTP event for process 'slave(800)'
with path: '/slave(800)/containers'
I0803 18:03:54.718384  6449 http.cpp:1166] HTTP GET for /slave(800)/containers from 172.17.0.11:38044
I0803 18:03:54.718485  6449 http.cpp:957] Authorizing principal 'test-principal' to GET the
'/containers' endpoint
I0803 18:03:54.722903  6470 slave.cpp:843] Agent terminating
[       OK ] Endpoint/SlaveEndpointTest.NoAuthorizer/2 (37 ms)
[----------] 9 tests from Endpoint/SlaveEndpointTest (328 ms total)

[----------] 2 tests from ContainerizerType/DefaultContainerDNSFlagTest
[ RUN      ] ContainerizerType/DefaultContainerDNSFlagTest.ValidateFlag/0
[       OK ] ContainerizerType/DefaultContainerDNSFlagTest.ValidateFlag/0 (11 ms)
[ RUN      ] ContainerizerType/DefaultContainerDNSFlagTest.ValidateFlag/1
[       OK ] ContainerizerType/DefaultContainerDNSFlagTest.ValidateFlag/1 (10 ms)
[----------] 2 tests from ContainerizerType/DefaultContainerDNSFlagTest (21 ms total)

[----------] Global test environment tear-down
[==========] 1650 tests from 182 test cases ran. (547656 ms total)
[  PASSED  ] 1649 tests.
[  FAILED  ] 1 test, listed below:
[  FAILED  ] DefaultExecutorCheckTest.CommandCheckDeliveredAndReconciled

 1 FAILED TEST
  YOU HAVE 20 DISABLED TESTS

I0803 18:03:54.814040  6473 process.cpp:1072] Failed to accept socket: future discarded
make[4]: *** [check-local] Error 1
make[4]: Leaving directory `/mesos/mesos-1.4.0/_build/src'
make[3]: *** [check-am] Error 2
make[3]: Leaving directory `/mesos/mesos-1.4.0/_build/src'
make[2]: *** [check] Error 2
make[2]: Leaving directory `/mesos/mesos-1.4.0/_build/src'
make[1]: *** [check-recursive] Error 1
make[1]: Leaving directory `/mesos/mesos-1.4.0/_build'
make: *** [distcheck] Error 1
+ docker rmi mesos-1501780693-22941
Untagged: mesos-1501780693-22941:latest
Deleted: sha256:f11b9a05e9d7850a45057dc800ba51d81a15a082070e020fadf1b1ce7ccd1d47
Deleted: sha256:eb90f116f050e3179910021cce9600bd813cb2ce84a5c1d79f8e3d576b1c9912
Deleted: sha256:b4c9f6b22df61a0e02c7d9f384479108e5964cd7b964ca186d7bef9259f31749
Deleted: sha256:07f6b8fb576c2b4538bfeed79e05ba4cffdd8e5de73253a168eef09f3caa963d
Deleted: sha256:a750596a0097bd6d3ac48e9ae24b5659bccb81cc404e4025cc2aa9dc09df2acd
Deleted: sha256:717f4a0bb594b024c4a51be1135fd60cb79e8d0b88ad6e5eaa9c0da38a86c15b
Deleted: sha256:c9f658e28dffcd836e0fd7a4308d154fd67b568242d570b47c020dfe901ce893
Deleted: sha256:aa68490c384e9b33398db67404d755378fd263e4d0a6aee8e9aa86b614241435
Deleted: sha256:808451df585a0417ca3f7586c160296f752047d8a530210cc0877311dbe23758
Deleted: sha256:87bc07893b5f0572c52340c41713a4abc04a7d4c54af312ca2cf5e96c50e963a
Deleted: sha256:8e17e8383bbcf92022d358d628094a40cd9c8529500cc235bd46256f759d8d4d
Deleted: sha256:6cccef766e1b5ff8b2963be5d00f81c588e9be3c2acfd786e5ece648cc19ebe8
Deleted: sha256:5a211f083ba949fa3cae0a7f731f041a28fc86a03e384ed292a670b56b6eb618
Deleted: sha256:5130d84fd3ae1a0cac781133bc68cb2d0f3419c34a7ec951e3285146dc7e4b9a
Deleted: sha256:50292192b0cc87f421575574faef3815487cde658af272bc568070eafb45d6b6
Deleted: sha256:bc9ada832055d3229c941fbd09376203da3509d75beaee21a125370c3634eb17
Deleted: sha256:f808ee3fa4cb2e2661fae0f05896a017339ce3da2f352422b81008525913691c
Deleted: sha256:ec222a692e1e42c6c6620d1c95ea07e0b8623c24b956c7941dacd16b1fd94948
Deleted: sha256:6ab7a0275ff3411c65ab4193a1cae969b8075b44072029512d499ee4b90f7260
Deleted: sha256:6e5da99318774dbe33ce95e78e7a7f0cafea9a171c97f334bdffb50787317a20
Deleted: sha256:7a65c8f62a9f357f1a8d70f8551ec35f57ee92ea167912cae6e344784ecead37
Deleted: sha256:ab16fd4ba390b231b72777a769302b8a8046bae5efec0f1ee1e78c6460e019d9
Deleted: sha256:ad778520e19f34c2351dbd143ca4d160c397c14172c2da06d977b755ff35b48a
Deleted: sha256:cf3e542cda5fbf0d9a76df642c6aac0c61a4176be6cb3fec05cac424a6797e6d
Deleted: sha256:091129f74ff1056c24f54af7cac14c519a9496c99a2940b58af91c8f3e22b2f3
Build step 'Execute shell' marked build as failure
Not sending mail to unregistered user zhq527725@gmail.com
Not sending mail to unregistered user songzihao1990@gmail.com
Not sending mail to unregistered user gregorywmann@gmail.com
Not sending mail to unregistered user benjamin.hindman@gmail.com
Not sending mail to unregistered user xujyan@apple.com

Mime
View raw message