mesos-builds mailing list archives

Site index · List index
Message view « Date » · « Thread »
Top « Date » · « Thread »
From Apache Jenkins Server <jenk...@builds.apache.org>
Subject Build failed in Jenkins: Mesos-Buildbot » autotools,gcc,--verbose --enable-libevent --enable-ssl,GLOG_v=1 MESOS_VERBOSE=1,centos:7,(ubuntu)&&(!ubuntu-us1)&&(!ubuntu-eu2) #4156
Date Fri, 25 Aug 2017 15:48:45 GMT
See <https://builds.apache.org/job/Mesos-Buildbot/BUILDTOOL=autotools,COMPILER=gcc,CONFIGURATION=--verbose%20--enable-libevent%20--enable-ssl,ENVIRONMENT=GLOG_v=1%20MESOS_VERBOSE=1,OS=centos%3A7,label_exp=(ubuntu)&&(!ubuntu-us1)&&(!ubuntu-eu2)/4156/display/redirect?page=changes>

Changes:

[zhq527725] Updated docker executor to return IPv6 address of a container.

[zhq527725] Added test filter for docker user network tests.

[zhq527725] Added a test for IPv6 containers on docker user networks.

------------------------------------------
[...truncated 32.27 MB...]
I0825 15:48:34.048377  9567 provisioner.cpp:255] Using default backend 'copy'
I0825 15:48:34.051834 30473 slave.cpp:252] Mesos agent started on (806)@172.17.0.3:45823
I0825 15:48:34.051856 30473 slave.cpp:253] Flags at startup: --acls="" --appc_simple_discovery_uri_prefix="http://"
--appc_store_dir="/tmp/Endpoint_SlaveEndpointTest_UnauthorizedRequest_0_UYT1eS/store/appc"
--authenticate_http_executors="true" --authenticate_http_readonly="true" --authenticate_http_readwrite="true"
--authenticatee="crammd5" --authentication_backoff_factor="1secs" --authorizer="local" --cgroups_cpu_enable_pids_and_tids_count="false"
--cgroups_enable_cfs="false" --cgroups_hierarchy="/sys/fs/cgroup" --cgroups_limit_swap="false"
--cgroups_root="mesos" --container_disk_watch_interval="15secs" --containerizers="mesos" --credential="/tmp/Endpoint_SlaveEndpointTest_UnauthorizedRequest_0_UYT1eS/credential"
--default_role="*" --disallow_sharing_agent_pid_namespace="false" --disk_watch_interval="1mins"
--docker="docker" --docker_kill_orphans="true" --docker_registry="https://registry-1.docker.io"
--docker_remove_delay="6hrs" --docker_socket="/var/run/docker.sock" --docker_stop_timeout="0ns"
--docker_store_dir="/tmp/Endpoint_SlaveEndpointTest_UnauthorizedRequest_0_UYT1eS/store/docker"
--docker_volume_checkpoint_dir="/var/run/mesos/isolators/docker/volume" --enforce_container_disk_quota="false"
--executor_registration_timeout="1mins" --executor_reregistration_timeout="2secs" --executor_secret_key="/tmp/Endpoint_SlaveEndpointTest_UnauthorizedRequest_0_UYT1eS/executor_secret_key"
--executor_shutdown_grace_period="5secs" --fetcher_cache_dir="/tmp/Endpoint_SlaveEndpointTest_UnauthorizedRequest_0_UYT1eS/fetch"
--fetcher_cache_size="2GB" --frameworks_home="" --gc_delay="1weeks" --gc_disk_headroom="0.1"
--hadoop_home="" --help="false" --hostname_lookup="true" --http_command_executor="false" --http_credentials="/tmp/Endpoint_SlaveEndpointTest_UnauthorizedRequest_0_UYT1eS/http_credentials"
--http_heartbeat_interval="30secs" --initialize_driver_logging="true" --isolation="posix/cpu,posix/mem"
--launcher="posix" --launcher_dir="/mesos/mesos-1.5.0/_build/src" --logbufsecs="0" --logging_level="INFO"
--max_completed_executors_per_framework="150" --oversubscribed_resources_interval="15secs"
--perf_duration="10secs" --perf_interval="1mins" --port="5051" --qos_correction_interval_min="0ns"
--quiet="false" --recover="reconnect" --recovery_timeout="15mins" --registration_backoff_factor="10ms"
--resources="cpus:2;gpus:0;mem:1024;disk:1024;ports:[31000-32000]" --revocable_cpu_low_priority="true"
--runtime_dir="/tmp/Endpoint_SlaveEndpointTest_UnauthorizedRequest_0_UYT1eS" --sandbox_directory="/mnt/mesos/sandbox"
--strict="true" --switch_user="true" --systemd_enable_support="true" --systemd_runtime_directory="/run/systemd/system"
--version="false" --work_dir="/tmp/Endpoint_SlaveEndpointTest_UnauthorizedRequest_0_jBWDbF"
I0825 15:48:34.052292 30473 credentials.hpp:86] Loading credential for authentication from
'/tmp/Endpoint_SlaveEndpointTest_UnauthorizedRequest_0_UYT1eS/credential'
I0825 15:48:34.052462 30473 slave.cpp:285] Agent using credential for: test-principal
I0825 15:48:34.052482 30473 credentials.hpp:37] Loading credentials for authentication from
'/tmp/Endpoint_SlaveEndpointTest_UnauthorizedRequest_0_UYT1eS/http_credentials'
I0825 15:48:34.052769 30473 http.cpp:1026] Creating default 'basic' HTTP authenticator for
realm 'mesos-agent-executor'
I0825 15:48:34.052901 30473 http.cpp:1047] Creating default 'jwt' HTTP authenticator for realm
'mesos-agent-executor'
I0825 15:48:34.053108 30473 http.cpp:1026] Creating default 'basic' HTTP authenticator for
realm 'mesos-agent-readonly'
I0825 15:48:34.053231 30473 http.cpp:1047] Creating default 'jwt' HTTP authenticator for realm
'mesos-agent-readonly'
I0825 15:48:34.053422 30473 http.cpp:1026] Creating default 'basic' HTTP authenticator for
realm 'mesos-agent-readwrite'
I0825 15:48:34.053517 30473 http.cpp:1047] Creating default 'jwt' HTTP authenticator for realm
'mesos-agent-readwrite'
I0825 15:48:34.054926 30473 slave.cpp:581] Agent resources: [{"name":"cpus","scalar":{"value":2.0},"type":"SCALAR"},{"name":"mem","scalar":{"value":1024.0},"type":"SCALAR"},{"name":"disk","scalar":{"value":1024.0},"type":"SCALAR"},{"name":"ports","ranges":{"range":[{"begin":31000,"end":32000}]},"type":"RANGES"}]
I0825 15:48:34.055155 30473 slave.cpp:589] Agent attributes: [  ]
I0825 15:48:34.055171 30473 slave.cpp:598] Agent hostname: 7be7609aef65
I0825 15:48:34.055320 30483 status_update_manager.cpp:177] Pausing sending status updates
I0825 15:48:34.056769 30475 state.cpp:64] Recovering state from '/tmp/Endpoint_SlaveEndpointTest_UnauthorizedRequest_0_jBWDbF/meta'
I0825 15:48:34.057035 30478 status_update_manager.cpp:203] Recovering status update manager
I0825 15:48:34.057231 30465 containerizer.cpp:643] Recovering containerizer
I0825 15:48:34.058655 30487 provisioner.cpp:416] Provisioner recovery complete
I0825 15:48:34.059012 30473 slave.cpp:6264] Finished recovery
I0825 15:48:34.059465 30473 slave.cpp:6446] Querying resource estimator for oversubscribable
resources
I0825 15:48:34.059679 30486 slave.cpp:6460] Received oversubscribable resources {} from the
resource estimator
I0825 15:48:34.061668 30476 process.cpp:3933] Handling HTTP event for process 'slave(806)'
with path: '/slave(806)/monitor/statistics'
I0825 15:48:34.063304 30471 http.cpp:1166] HTTP GET for /slave(806)/monitor/statistics from
172.17.0.3:50660
I0825 15:48:34.063374 30471 http.cpp:957] Authorizing principal 'test-principal' to GET the
'/monitor/statistics' endpoint
I0825 15:48:34.065461  9567 slave.cpp:859] Agent terminating
[       OK ] Endpoint/SlaveEndpointTest.UnauthorizedRequest/0 (29 ms)
[ RUN      ] Endpoint/SlaveEndpointTest.UnauthorizedRequest/1
I0825 15:48:34.076772  9567 containerizer.cpp:288] Using isolation { environment_secret, posix/cpu,
posix/mem, filesystem/posix, network/cni }
W0825 15:48:34.077258  9567 backend.cpp:76] Failed to create 'aufs' backend: AufsBackend requires
root privileges
W0825 15:48:34.077369  9567 backend.cpp:76] Failed to create 'bind' backend: BindBackend requires
root privileges
I0825 15:48:34.077401  9567 provisioner.cpp:255] Using default backend 'copy'
I0825 15:48:34.081081 30473 slave.cpp:252] Mesos agent started on (807)@172.17.0.3:45823
I0825 15:48:34.081101 30473 slave.cpp:253] Flags at startup: --acls="" --appc_simple_discovery_uri_prefix="http://"
--appc_store_dir="/tmp/Endpoint_SlaveEndpointTest_UnauthorizedRequest_1_y0kgHI/store/appc"
--authenticate_http_executors="true" --authenticate_http_readonly="true" --authenticate_http_readwrite="true"
--authenticatee="crammd5" --authentication_backoff_factor="1secs" --authorizer="local" --cgroups_cpu_enable_pids_and_tids_count="false"
--cgroups_enable_cfs="false" --cgroups_hierarchy="/sys/fs/cgroup" --cgroups_limit_swap="false"
--cgroups_root="mesos" --container_disk_watch_interval="15secs" --containerizers="mesos" --credential="/tmp/Endpoint_SlaveEndpointTest_UnauthorizedRequest_1_y0kgHI/credential"
--default_role="*" --disallow_sharing_agent_pid_namespace="false" --disk_watch_interval="1mins"
--docker="docker" --docker_kill_orphans="true" --docker_registry="https://registry-1.docker.io"
--docker_remove_delay="6hrs" --docker_socket="/var/run/docker.sock" --docker_stop_timeout="0ns"
--docker_store_dir="/tmp/Endpoint_SlaveEndpointTest_UnauthorizedRequest_1_y0kgHI/store/docker"
--docker_volume_checkpoint_dir="/var/run/mesos/isolators/docker/volume" --enforce_container_disk_quota="false"
--executor_registration_timeout="1mins" --executor_reregistration_timeout="2secs" --executor_secret_key="/tmp/Endpoint_SlaveEndpointTest_UnauthorizedRequest_1_y0kgHI/executor_secret_key"
--executor_shutdown_grace_period="5secs" --fetcher_cache_dir="/tmp/Endpoint_SlaveEndpointTest_UnauthorizedRequest_1_y0kgHI/fetch"
--fetcher_cache_size="2GB" --frameworks_home="" --gc_delay="1weeks" --gc_disk_headroom="0.1"
--hadoop_home="" --help="false" --hostname_lookup="true" --http_command_executor="false" --http_credentials="/tmp/Endpoint_SlaveEndpointTest_UnauthorizedRequest_1_y0kgHI/http_credentials"
--http_heartbeat_interval="30secs" --initialize_driver_logging="true" --isolation="posix/cpu,posix/mem"
--launcher="posix" --launcher_dir="/mesos/mesos-1.5.0/_build/src" --logbufsecs="0" --logging_level="INFO"
--max_completed_executors_per_framework="150" --oversubscribed_resources_interval="15secs"
--perf_duration="10secs" --perf_interval="1mins" --port="5051" --qos_correction_interval_min="0ns"
--quiet="false" --recover="reconnect" --recovery_timeout="15mins" --registration_backoff_factor="10ms"
--resources="cpus:2;gpus:0;mem:1024;disk:1024;ports:[31000-32000]" --revocable_cpu_low_priority="true"
--runtime_dir="/tmp/Endpoint_SlaveEndpointTest_UnauthorizedRequest_1_y0kgHI" --sandbox_directory="/mnt/mesos/sandbox"
--strict="true" --switch_user="true" --systemd_enable_support="true" --systemd_runtime_directory="/run/systemd/system"
--version="false" --work_dir="/tmp/Endpoint_SlaveEndpointTest_UnauthorizedRequest_1_Ncrzzv"
I0825 15:48:34.081492 30473 credentials.hpp:86] Loading credential for authentication from
'/tmp/Endpoint_SlaveEndpointTest_UnauthorizedRequest_1_y0kgHI/credential'
I0825 15:48:34.081650 30473 slave.cpp:285] Agent using credential for: test-principal
I0825 15:48:34.081670 30473 credentials.hpp:37] Loading credentials for authentication from
'/tmp/Endpoint_SlaveEndpointTest_UnauthorizedRequest_1_y0kgHI/http_credentials'
I0825 15:48:34.081967 30473 http.cpp:1026] Creating default 'basic' HTTP authenticator for
realm 'mesos-agent-executor'
I0825 15:48:34.082078 30473 http.cpp:1047] Creating default 'jwt' HTTP authenticator for realm
'mesos-agent-executor'
I0825 15:48:34.082290 30473 http.cpp:1026] Creating default 'basic' HTTP authenticator for
realm 'mesos-agent-readonly'
I0825 15:48:34.082422 30473 http.cpp:1047] Creating default 'jwt' HTTP authenticator for realm
'mesos-agent-readonly'
I0825 15:48:34.082623 30473 http.cpp:1026] Creating default 'basic' HTTP authenticator for
realm 'mesos-agent-readwrite'
I0825 15:48:34.082726 30473 http.cpp:1047] Creating default 'jwt' HTTP authenticator for realm
'mesos-agent-readwrite'
I0825 15:48:34.084089 30473 slave.cpp:581] Agent resources: [{"name":"cpus","scalar":{"value":2.0},"type":"SCALAR"},{"name":"mem","scalar":{"value":1024.0},"type":"SCALAR"},{"name":"disk","scalar":{"value":1024.0},"type":"SCALAR"},{"name":"ports","ranges":{"range":[{"begin":31000,"end":32000}]},"type":"RANGES"}]
I0825 15:48:34.084316 30473 slave.cpp:589] Agent attributes: [  ]
I0825 15:48:34.084329 30473 slave.cpp:598] Agent hostname: 7be7609aef65
I0825 15:48:34.084450 30466 status_update_manager.cpp:177] Pausing sending status updates
I0825 15:48:34.085841 30482 state.cpp:64] Recovering state from '/tmp/Endpoint_SlaveEndpointTest_UnauthorizedRequest_1_Ncrzzv/meta'
I0825 15:48:34.086163 30465 status_update_manager.cpp:203] Recovering status update manager
I0825 15:48:34.086351 30484 containerizer.cpp:643] Recovering containerizer
I0825 15:48:34.087744 30485 provisioner.cpp:416] Provisioner recovery complete
I0825 15:48:34.088114 30478 slave.cpp:6264] Finished recovery
I0825 15:48:34.088541 30478 slave.cpp:6446] Querying resource estimator for oversubscribable
resources
I0825 15:48:34.088757 30475 slave.cpp:6460] Received oversubscribable resources {} from the
resource estimator
I0825 15:48:34.090826 30483 process.cpp:3933] Handling HTTP event for process 'slave(807)'
with path: '/slave(807)/monitor/statistics.json'
I0825 15:48:34.092456 30477 http.cpp:1166] HTTP GET for /slave(807)/monitor/statistics.json
from 172.17.0.3:50662
I0825 15:48:34.092517 30477 http.cpp:957] Authorizing principal 'test-principal' to GET the
'/monitor/statistics.json' endpoint
I0825 15:48:34.094642 30476 slave.cpp:859] Agent terminating
[       OK ] Endpoint/SlaveEndpointTest.UnauthorizedRequest/1 (28 ms)
[ RUN      ] Endpoint/SlaveEndpointTest.UnauthorizedRequest/2
I0825 15:48:34.105281  9567 containerizer.cpp:288] Using isolation { environment_secret, posix/cpu,
posix/mem, filesystem/posix, network/cni }
W0825 15:48:34.105748  9567 backend.cpp:76] Failed to create 'aufs' backend: AufsBackend requires
root privileges
W0825 15:48:34.105860  9567 backend.cpp:76] Failed to create 'bind' backend: BindBackend requires
root privileges
I0825 15:48:34.105901  9567 provisioner.cpp:255] Using default backend 'copy'
I0825 15:48:34.109248 30479 slave.cpp:252] Mesos agent started on (808)@172.17.0.3:45823
I0825 15:48:34.109275 30479 slave.cpp:253] Flags at startup: --acls="" --appc_simple_discovery_uri_prefix="http://"
--appc_store_dir="/tmp/Endpoint_SlaveEndpointTest_UnauthorizedRequest_2_4n2Gqz/store/appc"
--authenticate_http_executors="true" --authenticate_http_readonly="true" --authenticate_http_readwrite="true"
--authenticatee="crammd5" --authentication_backoff_factor="1secs" --authorizer="local" --cgroups_cpu_enable_pids_and_tids_count="false"
--cgroups_enable_cfs="false" --cgroups_hierarchy="/sys/fs/cgroup" --cgroups_limit_swap="false"
--cgroups_root="mesos" --container_disk_watch_interval="15secs" --containerizers="mesos" --credential="/tmp/Endpoint_SlaveEndpointTest_UnauthorizedRequest_2_4n2Gqz/credential"
--default_role="*" --disallow_sharing_agent_pid_namespace="false" --disk_watch_interval="1mins"
--docker="docker" --docker_kill_orphans="true" --docker_registry="https://registry-1.docker.io"
--docker_remove_delay="6hrs" --docker_socket="/var/run/docker.sock" --docker_stop_timeout="0ns"
--docker_store_dir="/tmp/Endpoint_SlaveEndpointTest_UnauthorizedRequest_2_4n2Gqz/store/docker"
--docker_volume_checkpoint_dir="/var/run/mesos/isolators/docker/volume" --enforce_container_disk_quota="false"
--executor_registration_timeout="1mins" --executor_reregistration_timeout="2secs" --executor_secret_key="/tmp/Endpoint_SlaveEndpointTest_UnauthorizedRequest_2_4n2Gqz/executor_secret_key"
--executor_shutdown_grace_period="5secs" --fetcher_cache_dir="/tmp/Endpoint_SlaveEndpointTest_UnauthorizedRequest_2_4n2Gqz/fetch"
--fetcher_cache_size="2GB" --frameworks_home="" --gc_delay="1weeks" --gc_disk_headroom="0.1"
--hadoop_home="" --help="false" --hostname_lookup="true" --http_command_executor="false" --http_credentials="/tmp/Endpoint_SlaveEndpointTest_UnauthorizedRequest_2_4n2Gqz/http_credentials"
--http_heartbeat_interval="30secs" --initialize_driver_logging="true" --isolation="posix/cpu,posix/mem"
--launcher="posix" --launcher_dir="/mesos/mesos-1.5.0/_build/src" --logbufsecs="0" --logging_level="INFO"
--max_completed_executors_per_framework="150" --oversubscribed_resources_interval="15secs"
--perf_duration="10secs" --perf_interval="1mins" --port="5051" --qos_correction_interval_min="0ns"
--quiet="false" --recover="reconnect" --recovery_timeout="15mins" --registration_backoff_factor="10ms"
--resources="cpus:2;gpus:0;mem:1024;disk:1024;ports:[31000-32000]" --revocable_cpu_low_priority="true"
--runtime_dir="/tmp/Endpoint_SlaveEndpointTest_UnauthorizedRequest_2_4n2Gqz" --sandbox_directory="/mnt/mesos/sandbox"
--strict="true" --switch_user="true" --systemd_enable_support="true" --systemd_runtime_directory="/run/systemd/system"
--version="false" --work_dir="/tmp/Endpoint_SlaveEndpointTest_UnauthorizedRequest_2_X26Iem"
I0825 15:48:34.109843 30479 credentials.hpp:86] Loading credential for authentication from
'/tmp/Endpoint_SlaveEndpointTest_UnauthorizedRequest_2_4n2Gqz/credential'
I0825 15:48:34.110008 30479 slave.cpp:285] Agent using credential for: test-principal
I0825 15:48:34.110028 30479 credentials.hpp:37] Loading credentials for authentication from
'/tmp/Endpoint_SlaveEndpointTest_UnauthorizedRequest_2_4n2Gqz/http_credentials'
I0825 15:48:34.110412 30479 http.cpp:1026] Creating default 'basic' HTTP authenticator for
realm 'mesos-agent-executor'
I0825 15:48:34.110536 30479 http.cpp:1047] Creating default 'jwt' HTTP authenticator for realm
'mesos-agent-executor'
I0825 15:48:34.110744 30479 http.cpp:1026] Creating default 'basic' HTTP authenticator for
realm 'mesos-agent-readonly'
I0825 15:48:34.110844 30479 http.cpp:1047] Creating default 'jwt' HTTP authenticator for realm
'mesos-agent-readonly'
I0825 15:48:34.111049 30479 http.cpp:1026] Creating default 'basic' HTTP authenticator for
realm 'mesos-agent-readwrite'
I0825 15:48:34.111148 30479 http.cpp:1047] Creating default 'jwt' HTTP authenticator for realm
'mesos-agent-readwrite'
I0825 15:48:34.112681 30479 slave.cpp:581] Agent resources: [{"name":"cpus","scalar":{"value":2.0},"type":"SCALAR"},{"name":"mem","scalar":{"value":1024.0},"type":"SCALAR"},{"name":"disk","scalar":{"value":1024.0},"type":"SCALAR"},{"name":"ports","ranges":{"range":[{"begin":31000,"end":32000}]},"type":"RANGES"}]
I0825 15:48:34.112908 30479 slave.cpp:589] Agent attributes: [  ]
I0825 15:48:34.112921 30479 slave.cpp:598] Agent hostname: 7be7609aef65
I0825 15:48:34.113039 30485 status_update_manager.cpp:177] Pausing sending status updates
I0825 15:48:34.114629 30476 state.cpp:64] Recovering state from '/tmp/Endpoint_SlaveEndpointTest_UnauthorizedRequest_2_X26Iem/meta'
I0825 15:48:34.114923 30466 status_update_manager.cpp:203] Recovering status update manager
I0825 15:48:34.115109 30466 containerizer.cpp:643] Recovering containerizer
I0825 15:48:34.116446 30474 provisioner.cpp:416] Provisioner recovery complete
I0825 15:48:34.116806 30479 slave.cpp:6264] Finished recovery
I0825 15:48:34.117264 30479 slave.cpp:6446] Querying resource estimator for oversubscribable
resources
I0825 15:48:34.117501 30486 slave.cpp:6460] Received oversubscribable resources {} from the
resource estimator
I0825 15:48:34.119565 30485 process.cpp:3933] Handling HTTP event for process 'slave(808)'
with path: '/slave(808)/containers'
I0825 15:48:34.121199 30484 http.cpp:1166] HTTP GET for /slave(808)/containers from 172.17.0.3:50664
I0825 15:48:34.121270 30484 http.cpp:957] Authorizing principal 'test-principal' to GET the
'/containers' endpoint
I0825 15:48:34.123693 30471 slave.cpp:859] Agent terminating
[       OK ] Endpoint/SlaveEndpointTest.UnauthorizedRequest/2 (29 ms)
[ RUN      ] Endpoint/SlaveEndpointTest.NoAuthorizer/0
I0825 15:48:34.134654  9567 containerizer.cpp:288] Using isolation { environment_secret, posix/cpu,
posix/mem, filesystem/posix, network/cni }
W0825 15:48:34.135118  9567 backend.cpp:76] Failed to create 'aufs' backend: AufsBackend requires
root privileges
W0825 15:48:34.135222  9567 backend.cpp:76] Failed to create 'bind' backend: BindBackend requires
root privileges
I0825 15:48:34.135253  9567 provisioner.cpp:255] Using default backend 'copy'
I0825 15:48:34.136875  9567 cluster.cpp:448] Creating default 'local' authorizer
I0825 15:48:34.138844 30475 slave.cpp:252] Mesos agent started on (809)@172.17.0.3:45823
I0825 15:48:34.138866 30475 slave.cpp:253] Flags at startup: --acls="" --appc_simple_discovery_uri_prefix="http://"
--appc_store_dir="/tmp/Endpoint_SlaveEndpointTest_NoAuthorizer_0_cVmorq/store/appc" --authenticate_http_executors="true"
--authenticate_http_readonly="true" --authenticate_http_readwrite="true" --authenticatee="crammd5"
--authentication_backoff_factor="1secs" --authorizer="local" --cgroups_cpu_enable_pids_and_tids_count="false"
--cgroups_enable_cfs="false" --cgroups_hierarchy="/sys/fs/cgroup" --cgroups_limit_swap="false"
--cgroups_root="mesos" --container_disk_watch_interval="15secs" --containerizers="mesos" --credential="/tmp/Endpoint_SlaveEndpointTest_NoAuthorizer_0_cVmorq/credential"
--default_role="*" --disallow_sharing_agent_pid_namespace="false" --disk_watch_interval="1mins"
--docker="docker" --docker_kill_orphans="true" --docker_registry="https://registry-1.docker.io"
--docker_remove_delay="6hrs" --docker_socket="/var/run/docker.sock" --docker_stop_timeout="0ns"
--docker_store_dir="/tmp/Endpoint_SlaveEndpointTest_NoAuthorizer_0_cVmorq/store/docker" --docker_volume_checkpoint_dir="/var/run/mesos/isolators/docker/volume"
--enforce_container_disk_quota="false" --executor_registration_timeout="1mins" --executor_reregistration_timeout="2secs"
--executor_secret_key="/tmp/Endpoint_SlaveEndpointTest_NoAuthorizer_0_cVmorq/executor_secret_key"
--executor_shutdown_grace_period="5secs" --fetcher_cache_dir="/tmp/Endpoint_SlaveEndpointTest_NoAuthorizer_0_cVmorq/fetch"
--fetcher_cache_size="2GB" --frameworks_home="" --gc_delay="1weeks" --gc_disk_headroom="0.1"
--hadoop_home="" --help="false" --hostname_lookup="true" --http_command_executor="false" --http_credentials="/tmp/Endpoint_SlaveEndpointTest_NoAuthorizer_0_cVmorq/http_credentials"
--http_heartbeat_interval="30secs" --initialize_driver_logging="true" --isolation="posix/cpu,posix/mem"
--launcher="posix" --launcher_dir="/mesos/mesos-1.5.0/_build/src" --logbufsecs="0" --logging_level="INFO"
--max_completed_executors_per_framework="150" --oversubscribed_resources_interval="15secs"
--perf_duration="10secs" --perf_interval="1mins" --port="5051" --qos_correction_interval_min="0ns"
--quiet="false" --recover="reconnect" --recovery_timeout="15mins" --registration_backoff_factor="10ms"
--resources="cpus:2;gpus:0;mem:1024;disk:1024;ports:[31000-32000]" --revocable_cpu_low_priority="true"
--runtime_dir="/tmp/Endpoint_SlaveEndpointTest_NoAuthorizer_0_cVmorq" --sandbox_directory="/mnt/mesos/sandbox"
--strict="true" --switch_user="true" --systemd_enable_support="true" --systemd_runtime_directory="/run/systemd/system"
--version="false" --work_dir="/tmp/Endpoint_SlaveEndpointTest_NoAuthorizer_0_3L75ad"
I0825 15:48:34.139246 30475 credentials.hpp:86] Loading credential for authentication from
'/tmp/Endpoint_SlaveEndpointTest_NoAuthorizer_0_cVmorq/credential'
I0825 15:48:34.139410 30475 slave.cpp:285] Agent using credential for: test-principal
I0825 15:48:34.139430 30475 credentials.hpp:37] Loading credentials for authentication from
'/tmp/Endpoint_SlaveEndpointTest_NoAuthorizer_0_cVmorq/http_credentials'
I0825 15:48:34.139706 30475 http.cpp:1026] Creating default 'basic' HTTP authenticator for
realm 'mesos-agent-executor'
I0825 15:48:34.139819 30475 http.cpp:1047] Creating default 'jwt' HTTP authenticator for realm
'mesos-agent-executor'
I0825 15:48:34.140027 30475 http.cpp:1026] Creating default 'basic' HTTP authenticator for
realm 'mesos-agent-readonly'
I0825 15:48:34.140151 30475 http.cpp:1047] Creating default 'jwt' HTTP authenticator for realm
'mesos-agent-readonly'
I0825 15:48:34.140334 30475 http.cpp:1026] Creating default 'basic' HTTP authenticator for
realm 'mesos-agent-readwrite'
I0825 15:48:34.140444 30475 http.cpp:1047] Creating default 'jwt' HTTP authenticator for realm
'mesos-agent-readwrite'
I0825 15:48:34.142251 30475 slave.cpp:581] Agent resources: [{"name":"cpus","scalar":{"value":2.0},"type":"SCALAR"},{"name":"mem","scalar":{"value":1024.0},"type":"SCALAR"},{"name":"disk","scalar":{"value":1024.0},"type":"SCALAR"},{"name":"ports","ranges":{"range":[{"begin":31000,"end":32000}]},"type":"RANGES"}]
I0825 15:48:34.142601 30475 slave.cpp:589] Agent attributes: [  ]
I0825 15:48:34.142613 30475 slave.cpp:598] Agent hostname: 7be7609aef65
I0825 15:48:34.142817 30468 status_update_manager.cpp:177] Pausing sending status updates
I0825 15:48:34.144969 30478 state.cpp:64] Recovering state from '/tmp/Endpoint_SlaveEndpointTest_NoAuthorizer_0_3L75ad/meta'
I0825 15:48:34.145241 30465 status_update_manager.cpp:203] Recovering status update manager
I0825 15:48:34.145426 30471 containerizer.cpp:643] Recovering containerizer
I0825 15:48:34.146831 30481 provisioner.cpp:416] Provisioner recovery complete
I0825 15:48:34.147397 30476 slave.cpp:6264] Finished recovery
I0825 15:48:34.147861 30476 slave.cpp:6446] Querying resource estimator for oversubscribable
resources
I0825 15:48:34.148124 30480 slave.cpp:6460] Received oversubscribable resources {} from the
resource estimator
I0825 15:48:34.150029 30473 process.cpp:3933] Handling HTTP event for process 'slave(809)'
with path: '/slave(809)/monitor/statistics'
I0825 15:48:34.152134 30484 http.cpp:1166] HTTP GET for /slave(809)/monitor/statistics from
172.17.0.3:50666
I0825 15:48:34.152197 30484 http.cpp:957] Authorizing principal 'test-principal' to GET the
'/monitor/statistics' endpoint
I0825 15:48:34.155513 30483 slave.cpp:859] Agent terminating
[       OK ] Endpoint/SlaveEndpointTest.NoAuthorizer/0 (32 ms)
[ RUN      ] Endpoint/SlaveEndpointTest.NoAuthorizer/1
I0825 15:48:34.168264  9567 containerizer.cpp:288] Using isolation { environment_secret, posix/cpu,
posix/mem, filesystem/posix, network/cni }
W0825 15:48:34.168764  9567 backend.cpp:76] Failed to create 'aufs' backend: AufsBackend requires
root privileges
W0825 15:48:34.168877  9567 backend.cpp:76] Failed to create 'bind' backend: BindBackend requires
root privileges
I0825 15:48:34.168915  9567 provisioner.cpp:255] Using default backend 'copy'
I0825 15:48:34.170593  9567 cluster.cpp:448] Creating default 'local' authorizer
I0825 15:48:34.172564 30469 slave.cpp:252] Mesos agent started on (810)@172.17.0.3:45823
I0825 15:48:34.172591 30469 slave.cpp:253] Flags at startup: --acls="" --appc_simple_discovery_uri_prefix="http://"
--appc_store_dir="/tmp/Endpoint_SlaveEndpointTest_NoAuthorizer_1_Qsl4Kh/store/appc" --authenticate_http_executors="true"
--authenticate_http_readonly="true" --authenticate_http_readwrite="true" --authenticatee="crammd5"
--authentication_backoff_factor="1secs" --authorizer="local" --cgroups_cpu_enable_pids_and_tids_count="false"
--cgroups_enable_cfs="false" --cgroups_hierarchy="/sys/fs/cgroup" --cgroups_limit_swap="false"
--cgroups_root="mesos" --container_disk_watch_interval="15secs" --containerizers="mesos" --credential="/tmp/Endpoint_SlaveEndpointTest_NoAuthorizer_1_Qsl4Kh/credential"
--default_role="*" --disallow_sharing_agent_pid_namespace="false" --disk_watch_interval="1mins"
--docker="docker" --docker_kill_orphans="true" --docker_registry="https://registry-1.docker.io"
--docker_remove_delay="6hrs" --docker_socket="/var/run/docker.sock" --docker_stop_timeout="0ns"
--docker_store_dir="/tmp/Endpoint_SlaveEndpointTest_NoAuthorizer_1_Qsl4Kh/store/docker" --docker_volume_checkpoint_dir="/var/run/mesos/isolators/docker/volume"
--enforce_container_disk_quota="false" --executor_registration_timeout="1mins" --executor_reregistration_timeout="2secs"
--executor_secret_key="/tmp/Endpoint_SlaveEndpointTest_NoAuthorizer_1_Qsl4Kh/executor_secret_key"
--executor_shutdown_grace_period="5secs" --fetcher_cache_dir="/tmp/Endpoint_SlaveEndpointTest_NoAuthorizer_1_Qsl4Kh/fetch"
--fetcher_cache_size="2GB" --frameworks_home="" --gc_delay="1weeks" --gc_disk_headroom="0.1"
--hadoop_home="" --help="false" --hostname_lookup="true" --http_command_executor="false" --http_credentials="/tmp/Endpoint_SlaveEndpointTest_NoAuthorizer_1_Qsl4Kh/http_credentials"
--http_heartbeat_interval="30secs" --initialize_driver_logging="true" --isolation="posix/cpu,posix/mem"
--launcher="posix" --launcher_dir="/mesos/mesos-1.5.0/_build/src" --logbufsecs="0" --logging_level="INFO"
--max_completed_executors_per_framework="150" --oversubscribed_resources_interval="15secs"
--perf_duration="10secs" --perf_interval="1mins" --port="5051" --qos_correction_interval_min="0ns"
--quiet="false" --recover="reconnect" --recovery_timeout="15mins" --registration_backoff_factor="10ms"
--resources="cpus:2;gpus:0;mem:1024;disk:1024;ports:[31000-32000]" --revocable_cpu_low_priority="true"
--runtime_dir="/tmp/Endpoint_SlaveEndpointTest_NoAuthorizer_1_Qsl4Kh" --sandbox_directory="/mnt/mesos/sandbox"
--strict="true" --switch_user="true" --systemd_enable_support="true" --systemd_runtime_directory="/run/systemd/system"
--version="false" --work_dir="/tmp/Endpoint_SlaveEndpointTest_NoAuthorizer_1_xZQXp4"
I0825 15:48:34.173249 30469 credentials.hpp:86] Loading credential for authentication from
'/tmp/Endpoint_SlaveEndpointTest_NoAuthorizer_1_Qsl4Kh/credential'
I0825 15:48:34.173409 30469 slave.cpp:285] Agent using credential for: test-principal
I0825 15:48:34.173429 30469 credentials.hpp:37] Loading credentials for authentication from
'/tmp/Endpoint_SlaveEndpointTest_NoAuthorizer_1_Qsl4Kh/http_credentials'
I0825 15:48:34.173738 30469 http.cpp:1026] Creating default 'basic' HTTP authenticator for
realm 'mesos-agent-executor'
I0825 15:48:34.173868 30469 http.cpp:1047] Creating default 'jwt' HTTP authenticator for realm
'mesos-agent-executor'
I0825 15:48:34.174087 30469 http.cpp:1026] Creating default 'basic' HTTP authenticator for
realm 'mesos-agent-readonly'
I0825 15:48:34.174190 30469 http.cpp:1047] Creating default 'jwt' HTTP authenticator for realm
'mesos-agent-readonly'
I0825 15:48:34.174376 30469 http.cpp:1026] Creating default 'basic' HTTP authenticator for
realm 'mesos-agent-readwrite'
I0825 15:48:34.174482 30469 http.cpp:1047] Creating default 'jwt' HTTP authenticator for realm
'mesos-agent-readwrite'
I0825 15:48:34.175902 30469 slave.cpp:581] Agent resources: [{"name":"cpus","scalar":{"value":2.0},"type":"SCALAR"},{"name":"mem","scalar":{"value":1024.0},"type":"SCALAR"},{"name":"disk","scalar":{"value":1024.0},"type":"SCALAR"},{"name":"ports","ranges":{"range":[{"begin":31000,"end":32000}]},"type":"RANGES"}]
I0825 15:48:34.176132 30469 slave.cpp:589] Agent attributes: [  ]
I0825 15:48:34.176144 30469 slave.cpp:598] Agent hostname: 7be7609aef65
I0825 15:48:34.176291 30476 status_update_manager.cpp:177] Pausing sending status updates
I0825 15:48:34.177937 30473 state.cpp:64] Recovering state from '/tmp/Endpoint_SlaveEndpointTest_NoAuthorizer_1_xZQXp4/meta'
I0825 15:48:34.178277 30473 status_update_manager.cpp:203] Recovering status update manager
I0825 15:48:34.178462 30473 containerizer.cpp:643] Recovering containerizer
I0825 15:48:34.180192 30476 provisioner.cpp:416] Provisioner recovery complete
I0825 15:48:34.180614 30485 slave.cpp:6264] Finished recovery
I0825 15:48:34.181112 30485 slave.cpp:6446] Querying resource estimator for oversubscribable
resources
I0825 15:48:34.181536 30472 slave.cpp:6460] Received oversubscribable resources {} from the
resource estimator
I0825 15:48:34.183851 30481 process.cpp:3933] Handling HTTP event for process 'slave(810)'
with path: '/slave(810)/monitor/statistics.json'
I0825 15:48:34.185642 30468 http.cpp:1166] HTTP GET for /slave(810)/monitor/statistics.json
from 172.17.0.3:50668
I0825 15:48:34.185734 30468 http.cpp:957] Authorizing principal 'test-principal' to GET the
'/monitor/statistics.json' endpoint
I0825 15:48:34.188947 30474 slave.cpp:859] Agent terminating
[       OK ] Endpoint/SlaveEndpointTest.NoAuthorizer/1 (33 ms)
[ RUN      ] Endpoint/SlaveEndpointTest.NoAuthorizer/2
I0825 15:48:34.202570  9567 containerizer.cpp:288] Using isolation { environment_secret, posix/cpu,
posix/mem, filesystem/posix, network/cni }
W0825 15:48:34.203117  9567 backend.cpp:76] Failed to create 'aufs' backend: AufsBackend requires
root privileges
W0825 15:48:34.203225  9567 backend.cpp:76] Failed to create 'bind' backend: BindBackend requires
root privileges
I0825 15:48:34.203259  9567 provisioner.cpp:255] Using default backend 'copy'
I0825 15:48:34.204962  9567 cluster.cpp:448] Creating default 'local' authorizer
I0825 15:48:34.207001 30472 slave.cpp:252] Mesos agent started on (811)@172.17.0.3:45823
I0825 15:48:34.207022 30472 slave.cpp:253] Flags at startup: --acls="" --appc_simple_discovery_uri_prefix="http://"
--appc_store_dir="/tmp/Endpoint_SlaveEndpointTest_NoAuthorizer_2_IXrtp9/store/appc" --authenticate_http_executors="true"
--authenticate_http_readonly="true" --authenticate_http_readwrite="true" --authenticatee="crammd5"
--authentication_backoff_factor="1secs" --authorizer="local" --cgroups_cpu_enable_pids_and_tids_count="false"
--cgroups_enable_cfs="false" --cgroups_hierarchy="/sys/fs/cgroup" --cgroups_limit_swap="false"
--cgroups_root="mesos" --container_disk_watch_interval="15secs" --containerizers="mesos" --credential="/tmp/Endpoint_SlaveEndpointTest_NoAuthorizer_2_IXrtp9/credential"
--default_role="*" --disallow_sharing_agent_pid_namespace="false" --disk_watch_interval="1mins"
--docker="docker" --docker_kill_orphans="true" --docker_registry="https://registry-1.docker.io"
--docker_remove_delay="6hrs" --docker_socket="/var/run/docker.sock" --docker_stop_timeout="0ns"
--docker_store_dir="/tmp/Endpoint_SlaveEndpointTest_NoAuthorizer_2_IXrtp9/store/docker" --docker_volume_checkpoint_dir="/var/run/mesos/isolators/docker/volume"
--enforce_container_disk_quota="false" --executor_registration_timeout="1mins" --executor_reregistration_timeout="2secs"
--executor_secret_key="/tmp/Endpoint_SlaveEndpointTest_NoAuthorizer_2_IXrtp9/executor_secret_key"
--executor_shutdown_grace_period="5secs" --fetcher_cache_dir="/tmp/Endpoint_SlaveEndpointTest_NoAuthorizer_2_IXrtp9/fetch"
--fetcher_cache_size="2GB" --frameworks_home="" --gc_delay="1weeks" --gc_disk_headroom="0.1"
--hadoop_home="" --help="false" --hostname_lookup="true" --http_command_executor="false" --http_credentials="/tmp/Endpoint_SlaveEndpointTest_NoAuthorizer_2_IXrtp9/http_credentials"
--http_heartbeat_interval="30secs" --initialize_driver_logging="true" --isolation="posix/cpu,posix/mem"
--launcher="posix" --launcher_dir="/mesos/mesos-1.5.0/_build/src" --logbufsecs="0" --logging_level="INFO"
--max_completed_executors_per_framework="150" --oversubscribed_resources_interval="15secs"
--perf_duration="10secs" --perf_interval="1mins" --port="5051" --qos_correction_interval_min="0ns"
--quiet="false" --recover="reconnect" --recovery_timeout="15mins" --registration_backoff_factor="10ms"
--resources="cpus:2;gpus:0;mem:1024;disk:1024;ports:[31000-32000]" --revocable_cpu_low_priority="true"
--runtime_dir="/tmp/Endpoint_SlaveEndpointTest_NoAuthorizer_2_IXrtp9" --sandbox_directory="/mnt/mesos/sandbox"
--strict="true" --switch_user="true" --systemd_enable_support="true" --systemd_runtime_directory="/run/systemd/system"
--version="false" --work_dir="/tmp/Endpoint_SlaveEndpointTest_NoAuthorizer_2_Fxw6YV"
I0825 15:48:34.207463 30472 credentials.hpp:86] Loading credential for authentication from
'/tmp/Endpoint_SlaveEndpointTest_NoAuthorizer_2_IXrtp9/credential'
I0825 15:48:34.207638 30472 slave.cpp:285] Agent using credential for: test-principal
I0825 15:48:34.207664 30472 credentials.hpp:37] Loading credentials for authentication from
'/tmp/Endpoint_SlaveEndpointTest_NoAuthorizer_2_IXrtp9/http_credentials'
I0825 15:48:34.208020 30472 http.cpp:1026] Creating default 'basic' HTTP authenticator for
realm 'mesos-agent-executor'
I0825 15:48:34.208165 30472 http.cpp:1047] Creating default 'jwt' HTTP authenticator for realm
'mesos-agent-executor'
I0825 15:48:34.208402 30472 http.cpp:1026] Creating default 'basic' HTTP authenticator for
realm 'mesos-agent-readonly'
I0825 15:48:34.208559 30472 http.cpp:1047] Creating default 'jwt' HTTP authenticator for realm
'mesos-agent-readonly'
I0825 15:48:34.208787 30472 http.cpp:1026] Creating default 'basic' HTTP authenticator for
realm 'mesos-agent-readwrite'
I0825 15:48:34.208906 30472 http.cpp:1047] Creating default 'jwt' HTTP authenticator for realm
'mesos-agent-readwrite'
I0825 15:48:34.210351 30472 slave.cpp:581] Agent resources: [{"name":"cpus","scalar":{"value":2.0},"type":"SCALAR"},{"name":"mem","scalar":{"value":1024.0},"type":"SCALAR"},{"name":"disk","scalar":{"value":1024.0},"type":"SCALAR"},{"name":"ports","ranges":{"range":[{"begin":31000,"end":32000}]},"type":"RANGES"}]
I0825 15:48:34.210582 30472 slave.cpp:589] Agent attributes: [  ]
I0825 15:48:34.210597 30472 slave.cpp:598] Agent hostname: 7be7609aef65
I0825 15:48:34.210934 30479 status_update_manager.cpp:177] Pausing sending status updates
I0825 15:48:34.212458 30465 state.cpp:64] Recovering state from '/tmp/Endpoint_SlaveEndpointTest_NoAuthorizer_2_Fxw6YV/meta'
I0825 15:48:34.212805 30466 status_update_manager.cpp:203] Recovering status update manager
I0825 15:48:34.213018 30469 containerizer.cpp:643] Recovering containerizer
I0825 15:48:34.214480 30484 provisioner.cpp:416] Provisioner recovery complete
I0825 15:48:34.214864 30481 slave.cpp:6264] Finished recovery
I0825 15:48:34.215363 30481 slave.cpp:6446] Querying resource estimator for oversubscribable
resources
I0825 15:48:34.215636 30468 slave.cpp:6460] Received oversubscribable resources {} from the
resource estimator
I0825 15:48:34.217661 30487 process.cpp:3933] Handling HTTP event for process 'slave(811)'
with path: '/slave(811)/containers'
I0825 15:48:34.219410 30474 http.cpp:1166] HTTP GET for /slave(811)/containers from 172.17.0.3:50670
I0825 15:48:34.219483 30474 http.cpp:957] Authorizing principal 'test-principal' to GET the
'/containers' endpoint
I0825 15:48:34.223635 30477 slave.cpp:859] Agent terminating
[       OK ] Endpoint/SlaveEndpointTest.NoAuthorizer/2 (32 ms)
[----------] 9 tests from Endpoint/SlaveEndpointTest (281 ms total)

[----------] 2 tests from ContainerizerType/DefaultContainerDNSFlagTest
[ RUN      ] ContainerizerType/DefaultContainerDNSFlagTest.ValidateFlag/0
[       OK ] ContainerizerType/DefaultContainerDNSFlagTest.ValidateFlag/0 (9 ms)
[ RUN      ] ContainerizerType/DefaultContainerDNSFlagTest.ValidateFlag/1
[       OK ] ContainerizerType/DefaultContainerDNSFlagTest.ValidateFlag/1 (9 ms)
[----------] 2 tests from ContainerizerType/DefaultContainerDNSFlagTest (19 ms total)

[----------] Global test environment tear-down
[==========] 1665 tests from 184 test cases ran. (731164 ms total)
[  PASSED  ] 1663 tests.
[  FAILED  ] 2 tests, listed below:
[  FAILED  ] DefaultExecutorCheckTest.CommandCheckDeliveredAndReconciled
[  FAILED  ] DefaultExecutorCheckTest.CommandCheckStatusChange

 2 FAILED TESTS
  YOU HAVE 20 DISABLED TESTS

I0825 15:48:34.314492 30488 process.cpp:1072] Failed to accept socket: future discarded
make[4]: *** [check-local] Error 1
make[4]: Leaving directory `/mesos/mesos-1.5.0/_build/src'
make[3]: *** [check-am] Error 2
make[3]: Leaving directory `/mesos/mesos-1.5.0/_build/src'
make[2]: *** [check] Error 2
make[2]: Leaving directory `/mesos/mesos-1.5.0/_build/src'
make[1]: *** [check-recursive] Error 1
make[1]: Leaving directory `/mesos/mesos-1.5.0/_build'
make: *** [distcheck] Error 1
+ docker rmi mesos-1503673028-5753
Untagged: mesos-1503673028-5753:latest
Deleted: sha256:81fa5b160bfc61d7353582d0f92e4542a1e3f8e8c5f904554b7dcc41064c4f48
Deleted: sha256:9997425883b366acb4041ee85d55c2da30191dc8f893e85b55b5db1a55177bdc
Deleted: sha256:cd6dd15a89f2d04101ef6b7dda17c78cd077e16021a73c94433e56b4631e235f
Deleted: sha256:8314b1993efb7a4bef8191bdbe9d89206840e6c537559196cd23994a35fbd9b3
Deleted: sha256:e00f792f95d0f403ca3a9db8825a926f5f4cfa8ac4a6887d80949a45d1b0eacf
Deleted: sha256:1f4ce5f50f49b20a56d5bbe7e50e5bdf3beecea7f9fa662136ff309a049cd344
Deleted: sha256:687d4988254f92676f3336b925f4ccd1b05f1486ba3340505c3e3e40801a9a24
Deleted: sha256:d95414bbbb15f27c50ddad33574d0de569f07eba36e0276d0a9affbd929661f4
Deleted: sha256:ec531741539b00396aa5da7e9c9a79d536fe21c21cbb165608efe68129c384e7
Deleted: sha256:12002aa4ef9509165256122608066076d2f154970f56bdc76cb86b7f0dbd635e
Deleted: sha256:d9e3821c7cce366e3a3fb269764caa74f2b294f1d2b75902979e6991ebf1f99e
Deleted: sha256:90f9c853859c17984f028efdd42d9cef47a88545b8f428d456f260d5a790b20e
Deleted: sha256:2c72c4f4ec0b72f1b0c9d68198fc9e51cc61042e3c5b431df82475b05320b69f
Deleted: sha256:0af0fe2bbbc5fdcff2f28e47af0800693ecb2dde4c3a7ec4faec117aa9e5392f
Deleted: sha256:57c91abab343e6885f3f3b0ba3ce354db0a2a1e3dce9bf3bf4390e48ca707bf9
Deleted: sha256:b4a9f7f88f60839f6828b74b3529533eec8ac6037ef897d9bc5bc8698916b708
Deleted: sha256:c753c10efc1e7c4fa222be4ec181f5f52a7fc099778a78a7bde6f7bc3e6d4476
Deleted: sha256:f17283aa77a531acf560435c038810e515755315411420b5db632e7491df3374
Deleted: sha256:c4b2aa24030f371407b91162aef08d6efef47127e4a90e4442f2fa55b16e28a9
Deleted: sha256:ae0253c497fbf642c7e11f9754e7dcc98152bba7c467524f2bc2a678b516168e
Deleted: sha256:7b92f5560179d24a0dbfeb04faf223ea3a78434b2bbfce070ddc90dab33087af
Deleted: sha256:e90be0cb98ad8be4f332c17149ab61579a585436cbb3a46573ad3939e2e78bef
Deleted: sha256:e565b88b5fed16604489cd2d82a28e7dc63bd88a3dea045f5e38971304ee9078
Deleted: sha256:8cd0699428706b6bedfcb5b72d067a7286a0d6544c0476cc29033378b7ab91bb
Deleted: sha256:c0b79f075ea24480dce3218242e09a081b622a267215b5fc77d86b404067b077
Build step 'Execute shell' marked build as failure
Not sending mail to unregistered user zhq527725@gmail.com

Mime
View raw message