mesos-builds mailing list archives

Site index · List index
Message view « Date » · « Thread »
Top « Date » · « Thread »
From Apache Jenkins Server <jenk...@builds.apache.org>
Subject Build failed in Jenkins: Mesos-Reviewbot #19085
Date Sat, 26 Aug 2017 14:13:22 GMT
See <https://builds.apache.org/job/Mesos-Reviewbot/19085/display/redirect>

------------------------------------------
[...truncated 30.93 MB...]
I0826 14:13:17.658761  5726 slave.cpp:252] Mesos agent started on (803)@172.17.0.7:38927
I0826 14:13:17.658797  5726 slave.cpp:253] Flags at startup: --acls="" --appc_simple_discovery_uri_prefix="http://"
--appc_store_dir="/tmp/Endpoint_SlaveEndpointTest_AuthorizedRequest_2_Ugj5Fa/store/appc" --authenticate_http_readonly="true"
--authenticate_http_readwrite="true" --authenticatee="crammd5" --authentication_backoff_factor="1secs"
--authorizer="local" --cgroups_cpu_enable_pids_and_tids_count="false" --cgroups_enable_cfs="false"
--cgroups_hierarchy="/sys/fs/cgroup" --cgroups_limit_swap="false" --cgroups_root="mesos" --container_disk_watch_interval="15secs"
--containerizers="mesos" --credential="/tmp/Endpoint_SlaveEndpointTest_AuthorizedRequest_2_Ugj5Fa/credential"
--default_role="*" --disallow_sharing_agent_pid_namespace="false" --disk_watch_interval="1mins"
--docker="docker" --docker_kill_orphans="true" --docker_registry="https://registry-1.docker.io"
--docker_remove_delay="6hrs" --docker_socket="/var/run/docker.sock" --docker_stop_timeout="0ns"
--docker_store_dir="/tmp/Endpoint_SlaveEndpointTest_AuthorizedRequest_2_Ugj5Fa/store/docker"
--docker_volume_checkpoint_dir="/var/run/mesos/isolators/docker/volume" --enforce_container_disk_quota="false"
--executor_registration_timeout="1mins" --executor_reregistration_timeout="2secs" --executor_shutdown_grace_period="5secs"
--fetcher_cache_dir="/tmp/Endpoint_SlaveEndpointTest_AuthorizedRequest_2_Ugj5Fa/fetch" --fetcher_cache_size="2GB"
--frameworks_home="" --gc_delay="1weeks" --gc_disk_headroom="0.1" --hadoop_home="" --help="false"
--hostname_lookup="true" --http_command_executor="false" --http_credentials="/tmp/Endpoint_SlaveEndpointTest_AuthorizedRequest_2_Ugj5Fa/http_credentials"
--http_heartbeat_interval="30secs" --initialize_driver_logging="true" --isolation="posix/cpu,posix/mem"
--launcher="posix" --launcher_dir="/mesos/mesos-1.5.0/_build/src" --logbufsecs="0" --logging_level="INFO"
--max_completed_executors_per_framework="150" --oversubscribed_resources_interval="15secs"
--perf_duration="10secs" --perf_interval="1mins" --port="5051" --qos_correction_interval_min="0ns"
--quiet="false" --recover="reconnect" --recovery_timeout="15mins" --registration_backoff_factor="10ms"
--resources="cpus:2;gpus:0;mem:1024;disk:1024;ports:[31000-32000]" --revocable_cpu_low_priority="true"
--runtime_dir="/tmp/Endpoint_SlaveEndpointTest_AuthorizedRequest_2_Ugj5Fa" --sandbox_directory="/mnt/mesos/sandbox"
--strict="true" --switch_user="true" --systemd_enable_support="true" --systemd_runtime_directory="/run/systemd/system"
--version="false" --work_dir="/tmp/Endpoint_SlaveEndpointTest_AuthorizedRequest_2_s8DIcm"
I0826 14:13:17.659348  5726 credentials.hpp:86] Loading credential for authentication from
'/tmp/Endpoint_SlaveEndpointTest_AuthorizedRequest_2_Ugj5Fa/credential'
I0826 14:13:17.659570  5726 slave.cpp:285] Agent using credential for: test-principal
I0826 14:13:17.659598  5726 credentials.hpp:37] Loading credentials for authentication from
'/tmp/Endpoint_SlaveEndpointTest_AuthorizedRequest_2_Ugj5Fa/http_credentials'
I0826 14:13:17.659879  5726 http.cpp:1045] Creating default 'basic' HTTP authenticator for
realm 'mesos-agent-readonly'
I0826 14:13:17.660082  5726 http.cpp:1045] Creating default 'basic' HTTP authenticator for
realm 'mesos-agent-readwrite'
I0826 14:13:17.661499  5726 slave.cpp:581] Agent resources: [{"name":"cpus","scalar":{"value":2.0},"type":"SCALAR"},{"name":"mem","scalar":{"value":1024.0},"type":"SCALAR"},{"name":"disk","scalar":{"value":1024.0},"type":"SCALAR"},{"name":"ports","ranges":{"range":[{"begin":31000,"end":32000}]},"type":"RANGES"}]
I0826 14:13:17.661728  5726 slave.cpp:589] Agent attributes: [  ]
I0826 14:13:17.661746  5726 slave.cpp:598] Agent hostname: 6f93bbe13caf
I0826 14:13:17.661903  5718 status_update_manager.cpp:177] Pausing sending status updates
I0826 14:13:17.663727  5705 state.cpp:64] Recovering state from '/tmp/Endpoint_SlaveEndpointTest_AuthorizedRequest_2_s8DIcm/meta'
I0826 14:13:17.664182  5717 status_update_manager.cpp:203] Recovering status update manager
I0826 14:13:17.664481  5708 containerizer.cpp:643] Recovering containerizer
I0826 14:13:17.666504  5718 provisioner.cpp:416] Provisioner recovery complete
I0826 14:13:17.666846  5727 slave.cpp:6264] Finished recovery
I0826 14:13:17.667435  5727 slave.cpp:6446] Querying resource estimator for oversubscribable
resources
I0826 14:13:17.667716  5723 slave.cpp:6460] Received oversubscribable resources {} from the
resource estimator
I0826 14:13:17.671044  5724 process.cpp:3933] Handling HTTP event for process 'slave(803)'
with path: '/slave(803)/containers'
I0826 14:13:17.672665  5721 http.cpp:1185] HTTP GET for /slave(803)/containers from 172.17.0.7:44970
I0826 14:13:17.672744  5721 http.cpp:976] Authorizing principal 'test-principal' to GET the
'/containers' endpoint
I0826 14:13:17.676527  5720 slave.cpp:859] Agent terminating
[       OK ] Endpoint/SlaveEndpointTest.AuthorizedRequest/2 (36 ms)
[ RUN      ] Endpoint/SlaveEndpointTest.UnauthorizedRequest/0
I0826 14:13:17.689090  5686 containerizer.cpp:288] Using isolation { environment_secret, posix/cpu,
posix/mem, filesystem/posix, network/cni }
W0826 14:13:17.689656  5686 backend.cpp:76] Failed to create 'aufs' backend: AufsBackend requires
root privileges
W0826 14:13:17.689779  5686 backend.cpp:76] Failed to create 'bind' backend: BindBackend requires
root privileges
I0826 14:13:17.689821  5686 provisioner.cpp:255] Using default backend 'copy'
I0826 14:13:17.693991  5721 slave.cpp:252] Mesos agent started on (804)@172.17.0.7:38927
I0826 14:13:17.694039  5721 slave.cpp:253] Flags at startup: --acls="" --appc_simple_discovery_uri_prefix="http://"
--appc_store_dir="/tmp/Endpoint_SlaveEndpointTest_UnauthorizedRequest_0_u6NRRq/store/appc"
--authenticate_http_readonly="true" --authenticate_http_readwrite="true" --authenticatee="crammd5"
--authentication_backoff_factor="1secs" --authorizer="local" --cgroups_cpu_enable_pids_and_tids_count="false"
--cgroups_enable_cfs="false" --cgroups_hierarchy="/sys/fs/cgroup" --cgroups_limit_swap="false"
--cgroups_root="mesos" --container_disk_watch_interval="15secs" --containerizers="mesos" --credential="/tmp/Endpoint_SlaveEndpointTest_UnauthorizedRequest_0_u6NRRq/credential"
--default_role="*" --disallow_sharing_agent_pid_namespace="false" --disk_watch_interval="1mins"
--docker="docker" --docker_kill_orphans="true" --docker_registry="https://registry-1.docker.io"
--docker_remove_delay="6hrs" --docker_socket="/var/run/docker.sock" --docker_stop_timeout="0ns"
--docker_store_dir="/tmp/Endpoint_SlaveEndpointTest_UnauthorizedRequest_0_u6NRRq/store/docker"
--docker_volume_checkpoint_dir="/var/run/mesos/isolators/docker/volume" --enforce_container_disk_quota="false"
--executor_registration_timeout="1mins" --executor_reregistration_timeout="2secs" --executor_shutdown_grace_period="5secs"
--fetcher_cache_dir="/tmp/Endpoint_SlaveEndpointTest_UnauthorizedRequest_0_u6NRRq/fetch" --fetcher_cache_size="2GB"
--frameworks_home="" --gc_delay="1weeks" --gc_disk_headroom="0.1" --hadoop_home="" --help="false"
--hostname_lookup="true" --http_command_executor="false" --http_credentials="/tmp/Endpoint_SlaveEndpointTest_UnauthorizedRequest_0_u6NRRq/http_credentials"
--http_heartbeat_interval="30secs" --initialize_driver_logging="true" --isolation="posix/cpu,posix/mem"
--launcher="posix" --launcher_dir="/mesos/mesos-1.5.0/_build/src" --logbufsecs="0" --logging_level="INFO"
--max_completed_executors_per_framework="150" --oversubscribed_resources_interval="15secs"
--perf_duration="10secs" --perf_interval="1mins" --port="5051" --qos_correction_interval_min="0ns"
--quiet="false" --recover="reconnect" --recovery_timeout="15mins" --registration_backoff_factor="10ms"
--resources="cpus:2;gpus:0;mem:1024;disk:1024;ports:[31000-32000]" --revocable_cpu_low_priority="true"
--runtime_dir="/tmp/Endpoint_SlaveEndpointTest_UnauthorizedRequest_0_u6NRRq" --sandbox_directory="/mnt/mesos/sandbox"
--strict="true" --switch_user="true" --systemd_enable_support="true" --systemd_runtime_directory="/run/systemd/system"
--version="false" --work_dir="/tmp/Endpoint_SlaveEndpointTest_UnauthorizedRequest_0_Sf28iC"
I0826 14:13:17.694530  5721 credentials.hpp:86] Loading credential for authentication from
'/tmp/Endpoint_SlaveEndpointTest_UnauthorizedRequest_0_u6NRRq/credential'
I0826 14:13:17.694685  5721 slave.cpp:285] Agent using credential for: test-principal
I0826 14:13:17.694705  5721 credentials.hpp:37] Loading credentials for authentication from
'/tmp/Endpoint_SlaveEndpointTest_UnauthorizedRequest_0_u6NRRq/http_credentials'
I0826 14:13:17.695003  5721 http.cpp:1045] Creating default 'basic' HTTP authenticator for
realm 'mesos-agent-readonly'
I0826 14:13:17.695205  5721 http.cpp:1045] Creating default 'basic' HTTP authenticator for
realm 'mesos-agent-readwrite'
I0826 14:13:17.697139  5721 slave.cpp:581] Agent resources: [{"name":"cpus","scalar":{"value":2.0},"type":"SCALAR"},{"name":"mem","scalar":{"value":1024.0},"type":"SCALAR"},{"name":"disk","scalar":{"value":1024.0},"type":"SCALAR"},{"name":"ports","ranges":{"range":[{"begin":31000,"end":32000}]},"type":"RANGES"}]
I0826 14:13:17.697362  5721 slave.cpp:589] Agent attributes: [  ]
I0826 14:13:17.697376  5721 slave.cpp:598] Agent hostname: 6f93bbe13caf
I0826 14:13:17.697494  5726 status_update_manager.cpp:177] Pausing sending status updates
I0826 14:13:17.698784  5722 state.cpp:64] Recovering state from '/tmp/Endpoint_SlaveEndpointTest_UnauthorizedRequest_0_Sf28iC/meta'
I0826 14:13:17.699137  5724 status_update_manager.cpp:203] Recovering status update manager
I0826 14:13:17.699331  5727 containerizer.cpp:643] Recovering containerizer
I0826 14:13:17.700501  5710 provisioner.cpp:416] Provisioner recovery complete
I0826 14:13:17.701006  5721 slave.cpp:6264] Finished recovery
I0826 14:13:17.701496  5721 slave.cpp:6446] Querying resource estimator for oversubscribable
resources
I0826 14:13:17.701740  5706 slave.cpp:6460] Received oversubscribable resources {} from the
resource estimator
I0826 14:13:17.703873  5720 process.cpp:3933] Handling HTTP event for process 'slave(804)'
with path: '/slave(804)/monitor/statistics'
I0826 14:13:17.705103  5717 http.cpp:1185] HTTP GET for /slave(804)/monitor/statistics from
172.17.0.7:44972
I0826 14:13:17.705190  5717 http.cpp:976] Authorizing principal 'test-principal' to GET the
'/monitor/statistics' endpoint
I0826 14:13:17.706933  5709 slave.cpp:859] Agent terminating
[       OK ] Endpoint/SlaveEndpointTest.UnauthorizedRequest/0 (29 ms)
[ RUN      ] Endpoint/SlaveEndpointTest.UnauthorizedRequest/1
I0826 14:13:17.717730  5686 containerizer.cpp:288] Using isolation { environment_secret, posix/cpu,
posix/mem, filesystem/posix, network/cni }
W0826 14:13:17.718269  5686 backend.cpp:76] Failed to create 'aufs' backend: AufsBackend requires
root privileges
W0826 14:13:17.718387  5686 backend.cpp:76] Failed to create 'bind' backend: BindBackend requires
root privileges
I0826 14:13:17.718430  5686 provisioner.cpp:255] Using default backend 'copy'
I0826 14:13:17.722093  5726 slave.cpp:252] Mesos agent started on (805)@172.17.0.7:38927
I0826 14:13:17.722120  5726 slave.cpp:253] Flags at startup: --acls="" --appc_simple_discovery_uri_prefix="http://"
--appc_store_dir="/tmp/Endpoint_SlaveEndpointTest_UnauthorizedRequest_1_e0IJlH/store/appc"
--authenticate_http_readonly="true" --authenticate_http_readwrite="true" --authenticatee="crammd5"
--authentication_backoff_factor="1secs" --authorizer="local" --cgroups_cpu_enable_pids_and_tids_count="false"
--cgroups_enable_cfs="false" --cgroups_hierarchy="/sys/fs/cgroup" --cgroups_limit_swap="false"
--cgroups_root="mesos" --container_disk_watch_interval="15secs" --containerizers="mesos" --credential="/tmp/Endpoint_SlaveEndpointTest_UnauthorizedRequest_1_e0IJlH/credential"
--default_role="*" --disallow_sharing_agent_pid_namespace="false" --disk_watch_interval="1mins"
--docker="docker" --docker_kill_orphans="true" --docker_registry="https://registry-1.docker.io"
--docker_remove_delay="6hrs" --docker_socket="/var/run/docker.sock" --docker_stop_timeout="0ns"
--docker_store_dir="/tmp/Endpoint_SlaveEndpointTest_UnauthorizedRequest_1_e0IJlH/store/docker"
--docker_volume_checkpoint_dir="/var/run/mesos/isolators/docker/volume" --enforce_container_disk_quota="false"
--executor_registration_timeout="1mins" --executor_reregistration_timeout="2secs" --executor_shutdown_grace_period="5secs"
--fetcher_cache_dir="/tmp/Endpoint_SlaveEndpointTest_UnauthorizedRequest_1_e0IJlH/fetch" --fetcher_cache_size="2GB"
--frameworks_home="" --gc_delay="1weeks" --gc_disk_headroom="0.1" --hadoop_home="" --help="false"
--hostname_lookup="true" --http_command_executor="false" --http_credentials="/tmp/Endpoint_SlaveEndpointTest_UnauthorizedRequest_1_e0IJlH/http_credentials"
--http_heartbeat_interval="30secs" --initialize_driver_logging="true" --isolation="posix/cpu,posix/mem"
--launcher="posix" --launcher_dir="/mesos/mesos-1.5.0/_build/src" --logbufsecs="0" --logging_level="INFO"
--max_completed_executors_per_framework="150" --oversubscribed_resources_interval="15secs"
--perf_duration="10secs" --perf_interval="1mins" --port="5051" --qos_correction_interval_min="0ns"
--quiet="false" --recover="reconnect" --recovery_timeout="15mins" --registration_backoff_factor="10ms"
--resources="cpus:2;gpus:0;mem:1024;disk:1024;ports:[31000-32000]" --revocable_cpu_low_priority="true"
--runtime_dir="/tmp/Endpoint_SlaveEndpointTest_UnauthorizedRequest_1_e0IJlH" --sandbox_directory="/mnt/mesos/sandbox"
--strict="true" --switch_user="true" --systemd_enable_support="true" --systemd_runtime_directory="/run/systemd/system"
--version="false" --work_dir="/tmp/Endpoint_SlaveEndpointTest_UnauthorizedRequest_1_eTvGIS"
I0826 14:13:17.722510  5726 credentials.hpp:86] Loading credential for authentication from
'/tmp/Endpoint_SlaveEndpointTest_UnauthorizedRequest_1_e0IJlH/credential'
I0826 14:13:17.722669  5726 slave.cpp:285] Agent using credential for: test-principal
I0826 14:13:17.722692  5726 credentials.hpp:37] Loading credentials for authentication from
'/tmp/Endpoint_SlaveEndpointTest_UnauthorizedRequest_1_e0IJlH/http_credentials'
I0826 14:13:17.722925  5726 http.cpp:1045] Creating default 'basic' HTTP authenticator for
realm 'mesos-agent-readonly'
I0826 14:13:17.723090  5726 http.cpp:1045] Creating default 'basic' HTTP authenticator for
realm 'mesos-agent-readwrite'
I0826 14:13:17.724445  5726 slave.cpp:581] Agent resources: [{"name":"cpus","scalar":{"value":2.0},"type":"SCALAR"},{"name":"mem","scalar":{"value":1024.0},"type":"SCALAR"},{"name":"disk","scalar":{"value":1024.0},"type":"SCALAR"},{"name":"ports","ranges":{"range":[{"begin":31000,"end":32000}]},"type":"RANGES"}]
I0826 14:13:17.724683  5726 slave.cpp:589] Agent attributes: [  ]
I0826 14:13:17.724699  5726 slave.cpp:598] Agent hostname: 6f93bbe13caf
I0826 14:13:17.724843  5716 status_update_manager.cpp:177] Pausing sending status updates
I0826 14:13:17.726285  5721 state.cpp:64] Recovering state from '/tmp/Endpoint_SlaveEndpointTest_UnauthorizedRequest_1_eTvGIS/meta'
I0826 14:13:17.726526  5719 status_update_manager.cpp:203] Recovering status update manager
I0826 14:13:17.726716  5713 containerizer.cpp:643] Recovering containerizer
I0826 14:13:17.728257  5722 provisioner.cpp:416] Provisioner recovery complete
I0826 14:13:17.728590  5726 slave.cpp:6264] Finished recovery
I0826 14:13:17.729019  5726 slave.cpp:6446] Querying resource estimator for oversubscribable
resources
I0826 14:13:17.729214  5712 slave.cpp:6460] Received oversubscribable resources {} from the
resource estimator
I0826 14:13:17.731264  5717 process.cpp:3933] Handling HTTP event for process 'slave(805)'
with path: '/slave(805)/monitor/statistics.json'
I0826 14:13:17.732234  5719 http.cpp:1185] HTTP GET for /slave(805)/monitor/statistics.json
from 172.17.0.7:44974
I0826 14:13:17.732296  5719 http.cpp:976] Authorizing principal 'test-principal' to GET the
'/monitor/statistics.json' endpoint
I0826 14:13:17.734172  5686 slave.cpp:859] Agent terminating
[       OK ] Endpoint/SlaveEndpointTest.UnauthorizedRequest/1 (28 ms)
[ RUN      ] Endpoint/SlaveEndpointTest.UnauthorizedRequest/2
I0826 14:13:17.746307  5686 containerizer.cpp:288] Using isolation { environment_secret, posix/cpu,
posix/mem, filesystem/posix, network/cni }
W0826 14:13:17.746855  5686 backend.cpp:76] Failed to create 'aufs' backend: AufsBackend requires
root privileges
W0826 14:13:17.746965  5686 backend.cpp:76] Failed to create 'bind' backend: BindBackend requires
root privileges
I0826 14:13:17.747001  5686 provisioner.cpp:255] Using default backend 'copy'
I0826 14:13:17.750571  5708 slave.cpp:252] Mesos agent started on (806)@172.17.0.7:38927
I0826 14:13:17.750603  5708 slave.cpp:253] Flags at startup: --acls="" --appc_simple_discovery_uri_prefix="http://"
--appc_store_dir="/tmp/Endpoint_SlaveEndpointTest_UnauthorizedRequest_2_kfes6X/store/appc"
--authenticate_http_readonly="true" --authenticate_http_readwrite="true" --authenticatee="crammd5"
--authentication_backoff_factor="1secs" --authorizer="local" --cgroups_cpu_enable_pids_and_tids_count="false"
--cgroups_enable_cfs="false" --cgroups_hierarchy="/sys/fs/cgroup" --cgroups_limit_swap="false"
--cgroups_root="mesos" --container_disk_watch_interval="15secs" --containerizers="mesos" --credential="/tmp/Endpoint_SlaveEndpointTest_UnauthorizedRequest_2_kfes6X/credential"
--default_role="*" --disallow_sharing_agent_pid_namespace="false" --disk_watch_interval="1mins"
--docker="docker" --docker_kill_orphans="true" --docker_registry="https://registry-1.docker.io"
--docker_remove_delay="6hrs" --docker_socket="/var/run/docker.sock" --docker_stop_timeout="0ns"
--docker_store_dir="/tmp/Endpoint_SlaveEndpointTest_UnauthorizedRequest_2_kfes6X/store/docker"
--docker_volume_checkpoint_dir="/var/run/mesos/isolators/docker/volume" --enforce_container_disk_quota="false"
--executor_registration_timeout="1mins" --executor_reregistration_timeout="2secs" --executor_shutdown_grace_period="5secs"
--fetcher_cache_dir="/tmp/Endpoint_SlaveEndpointTest_UnauthorizedRequest_2_kfes6X/fetch" --fetcher_cache_size="2GB"
--frameworks_home="" --gc_delay="1weeks" --gc_disk_headroom="0.1" --hadoop_home="" --help="false"
--hostname_lookup="true" --http_command_executor="false" --http_credentials="/tmp/Endpoint_SlaveEndpointTest_UnauthorizedRequest_2_kfes6X/http_credentials"
--http_heartbeat_interval="30secs" --initialize_driver_logging="true" --isolation="posix/cpu,posix/mem"
--launcher="posix" --launcher_dir="/mesos/mesos-1.5.0/_build/src" --logbufsecs="0" --logging_level="INFO"
--max_completed_executors_per_framework="150" --oversubscribed_resources_interval="15secs"
--perf_duration="10secs" --perf_interval="1mins" --port="5051" --qos_correction_interval_min="0ns"
--quiet="false" --recover="reconnect" --recovery_timeout="15mins" --registration_backoff_factor="10ms"
--resources="cpus:2;gpus:0;mem:1024;disk:1024;ports:[31000-32000]" --revocable_cpu_low_priority="true"
--runtime_dir="/tmp/Endpoint_SlaveEndpointTest_UnauthorizedRequest_2_kfes6X" --sandbox_directory="/mnt/mesos/sandbox"
--strict="true" --switch_user="true" --systemd_enable_support="true" --systemd_runtime_directory="/run/systemd/system"
--version="false" --work_dir="/tmp/Endpoint_SlaveEndpointTest_UnauthorizedRequest_2_KIV8o9"
I0826 14:13:17.750979  5708 credentials.hpp:86] Loading credential for authentication from
'/tmp/Endpoint_SlaveEndpointTest_UnauthorizedRequest_2_kfes6X/credential'
I0826 14:13:17.751155  5708 slave.cpp:285] Agent using credential for: test-principal
I0826 14:13:17.751178  5708 credentials.hpp:37] Loading credentials for authentication from
'/tmp/Endpoint_SlaveEndpointTest_UnauthorizedRequest_2_kfes6X/http_credentials'
I0826 14:13:17.751431  5708 http.cpp:1045] Creating default 'basic' HTTP authenticator for
realm 'mesos-agent-readonly'
I0826 14:13:17.751600  5708 http.cpp:1045] Creating default 'basic' HTTP authenticator for
realm 'mesos-agent-readwrite'
I0826 14:13:17.753002  5708 slave.cpp:581] Agent resources: [{"name":"cpus","scalar":{"value":2.0},"type":"SCALAR"},{"name":"mem","scalar":{"value":1024.0},"type":"SCALAR"},{"name":"disk","scalar":{"value":1024.0},"type":"SCALAR"},{"name":"ports","ranges":{"range":[{"begin":31000,"end":32000}]},"type":"RANGES"}]
I0826 14:13:17.753238  5708 slave.cpp:589] Agent attributes: [  ]
I0826 14:13:17.753255  5708 slave.cpp:598] Agent hostname: 6f93bbe13caf
I0826 14:13:17.753430  5728 status_update_manager.cpp:177] Pausing sending status updates
I0826 14:13:17.754923  5718 state.cpp:64] Recovering state from '/tmp/Endpoint_SlaveEndpointTest_UnauthorizedRequest_2_KIV8o9/meta'
I0826 14:13:17.755228  5724 status_update_manager.cpp:203] Recovering status update manager
I0826 14:13:17.755410  5727 containerizer.cpp:643] Recovering containerizer
I0826 14:13:17.756590  5726 provisioner.cpp:416] Provisioner recovery complete
I0826 14:13:17.756974  5708 slave.cpp:6264] Finished recovery
I0826 14:13:17.757516  5708 slave.cpp:6446] Querying resource estimator for oversubscribable
resources
I0826 14:13:17.757741  5725 slave.cpp:6460] Received oversubscribable resources {} from the
resource estimator
I0826 14:13:17.760323  5728 process.cpp:3933] Handling HTTP event for process 'slave(806)'
with path: '/slave(806)/containers'
I0826 14:13:17.761772  5715 http.cpp:1185] HTTP GET for /slave(806)/containers from 172.17.0.7:44976
I0826 14:13:17.761883  5715 http.cpp:976] Authorizing principal 'test-principal' to GET the
'/containers' endpoint
I0826 14:13:17.764345  5686 slave.cpp:859] Agent terminating
[       OK ] Endpoint/SlaveEndpointTest.UnauthorizedRequest/2 (29 ms)
[ RUN      ] Endpoint/SlaveEndpointTest.NoAuthorizer/0
I0826 14:13:17.776839  5686 containerizer.cpp:288] Using isolation { environment_secret, posix/cpu,
posix/mem, filesystem/posix, network/cni }
W0826 14:13:17.777411  5686 backend.cpp:76] Failed to create 'aufs' backend: AufsBackend requires
root privileges
W0826 14:13:17.777534  5686 backend.cpp:76] Failed to create 'bind' backend: BindBackend requires
root privileges
I0826 14:13:17.777564  5686 provisioner.cpp:255] Using default backend 'copy'
I0826 14:13:17.779585  5686 cluster.cpp:448] Creating default 'local' authorizer
I0826 14:13:17.782109  5718 slave.cpp:252] Mesos agent started on (807)@172.17.0.7:38927
I0826 14:13:17.782131  5718 slave.cpp:253] Flags at startup: --acls="" --appc_simple_discovery_uri_prefix="http://"
--appc_store_dir="/tmp/Endpoint_SlaveEndpointTest_NoAuthorizer_0_cFLL8e/store/appc" --authenticate_http_readonly="true"
--authenticate_http_readwrite="true" --authenticatee="crammd5" --authentication_backoff_factor="1secs"
--authorizer="local" --cgroups_cpu_enable_pids_and_tids_count="false" --cgroups_enable_cfs="false"
--cgroups_hierarchy="/sys/fs/cgroup" --cgroups_limit_swap="false" --cgroups_root="mesos" --container_disk_watch_interval="15secs"
--containerizers="mesos" --credential="/tmp/Endpoint_SlaveEndpointTest_NoAuthorizer_0_cFLL8e/credential"
--default_role="*" --disallow_sharing_agent_pid_namespace="false" --disk_watch_interval="1mins"
--docker="docker" --docker_kill_orphans="true" --docker_registry="https://registry-1.docker.io"
--docker_remove_delay="6hrs" --docker_socket="/var/run/docker.sock" --docker_stop_timeout="0ns"
--docker_store_dir="/tmp/Endpoint_SlaveEndpointTest_NoAuthorizer_0_cFLL8e/store/docker" --docker_volume_checkpoint_dir="/var/run/mesos/isolators/docker/volume"
--enforce_container_disk_quota="false" --executor_registration_timeout="1mins" --executor_reregistration_timeout="2secs"
--executor_shutdown_grace_period="5secs" --fetcher_cache_dir="/tmp/Endpoint_SlaveEndpointTest_NoAuthorizer_0_cFLL8e/fetch"
--fetcher_cache_size="2GB" --frameworks_home="" --gc_delay="1weeks" --gc_disk_headroom="0.1"
--hadoop_home="" --help="false" --hostname_lookup="true" --http_command_executor="false" --http_credentials="/tmp/Endpoint_SlaveEndpointTest_NoAuthorizer_0_cFLL8e/http_credentials"
--http_heartbeat_interval="30secs" --initialize_driver_logging="true" --isolation="posix/cpu,posix/mem"
--launcher="posix" --launcher_dir="/mesos/mesos-1.5.0/_build/src" --logbufsecs="0" --logging_level="INFO"
--max_completed_executors_per_framework="150" --oversubscribed_resources_interval="15secs"
--perf_duration="10secs" --perf_interval="1mins" --port="5051" --qos_correction_interval_min="0ns"
--quiet="false" --recover="reconnect" --recovery_timeout="15mins" --registration_backoff_factor="10ms"
--resources="cpus:2;gpus:0;mem:1024;disk:1024;ports:[31000-32000]" --revocable_cpu_low_priority="true"
--runtime_dir="/tmp/Endpoint_SlaveEndpointTest_NoAuthorizer_0_cFLL8e" --sandbox_directory="/mnt/mesos/sandbox"
--strict="true" --switch_user="true" --systemd_enable_support="true" --systemd_runtime_directory="/run/systemd/system"
--version="false" --work_dir="/tmp/Endpoint_SlaveEndpointTest_NoAuthorizer_0_qHJ0mq"
I0826 14:13:17.782552  5718 credentials.hpp:86] Loading credential for authentication from
'/tmp/Endpoint_SlaveEndpointTest_NoAuthorizer_0_cFLL8e/credential'
I0826 14:13:17.782711  5718 slave.cpp:285] Agent using credential for: test-principal
I0826 14:13:17.782732  5718 credentials.hpp:37] Loading credentials for authentication from
'/tmp/Endpoint_SlaveEndpointTest_NoAuthorizer_0_cFLL8e/http_credentials'
I0826 14:13:17.783004  5718 http.cpp:1045] Creating default 'basic' HTTP authenticator for
realm 'mesos-agent-readonly'
I0826 14:13:17.783155  5718 http.cpp:1045] Creating default 'basic' HTTP authenticator for
realm 'mesos-agent-readwrite'
I0826 14:13:17.784469  5718 slave.cpp:581] Agent resources: [{"name":"cpus","scalar":{"value":2.0},"type":"SCALAR"},{"name":"mem","scalar":{"value":1024.0},"type":"SCALAR"},{"name":"disk","scalar":{"value":1024.0},"type":"SCALAR"},{"name":"ports","ranges":{"range":[{"begin":31000,"end":32000}]},"type":"RANGES"}]
I0826 14:13:17.784704  5718 slave.cpp:589] Agent attributes: [  ]
I0826 14:13:17.784718  5718 slave.cpp:598] Agent hostname: 6f93bbe13caf
I0826 14:13:17.784858  5721 status_update_manager.cpp:177] Pausing sending status updates
I0826 14:13:17.786248  5725 state.cpp:64] Recovering state from '/tmp/Endpoint_SlaveEndpointTest_NoAuthorizer_0_qHJ0mq/meta'
I0826 14:13:17.786634  5727 status_update_manager.cpp:203] Recovering status update manager
I0826 14:13:17.786861  5724 containerizer.cpp:643] Recovering containerizer
I0826 14:13:17.788602  5714 provisioner.cpp:416] Provisioner recovery complete
I0826 14:13:17.789098  5717 slave.cpp:6264] Finished recovery
I0826 14:13:17.789768  5717 slave.cpp:6446] Querying resource estimator for oversubscribable
resources
I0826 14:13:17.790006  5723 slave.cpp:6460] Received oversubscribable resources {} from the
resource estimator
I0826 14:13:17.793071  5708 process.cpp:3933] Handling HTTP event for process 'slave(807)'
with path: '/slave(807)/monitor/statistics'
I0826 14:13:17.794366  5716 http.cpp:1185] HTTP GET for /slave(807)/monitor/statistics from
172.17.0.7:44978
I0826 14:13:17.794458  5716 http.cpp:976] Authorizing principal 'test-principal' to GET the
'/monitor/statistics' endpoint
I0826 14:13:17.797890  5710 slave.cpp:859] Agent terminating
[       OK ] Endpoint/SlaveEndpointTest.NoAuthorizer/0 (32 ms)
[ RUN      ] Endpoint/SlaveEndpointTest.NoAuthorizer/1
I0826 14:13:17.810444  5686 containerizer.cpp:288] Using isolation { environment_secret, posix/cpu,
posix/mem, filesystem/posix, network/cni }
W0826 14:13:17.811034  5686 backend.cpp:76] Failed to create 'aufs' backend: AufsBackend requires
root privileges
W0826 14:13:17.811158  5686 backend.cpp:76] Failed to create 'bind' backend: BindBackend requires
root privileges
I0826 14:13:17.811202  5686 provisioner.cpp:255] Using default backend 'copy'
I0826 14:13:17.813052  5686 cluster.cpp:448] Creating default 'local' authorizer
I0826 14:13:17.815042  5714 slave.cpp:252] Mesos agent started on (808)@172.17.0.7:38927
I0826 14:13:17.815089  5714 slave.cpp:253] Flags at startup: --acls="" --appc_simple_discovery_uri_prefix="http://"
--appc_store_dir="/tmp/Endpoint_SlaveEndpointTest_NoAuthorizer_1_xsFwuw/store/appc" --authenticate_http_readonly="true"
--authenticate_http_readwrite="true" --authenticatee="crammd5" --authentication_backoff_factor="1secs"
--authorizer="local" --cgroups_cpu_enable_pids_and_tids_count="false" --cgroups_enable_cfs="false"
--cgroups_hierarchy="/sys/fs/cgroup" --cgroups_limit_swap="false" --cgroups_root="mesos" --container_disk_watch_interval="15secs"
--containerizers="mesos" --credential="/tmp/Endpoint_SlaveEndpointTest_NoAuthorizer_1_xsFwuw/credential"
--default_role="*" --disallow_sharing_agent_pid_namespace="false" --disk_watch_interval="1mins"
--docker="docker" --docker_kill_orphans="true" --docker_registry="https://registry-1.docker.io"
--docker_remove_delay="6hrs" --docker_socket="/var/run/docker.sock" --docker_stop_timeout="0ns"
--docker_store_dir="/tmp/Endpoint_SlaveEndpointTest_NoAuthorizer_1_xsFwuw/store/docker" --docker_volume_checkpoint_dir="/var/run/mesos/isolators/docker/volume"
--enforce_container_disk_quota="false" --executor_registration_timeout="1mins" --executor_reregistration_timeout="2secs"
--executor_shutdown_grace_period="5secs" --fetcher_cache_dir="/tmp/Endpoint_SlaveEndpointTest_NoAuthorizer_1_xsFwuw/fetch"
--fetcher_cache_size="2GB" --frameworks_home="" --gc_delay="1weeks" --gc_disk_headroom="0.1"
--hadoop_home="" --help="false" --hostname_lookup="true" --http_command_executor="false" --http_credentials="/tmp/Endpoint_SlaveEndpointTest_NoAuthorizer_1_xsFwuw/http_credentials"
--http_heartbeat_interval="30secs" --initialize_driver_logging="true" --isolation="posix/cpu,posix/mem"
--launcher="posix" --launcher_dir="/mesos/mesos-1.5.0/_build/src" --logbufsecs="0" --logging_level="INFO"
--max_completed_executors_per_framework="150" --oversubscribed_resources_interval="15secs"
--perf_duration="10secs" --perf_interval="1mins" --port="5051" --qos_correction_interval_min="0ns"
--quiet="false" --recover="reconnect" --recovery_timeout="15mins" --registration_backoff_factor="10ms"
--resources="cpus:2;gpus:0;mem:1024;disk:1024;ports:[31000-32000]" --revocable_cpu_low_priority="true"
--runtime_dir="/tmp/Endpoint_SlaveEndpointTest_NoAuthorizer_1_xsFwuw" --sandbox_directory="/mnt/mesos/sandbox"
--strict="true" --switch_user="true" --systemd_enable_support="true" --systemd_runtime_directory="/run/systemd/system"
--version="false" --work_dir="/tmp/Endpoint_SlaveEndpointTest_NoAuthorizer_1_tdvSDH"
I0826 14:13:17.815644  5714 credentials.hpp:86] Loading credential for authentication from
'/tmp/Endpoint_SlaveEndpointTest_NoAuthorizer_1_xsFwuw/credential'
I0826 14:13:17.815834  5714 slave.cpp:285] Agent using credential for: test-principal
I0826 14:13:17.815878  5714 credentials.hpp:37] Loading credentials for authentication from
'/tmp/Endpoint_SlaveEndpointTest_NoAuthorizer_1_xsFwuw/http_credentials'
I0826 14:13:17.816160  5714 http.cpp:1045] Creating default 'basic' HTTP authenticator for
realm 'mesos-agent-readonly'
I0826 14:13:17.816337  5714 http.cpp:1045] Creating default 'basic' HTTP authenticator for
realm 'mesos-agent-readwrite'
I0826 14:13:17.817893  5714 slave.cpp:581] Agent resources: [{"name":"cpus","scalar":{"value":2.0},"type":"SCALAR"},{"name":"mem","scalar":{"value":1024.0},"type":"SCALAR"},{"name":"disk","scalar":{"value":1024.0},"type":"SCALAR"},{"name":"ports","ranges":{"range":[{"begin":31000,"end":32000}]},"type":"RANGES"}]
I0826 14:13:17.818194  5714 slave.cpp:589] Agent attributes: [  ]
I0826 14:13:17.818231  5714 slave.cpp:598] Agent hostname: 6f93bbe13caf
I0826 14:13:17.818378  5710 status_update_manager.cpp:177] Pausing sending status updates
I0826 14:13:17.819895  5720 state.cpp:64] Recovering state from '/tmp/Endpoint_SlaveEndpointTest_NoAuthorizer_1_tdvSDH/meta'
I0826 14:13:17.820372  5723 status_update_manager.cpp:203] Recovering status update manager
I0826 14:13:17.820544  5725 containerizer.cpp:643] Recovering containerizer
I0826 14:13:17.822027  5726 provisioner.cpp:416] Provisioner recovery complete
I0826 14:13:17.822351  5724 slave.cpp:6264] Finished recovery
I0826 14:13:17.822791  5724 slave.cpp:6446] Querying resource estimator for oversubscribable
resources
I0826 14:13:17.823235  5715 slave.cpp:6460] Received oversubscribable resources {} from the
resource estimator
I0826 14:13:17.825891  5722 process.cpp:3933] Handling HTTP event for process 'slave(808)'
with path: '/slave(808)/monitor/statistics.json'
I0826 14:13:17.827208  5718 http.cpp:1185] HTTP GET for /slave(808)/monitor/statistics.json
from 172.17.0.7:44982
I0826 14:13:17.827280  5718 http.cpp:976] Authorizing principal 'test-principal' to GET the
'/monitor/statistics.json' endpoint
I0826 14:13:17.837038  5686 slave.cpp:859] Agent terminating
[       OK ] Endpoint/SlaveEndpointTest.NoAuthorizer/1 (40 ms)
[ RUN      ] Endpoint/SlaveEndpointTest.NoAuthorizer/2
I0826 14:13:17.848572  5686 containerizer.cpp:288] Using isolation { environment_secret, posix/cpu,
posix/mem, filesystem/posix, network/cni }
W0826 14:13:17.849058  5686 backend.cpp:76] Failed to create 'aufs' backend: AufsBackend requires
root privileges
W0826 14:13:17.849151  5686 backend.cpp:76] Failed to create 'bind' backend: BindBackend requires
root privileges
I0826 14:13:17.849179  5686 provisioner.cpp:255] Using default backend 'copy'
I0826 14:13:17.850692  5686 cluster.cpp:448] Creating default 'local' authorizer
I0826 14:13:17.852430  5712 slave.cpp:252] Mesos agent started on (809)@172.17.0.7:38927
I0826 14:13:17.852453  5712 slave.cpp:253] Flags at startup: --acls="" --appc_simple_discovery_uri_prefix="http://"
--appc_store_dir="/tmp/Endpoint_SlaveEndpointTest_NoAuthorizer_2_kYtZcO/store/appc" --authenticate_http_readonly="true"
--authenticate_http_readwrite="true" --authenticatee="crammd5" --authentication_backoff_factor="1secs"
--authorizer="local" --cgroups_cpu_enable_pids_and_tids_count="false" --cgroups_enable_cfs="false"
--cgroups_hierarchy="/sys/fs/cgroup" --cgroups_limit_swap="false" --cgroups_root="mesos" --container_disk_watch_interval="15secs"
--containerizers="mesos" --credential="/tmp/Endpoint_SlaveEndpointTest_NoAuthorizer_2_kYtZcO/credential"
--default_role="*" --disallow_sharing_agent_pid_namespace="false" --disk_watch_interval="1mins"
--docker="docker" --docker_kill_orphans="true" --docker_registry="https://registry-1.docker.io"
--docker_remove_delay="6hrs" --docker_socket="/var/run/docker.sock" --docker_stop_timeout="0ns"
--docker_store_dir="/tmp/Endpoint_SlaveEndpointTest_NoAuthorizer_2_kYtZcO/store/docker" --docker_volume_checkpoint_dir="/var/run/mesos/isolators/docker/volume"
--enforce_container_disk_quota="false" --executor_registration_timeout="1mins" --executor_reregistration_timeout="2secs"
--executor_shutdown_grace_period="5secs" --fetcher_cache_dir="/tmp/Endpoint_SlaveEndpointTest_NoAuthorizer_2_kYtZcO/fetch"
--fetcher_cache_size="2GB" --frameworks_home="" --gc_delay="1weeks" --gc_disk_headroom="0.1"
--hadoop_home="" --help="false" --hostname_lookup="true" --http_command_executor="false" --http_credentials="/tmp/Endpoint_SlaveEndpointTest_NoAuthorizer_2_kYtZcO/http_credentials"
--http_heartbeat_interval="30secs" --initialize_driver_logging="true" --isolation="posix/cpu,posix/mem"
--launcher="posix" --launcher_dir="/mesos/mesos-1.5.0/_build/src" --logbufsecs="0" --logging_level="INFO"
--max_completed_executors_per_framework="150" --oversubscribed_resources_interval="15secs"
--perf_duration="10secs" --perf_interval="1mins" --port="5051" --qos_correction_interval_min="0ns"
--quiet="false" --recover="reconnect" --recovery_timeout="15mins" --registration_backoff_factor="10ms"
--resources="cpus:2;gpus:0;mem:1024;disk:1024;ports:[31000-32000]" --revocable_cpu_low_priority="true"
--runtime_dir="/tmp/Endpoint_SlaveEndpointTest_NoAuthorizer_2_kYtZcO" --sandbox_directory="/mnt/mesos/sandbox"
--strict="true" --switch_user="true" --systemd_enable_support="true" --systemd_runtime_directory="/run/systemd/system"
--version="false" --work_dir="/tmp/Endpoint_SlaveEndpointTest_NoAuthorizer_2_opRqgZ"
I0826 14:13:17.852759  5712 credentials.hpp:86] Loading credential for authentication from
'/tmp/Endpoint_SlaveEndpointTest_NoAuthorizer_2_kYtZcO/credential'
I0826 14:13:17.852929  5712 slave.cpp:285] Agent using credential for: test-principal
I0826 14:13:17.852951  5712 credentials.hpp:37] Loading credentials for authentication from
'/tmp/Endpoint_SlaveEndpointTest_NoAuthorizer_2_kYtZcO/http_credentials'
I0826 14:13:17.853147  5712 http.cpp:1045] Creating default 'basic' HTTP authenticator for
realm 'mesos-agent-readonly'
I0826 14:13:17.853281  5712 http.cpp:1045] Creating default 'basic' HTTP authenticator for
realm 'mesos-agent-readwrite'
I0826 14:13:17.854442  5712 slave.cpp:581] Agent resources: [{"name":"cpus","scalar":{"value":2.0},"type":"SCALAR"},{"name":"mem","scalar":{"value":1024.0},"type":"SCALAR"},{"name":"disk","scalar":{"value":1024.0},"type":"SCALAR"},{"name":"ports","ranges":{"range":[{"begin":31000,"end":32000}]},"type":"RANGES"}]
I0826 14:13:17.854645  5712 slave.cpp:589] Agent attributes: [  ]
I0826 14:13:17.854657  5712 slave.cpp:598] Agent hostname: 6f93bbe13caf
I0826 14:13:17.854760  5727 status_update_manager.cpp:177] Pausing sending status updates
I0826 14:13:17.855901  5722 state.cpp:64] Recovering state from '/tmp/Endpoint_SlaveEndpointTest_NoAuthorizer_2_opRqgZ/meta'
I0826 14:13:17.856253  5716 status_update_manager.cpp:203] Recovering status update manager
I0826 14:13:17.856441  5728 containerizer.cpp:643] Recovering containerizer
I0826 14:13:17.857684  5711 provisioner.cpp:416] Provisioner recovery complete
I0826 14:13:17.857985  5725 slave.cpp:6264] Finished recovery
I0826 14:13:17.858362  5725 slave.cpp:6446] Querying resource estimator for oversubscribable
resources
I0826 14:13:17.858577  5713 slave.cpp:6460] Received oversubscribable resources {} from the
resource estimator
I0826 14:13:17.860982  5724 process.cpp:3933] Handling HTTP event for process 'slave(809)'
with path: '/slave(809)/containers'
I0826 14:13:17.862361  5716 http.cpp:1185] HTTP GET for /slave(809)/containers from 172.17.0.7:44984
I0826 14:13:17.862423  5716 http.cpp:976] Authorizing principal 'test-principal' to GET the
'/containers' endpoint
I0826 14:13:17.865912  5686 slave.cpp:859] Agent terminating
[       OK ] Endpoint/SlaveEndpointTest.NoAuthorizer/2 (28 ms)
[----------] 9 tests from Endpoint/SlaveEndpointTest (313 ms total)

[----------] 2 tests from ContainerizerType/DefaultContainerDNSFlagTest
[ RUN      ] ContainerizerType/DefaultContainerDNSFlagTest.ValidateFlag/0
[       OK ] ContainerizerType/DefaultContainerDNSFlagTest.ValidateFlag/0 (9 ms)
[ RUN      ] ContainerizerType/DefaultContainerDNSFlagTest.ValidateFlag/1
[       OK ] ContainerizerType/DefaultContainerDNSFlagTest.ValidateFlag/1 (8 ms)
[----------] 2 tests from ContainerizerType/DefaultContainerDNSFlagTest (17 ms total)

[----------] Global test environment tear-down
[==========] 1661 tests from 182 test cases ran. (497150 ms total)
[  PASSED  ] 1660 tests.
[  FAILED  ] 1 test, listed below:
[  FAILED  ] ExamplesTest.TestFramework

 1 FAILED TEST
  YOU HAVE 20 DISABLED TESTS

I0826 14:13:17.946470  5729 process.cpp:1072] Failed to accept socket: future discarded
make[4]: *** [check-local] Error 1
make[4]: Leaving directory `/mesos/mesos-1.5.0/_build/src'
make[3]: *** [check-am] Error 2
make[3]: Leaving directory `/mesos/mesos-1.5.0/_build/src'
make[2]: *** [check] Error 2
make[2]: Leaving directory `/mesos/mesos-1.5.0/_build/src'
make[1]: *** [check-recursive] Error 1
make[1]: Leaving directory `/mesos/mesos-1.5.0/_build'
make: *** [distcheck] Error 1
+ docker rmi mesos-1503753688-15869
Untagged: mesos-1503753688-15869:latest
Deleted: sha256:d6c70dbc69ae359ddb045489e382073c6b8ba84f4d4eff5dca74966c81af1427
Deleted: sha256:81d08e8c9814b9ab052701d026827417f5d3458cab1d2dfb37f19dac9fbacaed
Deleted: sha256:1c86df571c26f88a1bb9f8f434e8c84f9600a91104745a6e538ec99a1b7b5655
Deleted: sha256:ef9a04b474be93bac84d98ab41d8c8269a0771382f255e377c9f342b0cc19295
Deleted: sha256:007bf2fec157556424ac0a33d07a28cbcc23728ca3d71bc29c53a09ffa7d0a17
Deleted: sha256:2aee27bd08b68a4e79dd45333ba29b2b9d9032389b37e34f6a53123cb8054469
Deleted: sha256:b55e627780fb87b31940eaf13a4f88d1aa7dd9537c148f8b2ea2d6ad23fece22
Deleted: sha256:a84f2c7bee3587db7e3ba5211de555d5a16fbeb753fbd3b1034d2cf09341704e
Deleted: sha256:11d961b9814dbabe58b8d70afe02044dd1560e125ef6f212958ba77bfb5ce732
Deleted: sha256:ca8992c4f78cc23a27cbf32958eed7ca34c229421d09180d3258c42c7ffac9e4
Deleted: sha256:912e7509ba63cdaf81b97e81254c98b9d1fc7db76d4f51b2709d9f6562c26742
Deleted: sha256:8173d1e71adc8a4e570e7e42da185960769441d6b2dddb99f7a4b383acf34c28
Deleted: sha256:8a39f94b72cde2819e32703da4ac176393b0674ea440e757520f8d7a9c634c94
Deleted: sha256:8e0526b93bb3ce3947ecedb0423d11ad52d7786c1ab06217b80a7d87770bfd5a
Deleted: sha256:7b582b5ff54f3f963800bce0106de2c695e749c14de5cb4bb341d47f1f6098c6
Deleted: sha256:e39dbba254d31026b6e8dc6ea2a0b94709a1be722dd7b8210be4dd2bff47dcab
Deleted: sha256:14c0513972a59be8cdce4164a66a0bb72ca4f8dc64d085bdd08897d510bd8e1e
Deleted: sha256:3f84cda0732371786bf7b16c45cec3cbc1e9d29c29f3ca210e241feff92974d7
Deleted: sha256:41f547eb31b073a9391db89583748c273d65bb0a0502d44b7f649b2c70f8da08
Deleted: sha256:d7281c8aa5941743219515dbb200349e6cf97e8806eaa11276085af602a34ebe
Deleted: sha256:d414414adac540ff2800b6ef3cf4dddffb3bd2cf3767456280845e7df97c646f
Deleted: sha256:54bffeb323d3f602f4ad10bb19eb25e2577f83076e7dd55ab89b3eaadbca9d82
Deleted: sha256:b49ef3aa12be055de77117644aae54283e6f176bd532009193f60946cfdac1aa
Deleted: sha256:081b8e6cf11e75c5a5cc3086d267fb753c448040dad0df2b2cea67027fd7094d
Build step 'Execute shell' marked build as failure

Mime
View raw message