mesos-builds mailing list archives

Site index · List index
Message view « Date » · « Thread »
Top « Date » · « Thread »
From Apache Jenkins Server <jenk...@builds.apache.org>
Subject Build failed in Jenkins: Mesos-Buildbot » autotools,gcc,--verbose,GLOG_v=1 MESOS_VERBOSE=1,centos:7,(ubuntu)&&(!ubuntu-us1)&&(!ubuntu-eu2) #4163
Date Mon, 28 Aug 2017 21:48:19 GMT
See <https://builds.apache.org/job/Mesos-Buildbot/BUILDTOOL=autotools,COMPILER=gcc,CONFIGURATION=--verbose,ENVIRONMENT=GLOG_v=1%20MESOS_VERBOSE=1,OS=centos%3A7,label_exp=(ubuntu)&&(!ubuntu-us1)&&(!ubuntu-eu2)/4163/display/redirect?page=changes>

Changes:

[Kapil Arya] Updated CHANGELOG for 1.4.0-rc3.

------------------------------------------
[...truncated 30.81 MB...]
I0828 21:48:04.932605  6607 http.cpp:1026] Creating default 'basic' HTTP authenticator for
realm 'mesos-agent-readonly'
I0828 21:48:04.932843  6607 http.cpp:1026] Creating default 'basic' HTTP authenticator for
realm 'mesos-agent-readwrite'
I0828 21:48:04.934375  6607 slave.cpp:565] Agent resources: [{"name":"cpus","scalar":{"value":2.0},"type":"SCALAR"},{"name":"mem","scalar":{"value":1024.0},"type":"SCALAR"},{"name":"disk","scalar":{"value":1024.0},"type":"SCALAR"},{"name":"ports","ranges":{"range":[{"begin":31000,"end":32000}]},"type":"RANGES"}]
I0828 21:48:04.934626  6607 slave.cpp:573] Agent attributes: [  ]
I0828 21:48:04.934644  6607 slave.cpp:582] Agent hostname: 3b7ca7caaca2
I0828 21:48:04.934824  6597 status_update_manager.cpp:177] Pausing sending status updates
I0828 21:48:04.936579  6608 state.cpp:64] Recovering state from '/tmp/Endpoint_SlaveEndpointTest_AuthorizedRequest_2_jWpvXH/meta'
I0828 21:48:04.936946  6591 status_update_manager.cpp:203] Recovering status update manager
I0828 21:48:04.937186  6605 containerizer.cpp:609] Recovering containerizer
I0828 21:48:04.938969  6602 provisioner.cpp:416] Provisioner recovery complete
I0828 21:48:04.939393  6607 slave.cpp:6271] Finished recovery
I0828 21:48:04.939971  6607 slave.cpp:6453] Querying resource estimator for oversubscribable
resources
I0828 21:48:04.940337  6587 slave.cpp:6467] Received oversubscribable resources {} from the
resource estimator
I0828 21:48:04.943634  6589 process.cpp:3933] Handling HTTP event for process 'slave(796)'
with path: '/slave(796)/containers'
I0828 21:48:04.945185  6600 http.cpp:1166] HTTP GET for /slave(796)/containers from 172.17.0.11:45600
I0828 21:48:04.945310  6600 http.cpp:957] Authorizing principal 'test-principal' to GET the
'/containers' endpoint
I0828 21:48:04.950601  6566 slave.cpp:843] Agent terminating
[       OK ] Endpoint/SlaveEndpointTest.AuthorizedRequest/2 (37 ms)
[ RUN      ] Endpoint/SlaveEndpointTest.UnauthorizedRequest/0
I0828 21:48:04.967655  6566 containerizer.cpp:246] Using isolation: posix/cpu,posix/mem,filesystem/posix,network/cni,environment_secret
W0828 21:48:04.968327  6566 backend.cpp:76] Failed to create 'aufs' backend: AufsBackend requires
root privileges
W0828 21:48:04.968473  6566 backend.cpp:76] Failed to create 'bind' backend: BindBackend requires
root privileges
I0828 21:48:04.968515  6566 provisioner.cpp:255] Using default backend 'copy'
I0828 21:48:04.973304  6608 slave.cpp:250] Mesos agent started on (797)@172.17.0.11:46469
I0828 21:48:04.973337  6608 slave.cpp:251] Flags at startup: --acls="" --appc_simple_discovery_uri_prefix="http://"
--appc_store_dir="/tmp/Endpoint_SlaveEndpointTest_UnauthorizedRequest_0_oXOM8t/store/appc"
--authenticate_http_readonly="true" --authenticate_http_readwrite="true" --authenticatee="crammd5"
--authentication_backoff_factor="1secs" --authorizer="local" --cgroups_cpu_enable_pids_and_tids_count="false"
--cgroups_enable_cfs="false" --cgroups_hierarchy="/sys/fs/cgroup" --cgroups_limit_swap="false"
--cgroups_root="mesos" --container_disk_watch_interval="15secs" --containerizers="mesos" --credential="/tmp/Endpoint_SlaveEndpointTest_UnauthorizedRequest_0_oXOM8t/credential"
--default_role="*" --disallow_sharing_agent_pid_namespace="false" --disk_watch_interval="1mins"
--docker="docker" --docker_kill_orphans="true" --docker_registry="https://registry-1.docker.io"
--docker_remove_delay="6hrs" --docker_socket="/var/run/docker.sock" --docker_stop_timeout="0ns"
--docker_store_dir="/tmp/Endpoint_SlaveEndpointTest_UnauthorizedRequest_0_oXOM8t/store/docker"
--docker_volume_checkpoint_dir="/var/run/mesos/isolators/docker/volume" --enforce_container_disk_quota="false"
--executor_registration_timeout="1mins" --executor_reregistration_timeout="2secs" --executor_shutdown_grace_period="5secs"
--fetcher_cache_dir="/tmp/Endpoint_SlaveEndpointTest_UnauthorizedRequest_0_oXOM8t/fetch" --fetcher_cache_size="2GB"
--frameworks_home="" --gc_delay="1weeks" --gc_disk_headroom="0.1" --hadoop_home="" --help="false"
--hostname_lookup="true" --http_command_executor="false" --http_credentials="/tmp/Endpoint_SlaveEndpointTest_UnauthorizedRequest_0_oXOM8t/http_credentials"
--http_heartbeat_interval="30secs" --initialize_driver_logging="true" --isolation="posix/cpu,posix/mem"
--launcher="posix" --launcher_dir="/mesos/mesos-1.4.0/_build/src" --logbufsecs="0" --logging_level="INFO"
--max_completed_executors_per_framework="150" --oversubscribed_resources_interval="15secs"
--perf_duration="10secs" --perf_interval="1mins" --port="5051" --qos_correction_interval_min="0ns"
--quiet="false" --recover="reconnect" --recovery_timeout="15mins" --registration_backoff_factor="10ms"
--resources="cpus:2;gpus:0;mem:1024;disk:1024;ports:[31000-32000]" --revocable_cpu_low_priority="true"
--runtime_dir="/tmp/Endpoint_SlaveEndpointTest_UnauthorizedRequest_0_oXOM8t" --sandbox_directory="/mnt/mesos/sandbox"
--strict="true" --switch_user="true" --systemd_enable_support="true" --systemd_runtime_directory="/run/systemd/system"
--version="false" --work_dir="/tmp/Endpoint_SlaveEndpointTest_UnauthorizedRequest_0_vXhktk"
I0828 21:48:04.973872  6608 credentials.hpp:86] Loading credential for authentication from
'/tmp/Endpoint_SlaveEndpointTest_UnauthorizedRequest_0_oXOM8t/credential'
I0828 21:48:04.974104  6608 slave.cpp:283] Agent using credential for: test-principal
I0828 21:48:04.974128  6608 credentials.hpp:37] Loading credentials for authentication from
'/tmp/Endpoint_SlaveEndpointTest_UnauthorizedRequest_0_oXOM8t/http_credentials'
I0828 21:48:04.974416  6608 http.cpp:1026] Creating default 'basic' HTTP authenticator for
realm 'mesos-agent-readonly'
I0828 21:48:04.974640  6608 http.cpp:1026] Creating default 'basic' HTTP authenticator for
realm 'mesos-agent-readwrite'
I0828 21:48:04.976260  6608 slave.cpp:565] Agent resources: [{"name":"cpus","scalar":{"value":2.0},"type":"SCALAR"},{"name":"mem","scalar":{"value":1024.0},"type":"SCALAR"},{"name":"disk","scalar":{"value":1024.0},"type":"SCALAR"},{"name":"ports","ranges":{"range":[{"begin":31000,"end":32000}]},"type":"RANGES"}]
I0828 21:48:04.976510  6608 slave.cpp:573] Agent attributes: [  ]
I0828 21:48:04.976526  6608 slave.cpp:582] Agent hostname: 3b7ca7caaca2
I0828 21:48:04.976703  6597 status_update_manager.cpp:177] Pausing sending status updates
I0828 21:48:04.978659  6596 state.cpp:64] Recovering state from '/tmp/Endpoint_SlaveEndpointTest_UnauthorizedRequest_0_vXhktk/meta'
I0828 21:48:04.979043  6595 status_update_manager.cpp:203] Recovering status update manager
I0828 21:48:04.979261  6587 containerizer.cpp:609] Recovering containerizer
I0828 21:48:04.980906  6594 provisioner.cpp:416] Provisioner recovery complete
I0828 21:48:04.981353  6604 slave.cpp:6271] Finished recovery
I0828 21:48:04.981906  6604 slave.cpp:6453] Querying resource estimator for oversubscribable
resources
I0828 21:48:04.982211  6593 slave.cpp:6467] Received oversubscribable resources {} from the
resource estimator
I0828 21:48:04.985137  6590 process.cpp:3933] Handling HTTP event for process 'slave(797)'
with path: '/slave(797)/monitor/statistics'
I0828 21:48:04.987135  6589 http.cpp:1166] HTTP GET for /slave(797)/monitor/statistics from
172.17.0.11:45602
I0828 21:48:04.987259  6589 http.cpp:957] Authorizing principal 'test-principal' to GET the
'/monitor/statistics' endpoint
I0828 21:48:04.989843  6586 slave.cpp:843] Agent terminating
[       OK ] Endpoint/SlaveEndpointTest.UnauthorizedRequest/0 (36 ms)
[ RUN      ] Endpoint/SlaveEndpointTest.UnauthorizedRequest/1
I0828 21:48:05.000799  6566 containerizer.cpp:246] Using isolation: posix/cpu,posix/mem,filesystem/posix,network/cni,environment_secret
W0828 21:48:05.001361  6566 backend.cpp:76] Failed to create 'aufs' backend: AufsBackend requires
root privileges
W0828 21:48:05.001456  6566 backend.cpp:76] Failed to create 'bind' backend: BindBackend requires
root privileges
I0828 21:48:05.001484  6566 provisioner.cpp:255] Using default backend 'copy'
I0828 21:48:05.004684  6587 slave.cpp:250] Mesos agent started on (798)@172.17.0.11:46469
I0828 21:48:05.004709  6587 slave.cpp:251] Flags at startup: --acls="" --appc_simple_discovery_uri_prefix="http://"
--appc_store_dir="/tmp/Endpoint_SlaveEndpointTest_UnauthorizedRequest_1_s4vo05/store/appc"
--authenticate_http_readonly="true" --authenticate_http_readwrite="true" --authenticatee="crammd5"
--authentication_backoff_factor="1secs" --authorizer="local" --cgroups_cpu_enable_pids_and_tids_count="false"
--cgroups_enable_cfs="false" --cgroups_hierarchy="/sys/fs/cgroup" --cgroups_limit_swap="false"
--cgroups_root="mesos" --container_disk_watch_interval="15secs" --containerizers="mesos" --credential="/tmp/Endpoint_SlaveEndpointTest_UnauthorizedRequest_1_s4vo05/credential"
--default_role="*" --disallow_sharing_agent_pid_namespace="false" --disk_watch_interval="1mins"
--docker="docker" --docker_kill_orphans="true" --docker_registry="https://registry-1.docker.io"
--docker_remove_delay="6hrs" --docker_socket="/var/run/docker.sock" --docker_stop_timeout="0ns"
--docker_store_dir="/tmp/Endpoint_SlaveEndpointTest_UnauthorizedRequest_1_s4vo05/store/docker"
--docker_volume_checkpoint_dir="/var/run/mesos/isolators/docker/volume" --enforce_container_disk_quota="false"
--executor_registration_timeout="1mins" --executor_reregistration_timeout="2secs" --executor_shutdown_grace_period="5secs"
--fetcher_cache_dir="/tmp/Endpoint_SlaveEndpointTest_UnauthorizedRequest_1_s4vo05/fetch" --fetcher_cache_size="2GB"
--frameworks_home="" --gc_delay="1weeks" --gc_disk_headroom="0.1" --hadoop_home="" --help="false"
--hostname_lookup="true" --http_command_executor="false" --http_credentials="/tmp/Endpoint_SlaveEndpointTest_UnauthorizedRequest_1_s4vo05/http_credentials"
--http_heartbeat_interval="30secs" --initialize_driver_logging="true" --isolation="posix/cpu,posix/mem"
--launcher="posix" --launcher_dir="/mesos/mesos-1.4.0/_build/src" --logbufsecs="0" --logging_level="INFO"
--max_completed_executors_per_framework="150" --oversubscribed_resources_interval="15secs"
--perf_duration="10secs" --perf_interval="1mins" --port="5051" --qos_correction_interval_min="0ns"
--quiet="false" --recover="reconnect" --recovery_timeout="15mins" --registration_backoff_factor="10ms"
--resources="cpus:2;gpus:0;mem:1024;disk:1024;ports:[31000-32000]" --revocable_cpu_low_priority="true"
--runtime_dir="/tmp/Endpoint_SlaveEndpointTest_UnauthorizedRequest_1_s4vo05" --sandbox_directory="/mnt/mesos/sandbox"
--strict="true" --switch_user="true" --systemd_enable_support="true" --systemd_runtime_directory="/run/systemd/system"
--version="false" --work_dir="/tmp/Endpoint_SlaveEndpointTest_UnauthorizedRequest_1_C6mLfW"
I0828 21:48:05.005039  6587 credentials.hpp:86] Loading credential for authentication from
'/tmp/Endpoint_SlaveEndpointTest_UnauthorizedRequest_1_s4vo05/credential'
I0828 21:48:05.005199  6587 slave.cpp:283] Agent using credential for: test-principal
I0828 21:48:05.005223  6587 credentials.hpp:37] Loading credentials for authentication from
'/tmp/Endpoint_SlaveEndpointTest_UnauthorizedRequest_1_s4vo05/http_credentials'
I0828 21:48:05.005436  6587 http.cpp:1026] Creating default 'basic' HTTP authenticator for
realm 'mesos-agent-readonly'
I0828 21:48:05.005631  6587 http.cpp:1026] Creating default 'basic' HTTP authenticator for
realm 'mesos-agent-readwrite'
I0828 21:48:05.007038  6587 slave.cpp:565] Agent resources: [{"name":"cpus","scalar":{"value":2.0},"type":"SCALAR"},{"name":"mem","scalar":{"value":1024.0},"type":"SCALAR"},{"name":"disk","scalar":{"value":1024.0},"type":"SCALAR"},{"name":"ports","ranges":{"range":[{"begin":31000,"end":32000}]},"type":"RANGES"}]
I0828 21:48:05.007273  6587 slave.cpp:573] Agent attributes: [  ]
I0828 21:48:05.007289  6587 slave.cpp:582] Agent hostname: 3b7ca7caaca2
I0828 21:48:05.007426  6591 status_update_manager.cpp:177] Pausing sending status updates
I0828 21:48:05.008996  6601 state.cpp:64] Recovering state from '/tmp/Endpoint_SlaveEndpointTest_UnauthorizedRequest_1_C6mLfW/meta'
I0828 21:48:05.009310  6604 status_update_manager.cpp:203] Recovering status update manager
I0828 21:48:05.009531  6597 containerizer.cpp:609] Recovering containerizer
I0828 21:48:05.010967  6602 provisioner.cpp:416] Provisioner recovery complete
I0828 21:48:05.011343  6586 slave.cpp:6271] Finished recovery
I0828 21:48:05.011821  6586 slave.cpp:6453] Querying resource estimator for oversubscribable
resources
I0828 21:48:05.012085  6590 slave.cpp:6467] Received oversubscribable resources {} from the
resource estimator
I0828 21:48:05.014636  6591 process.cpp:3933] Handling HTTP event for process 'slave(798)'
with path: '/slave(798)/monitor/statistics.json'
I0828 21:48:05.015835  6605 http.cpp:1166] HTTP GET for /slave(798)/monitor/statistics.json
from 172.17.0.11:45604
I0828 21:48:05.015905  6605 http.cpp:957] Authorizing principal 'test-principal' to GET the
'/monitor/statistics.json' endpoint
I0828 21:48:05.017783  6605 slave.cpp:843] Agent terminating
[       OK ] Endpoint/SlaveEndpointTest.UnauthorizedRequest/1 (28 ms)
[ RUN      ] Endpoint/SlaveEndpointTest.UnauthorizedRequest/2
I0828 21:48:05.028791  6566 containerizer.cpp:246] Using isolation: posix/cpu,posix/mem,filesystem/posix,network/cni,environment_secret
W0828 21:48:05.029299  6566 backend.cpp:76] Failed to create 'aufs' backend: AufsBackend requires
root privileges
W0828 21:48:05.029408  6566 backend.cpp:76] Failed to create 'bind' backend: BindBackend requires
root privileges
I0828 21:48:05.029435  6566 provisioner.cpp:255] Using default backend 'copy'
I0828 21:48:05.032768  6595 slave.cpp:250] Mesos agent started on (799)@172.17.0.11:46469
I0828 21:48:05.032795  6595 slave.cpp:251] Flags at startup: --acls="" --appc_simple_discovery_uri_prefix="http://"
--appc_store_dir="/tmp/Endpoint_SlaveEndpointTest_UnauthorizedRequest_2_tTNgfJ/store/appc"
--authenticate_http_readonly="true" --authenticate_http_readwrite="true" --authenticatee="crammd5"
--authentication_backoff_factor="1secs" --authorizer="local" --cgroups_cpu_enable_pids_and_tids_count="false"
--cgroups_enable_cfs="false" --cgroups_hierarchy="/sys/fs/cgroup" --cgroups_limit_swap="false"
--cgroups_root="mesos" --container_disk_watch_interval="15secs" --containerizers="mesos" --credential="/tmp/Endpoint_SlaveEndpointTest_UnauthorizedRequest_2_tTNgfJ/credential"
--default_role="*" --disallow_sharing_agent_pid_namespace="false" --disk_watch_interval="1mins"
--docker="docker" --docker_kill_orphans="true" --docker_registry="https://registry-1.docker.io"
--docker_remove_delay="6hrs" --docker_socket="/var/run/docker.sock" --docker_stop_timeout="0ns"
--docker_store_dir="/tmp/Endpoint_SlaveEndpointTest_UnauthorizedRequest_2_tTNgfJ/store/docker"
--docker_volume_checkpoint_dir="/var/run/mesos/isolators/docker/volume" --enforce_container_disk_quota="false"
--executor_registration_timeout="1mins" --executor_reregistration_timeout="2secs" --executor_shutdown_grace_period="5secs"
--fetcher_cache_dir="/tmp/Endpoint_SlaveEndpointTest_UnauthorizedRequest_2_tTNgfJ/fetch" --fetcher_cache_size="2GB"
--frameworks_home="" --gc_delay="1weeks" --gc_disk_headroom="0.1" --hadoop_home="" --help="false"
--hostname_lookup="true" --http_command_executor="false" --http_credentials="/tmp/Endpoint_SlaveEndpointTest_UnauthorizedRequest_2_tTNgfJ/http_credentials"
--http_heartbeat_interval="30secs" --initialize_driver_logging="true" --isolation="posix/cpu,posix/mem"
--launcher="posix" --launcher_dir="/mesos/mesos-1.4.0/_build/src" --logbufsecs="0" --logging_level="INFO"
--max_completed_executors_per_framework="150" --oversubscribed_resources_interval="15secs"
--perf_duration="10secs" --perf_interval="1mins" --port="5051" --qos_correction_interval_min="0ns"
--quiet="false" --recover="reconnect" --recovery_timeout="15mins" --registration_backoff_factor="10ms"
--resources="cpus:2;gpus:0;mem:1024;disk:1024;ports:[31000-32000]" --revocable_cpu_low_priority="true"
--runtime_dir="/tmp/Endpoint_SlaveEndpointTest_UnauthorizedRequest_2_tTNgfJ" --sandbox_directory="/mnt/mesos/sandbox"
--strict="true" --switch_user="true" --systemd_enable_support="true" --systemd_runtime_directory="/run/systemd/system"
--version="false" --work_dir="/tmp/Endpoint_SlaveEndpointTest_UnauthorizedRequest_2_wONqqz"
I0828 21:48:05.033310  6595 credentials.hpp:86] Loading credential for authentication from
'/tmp/Endpoint_SlaveEndpointTest_UnauthorizedRequest_2_tTNgfJ/credential'
I0828 21:48:05.033540  6595 slave.cpp:283] Agent using credential for: test-principal
I0828 21:48:05.033565  6595 credentials.hpp:37] Loading credentials for authentication from
'/tmp/Endpoint_SlaveEndpointTest_UnauthorizedRequest_2_tTNgfJ/http_credentials'
I0828 21:48:05.033843  6595 http.cpp:1026] Creating default 'basic' HTTP authenticator for
realm 'mesos-agent-readonly'
I0828 21:48:05.034036  6595 http.cpp:1026] Creating default 'basic' HTTP authenticator for
realm 'mesos-agent-readwrite'
I0828 21:48:05.035470  6595 slave.cpp:565] Agent resources: [{"name":"cpus","scalar":{"value":2.0},"type":"SCALAR"},{"name":"mem","scalar":{"value":1024.0},"type":"SCALAR"},{"name":"disk","scalar":{"value":1024.0},"type":"SCALAR"},{"name":"ports","ranges":{"range":[{"begin":31000,"end":32000}]},"type":"RANGES"}]
I0828 21:48:05.035730  6595 slave.cpp:573] Agent attributes: [  ]
I0828 21:48:05.035745  6595 slave.cpp:582] Agent hostname: 3b7ca7caaca2
I0828 21:48:05.035904  6606 status_update_manager.cpp:177] Pausing sending status updates
I0828 21:48:05.037467  6596 state.cpp:64] Recovering state from '/tmp/Endpoint_SlaveEndpointTest_UnauthorizedRequest_2_wONqqz/meta'
I0828 21:48:05.037744  6608 status_update_manager.cpp:203] Recovering status update manager
I0828 21:48:05.037926  6600 containerizer.cpp:609] Recovering containerizer
I0828 21:48:05.039392  6599 provisioner.cpp:416] Provisioner recovery complete
I0828 21:48:05.039710  6605 slave.cpp:6271] Finished recovery
I0828 21:48:05.040099  6605 slave.cpp:6453] Querying resource estimator for oversubscribable
resources
I0828 21:48:05.040323  6585 slave.cpp:6467] Received oversubscribable resources {} from the
resource estimator
I0828 21:48:05.042984  6603 process.cpp:3933] Handling HTTP event for process 'slave(799)'
with path: '/slave(799)/containers'
I0828 21:48:05.044190  6608 http.cpp:1166] HTTP GET for /slave(799)/containers from 172.17.0.11:45610
I0828 21:48:05.044255  6608 http.cpp:957] Authorizing principal 'test-principal' to GET the
'/containers' endpoint
I0828 21:48:05.046346  6566 slave.cpp:843] Agent terminating
[       OK ] Endpoint/SlaveEndpointTest.UnauthorizedRequest/2 (27 ms)
[ RUN      ] Endpoint/SlaveEndpointTest.NoAuthorizer/0
I0828 21:48:05.056733  6566 containerizer.cpp:246] Using isolation: posix/cpu,posix/mem,filesystem/posix,network/cni,environment_secret
W0828 21:48:05.057175  6566 backend.cpp:76] Failed to create 'aufs' backend: AufsBackend requires
root privileges
W0828 21:48:05.057271  6566 backend.cpp:76] Failed to create 'bind' backend: BindBackend requires
root privileges
I0828 21:48:05.057299  6566 provisioner.cpp:255] Using default backend 'copy'
I0828 21:48:05.058871  6566 cluster.cpp:448] Creating default 'local' authorizer
I0828 21:48:05.060734  6606 slave.cpp:250] Mesos agent started on (800)@172.17.0.11:46469
I0828 21:48:05.060752  6606 slave.cpp:251] Flags at startup: --acls="" --appc_simple_discovery_uri_prefix="http://"
--appc_store_dir="/tmp/Endpoint_SlaveEndpointTest_NoAuthorizer_0_GN9JKm/store/appc" --authenticate_http_readonly="true"
--authenticate_http_readwrite="true" --authenticatee="crammd5" --authentication_backoff_factor="1secs"
--authorizer="local" --cgroups_cpu_enable_pids_and_tids_count="false" --cgroups_enable_cfs="false"
--cgroups_hierarchy="/sys/fs/cgroup" --cgroups_limit_swap="false" --cgroups_root="mesos" --container_disk_watch_interval="15secs"
--containerizers="mesos" --credential="/tmp/Endpoint_SlaveEndpointTest_NoAuthorizer_0_GN9JKm/credential"
--default_role="*" --disallow_sharing_agent_pid_namespace="false" --disk_watch_interval="1mins"
--docker="docker" --docker_kill_orphans="true" --docker_registry="https://registry-1.docker.io"
--docker_remove_delay="6hrs" --docker_socket="/var/run/docker.sock" --docker_stop_timeout="0ns"
--docker_store_dir="/tmp/Endpoint_SlaveEndpointTest_NoAuthorizer_0_GN9JKm/store/docker" --docker_volume_checkpoint_dir="/var/run/mesos/isolators/docker/volume"
--enforce_container_disk_quota="false" --executor_registration_timeout="1mins" --executor_reregistration_timeout="2secs"
--executor_shutdown_grace_period="5secs" --fetcher_cache_dir="/tmp/Endpoint_SlaveEndpointTest_NoAuthorizer_0_GN9JKm/fetch"
--fetcher_cache_size="2GB" --frameworks_home="" --gc_delay="1weeks" --gc_disk_headroom="0.1"
--hadoop_home="" --help="false" --hostname_lookup="true" --http_command_executor="false" --http_credentials="/tmp/Endpoint_SlaveEndpointTest_NoAuthorizer_0_GN9JKm/http_credentials"
--http_heartbeat_interval="30secs" --initialize_driver_logging="true" --isolation="posix/cpu,posix/mem"
--launcher="posix" --launcher_dir="/mesos/mesos-1.4.0/_build/src" --logbufsecs="0" --logging_level="INFO"
--max_completed_executors_per_framework="150" --oversubscribed_resources_interval="15secs"
--perf_duration="10secs" --perf_interval="1mins" --port="5051" --qos_correction_interval_min="0ns"
--quiet="false" --recover="reconnect" --recovery_timeout="15mins" --registration_backoff_factor="10ms"
--resources="cpus:2;gpus:0;mem:1024;disk:1024;ports:[31000-32000]" --revocable_cpu_low_priority="true"
--runtime_dir="/tmp/Endpoint_SlaveEndpointTest_NoAuthorizer_0_GN9JKm" --sandbox_directory="/mnt/mesos/sandbox"
--strict="true" --switch_user="true" --systemd_enable_support="true" --systemd_runtime_directory="/run/systemd/system"
--version="false" --work_dir="/tmp/Endpoint_SlaveEndpointTest_NoAuthorizer_0_UmzMRc"
I0828 21:48:05.061110  6606 credentials.hpp:86] Loading credential for authentication from
'/tmp/Endpoint_SlaveEndpointTest_NoAuthorizer_0_GN9JKm/credential'
I0828 21:48:05.061269  6606 slave.cpp:283] Agent using credential for: test-principal
I0828 21:48:05.061290  6606 credentials.hpp:37] Loading credentials for authentication from
'/tmp/Endpoint_SlaveEndpointTest_NoAuthorizer_0_GN9JKm/http_credentials'
I0828 21:48:05.061502  6606 http.cpp:1026] Creating default 'basic' HTTP authenticator for
realm 'mesos-agent-readonly'
I0828 21:48:05.061647  6606 http.cpp:1026] Creating default 'basic' HTTP authenticator for
realm 'mesos-agent-readwrite'
I0828 21:48:05.062872  6606 slave.cpp:565] Agent resources: [{"name":"cpus","scalar":{"value":2.0},"type":"SCALAR"},{"name":"mem","scalar":{"value":1024.0},"type":"SCALAR"},{"name":"disk","scalar":{"value":1024.0},"type":"SCALAR"},{"name":"ports","ranges":{"range":[{"begin":31000,"end":32000}]},"type":"RANGES"}]
I0828 21:48:05.063086  6606 slave.cpp:573] Agent attributes: [  ]
I0828 21:48:05.063099  6606 slave.cpp:582] Agent hostname: 3b7ca7caaca2
I0828 21:48:05.063225  6592 status_update_manager.cpp:177] Pausing sending status updates
I0828 21:48:05.064803  6585 state.cpp:64] Recovering state from '/tmp/Endpoint_SlaveEndpointTest_NoAuthorizer_0_UmzMRc/meta'
I0828 21:48:05.065140  6602 status_update_manager.cpp:203] Recovering status update manager
I0828 21:48:05.065322  6594 containerizer.cpp:609] Recovering containerizer
I0828 21:48:05.066721  6596 provisioner.cpp:416] Provisioner recovery complete
I0828 21:48:05.067315  6590 slave.cpp:6271] Finished recovery
I0828 21:48:05.067873  6590 slave.cpp:6453] Querying resource estimator for oversubscribable
resources
I0828 21:48:05.068107  6607 slave.cpp:6467] Received oversubscribable resources {} from the
resource estimator
I0828 21:48:05.070771  6589 process.cpp:3933] Handling HTTP event for process 'slave(800)'
with path: '/slave(800)/monitor/statistics'
I0828 21:48:05.072095  6588 http.cpp:1166] HTTP GET for /slave(800)/monitor/statistics from
172.17.0.11:45612
I0828 21:48:05.072163  6588 http.cpp:957] Authorizing principal 'test-principal' to GET the
'/monitor/statistics' endpoint
I0828 21:48:05.075379  6566 slave.cpp:843] Agent terminating
[       OK ] Endpoint/SlaveEndpointTest.NoAuthorizer/0 (29 ms)
[ RUN      ] Endpoint/SlaveEndpointTest.NoAuthorizer/1
I0828 21:48:05.090623  6566 containerizer.cpp:246] Using isolation: posix/cpu,posix/mem,filesystem/posix,network/cni,environment_secret
W0828 21:48:05.091217  6566 backend.cpp:76] Failed to create 'aufs' backend: AufsBackend requires
root privileges
W0828 21:48:05.091349  6566 backend.cpp:76] Failed to create 'bind' backend: BindBackend requires
root privileges
I0828 21:48:05.091399  6566 provisioner.cpp:255] Using default backend 'copy'
I0828 21:48:05.093307  6566 cluster.cpp:448] Creating default 'local' authorizer
I0828 21:48:05.095283  6601 slave.cpp:250] Mesos agent started on (801)@172.17.0.11:46469
I0828 21:48:05.095309  6601 slave.cpp:251] Flags at startup: --acls="" --appc_simple_discovery_uri_prefix="http://"
--appc_store_dir="/tmp/Endpoint_SlaveEndpointTest_NoAuthorizer_1_Ky2oy0/store/appc" --authenticate_http_readonly="true"
--authenticate_http_readwrite="true" --authenticatee="crammd5" --authentication_backoff_factor="1secs"
--authorizer="local" --cgroups_cpu_enable_pids_and_tids_count="false" --cgroups_enable_cfs="false"
--cgroups_hierarchy="/sys/fs/cgroup" --cgroups_limit_swap="false" --cgroups_root="mesos" --container_disk_watch_interval="15secs"
--containerizers="mesos" --credential="/tmp/Endpoint_SlaveEndpointTest_NoAuthorizer_1_Ky2oy0/credential"
--default_role="*" --disallow_sharing_agent_pid_namespace="false" --disk_watch_interval="1mins"
--docker="docker" --docker_kill_orphans="true" --docker_registry="https://registry-1.docker.io"
--docker_remove_delay="6hrs" --docker_socket="/var/run/docker.sock" --docker_stop_timeout="0ns"
--docker_store_dir="/tmp/Endpoint_SlaveEndpointTest_NoAuthorizer_1_Ky2oy0/store/docker" --docker_volume_checkpoint_dir="/var/run/mesos/isolators/docker/volume"
--enforce_container_disk_quota="false" --executor_registration_timeout="1mins" --executor_reregistration_timeout="2secs"
--executor_shutdown_grace_period="5secs" --fetcher_cache_dir="/tmp/Endpoint_SlaveEndpointTest_NoAuthorizer_1_Ky2oy0/fetch"
--fetcher_cache_size="2GB" --frameworks_home="" --gc_delay="1weeks" --gc_disk_headroom="0.1"
--hadoop_home="" --help="false" --hostname_lookup="true" --http_command_executor="false" --http_credentials="/tmp/Endpoint_SlaveEndpointTest_NoAuthorizer_1_Ky2oy0/http_credentials"
--http_heartbeat_interval="30secs" --initialize_driver_logging="true" --isolation="posix/cpu,posix/mem"
--launcher="posix" --launcher_dir="/mesos/mesos-1.4.0/_build/src" --logbufsecs="0" --logging_level="INFO"
--max_completed_executors_per_framework="150" --oversubscribed_resources_interval="15secs"
--perf_duration="10secs" --perf_interval="1mins" --port="5051" --qos_correction_interval_min="0ns"
--quiet="false" --recover="reconnect" --recovery_timeout="15mins" --registration_backoff_factor="10ms"
--resources="cpus:2;gpus:0;mem:1024;disk:1024;ports:[31000-32000]" --revocable_cpu_low_priority="true"
--runtime_dir="/tmp/Endpoint_SlaveEndpointTest_NoAuthorizer_1_Ky2oy0" --sandbox_directory="/mnt/mesos/sandbox"
--strict="true" --switch_user="true" --systemd_enable_support="true" --systemd_runtime_directory="/run/systemd/system"
--version="false" --work_dir="/tmp/Endpoint_SlaveEndpointTest_NoAuthorizer_1_iphFAQ"
I0828 21:48:05.095755  6601 credentials.hpp:86] Loading credential for authentication from
'/tmp/Endpoint_SlaveEndpointTest_NoAuthorizer_1_Ky2oy0/credential'
I0828 21:48:05.095963  6601 slave.cpp:283] Agent using credential for: test-principal
I0828 21:48:05.095996  6601 credentials.hpp:37] Loading credentials for authentication from
'/tmp/Endpoint_SlaveEndpointTest_NoAuthorizer_1_Ky2oy0/http_credentials'
I0828 21:48:05.096266  6601 http.cpp:1026] Creating default 'basic' HTTP authenticator for
realm 'mesos-agent-readonly'
I0828 21:48:05.096474  6601 http.cpp:1026] Creating default 'basic' HTTP authenticator for
realm 'mesos-agent-readwrite'
I0828 21:48:05.097846  6601 slave.cpp:565] Agent resources: [{"name":"cpus","scalar":{"value":2.0},"type":"SCALAR"},{"name":"mem","scalar":{"value":1024.0},"type":"SCALAR"},{"name":"disk","scalar":{"value":1024.0},"type":"SCALAR"},{"name":"ports","ranges":{"range":[{"begin":31000,"end":32000}]},"type":"RANGES"}]
I0828 21:48:05.098075  6601 slave.cpp:573] Agent attributes: [  ]
I0828 21:48:05.098090  6601 slave.cpp:582] Agent hostname: 3b7ca7caaca2
I0828 21:48:05.098312  6595 status_update_manager.cpp:177] Pausing sending status updates
I0828 21:48:05.099938  6597 state.cpp:64] Recovering state from '/tmp/Endpoint_SlaveEndpointTest_NoAuthorizer_1_iphFAQ/meta'
I0828 21:48:05.100256  6600 status_update_manager.cpp:203] Recovering status update manager
I0828 21:48:05.100493  6604 containerizer.cpp:609] Recovering containerizer
I0828 21:48:05.102107  6602 provisioner.cpp:416] Provisioner recovery complete
I0828 21:48:05.102466  6594 slave.cpp:6271] Finished recovery
I0828 21:48:05.102908  6594 slave.cpp:6453] Querying resource estimator for oversubscribable
resources
I0828 21:48:05.103142  6591 slave.cpp:6467] Received oversubscribable resources {} from the
resource estimator
I0828 21:48:05.105916  6598 process.cpp:3933] Handling HTTP event for process 'slave(801)'
with path: '/slave(801)/monitor/statistics.json'
I0828 21:48:05.107317  6593 http.cpp:1166] HTTP GET for /slave(801)/monitor/statistics.json
from 172.17.0.11:45616
I0828 21:48:05.107393  6593 http.cpp:957] Authorizing principal 'test-principal' to GET the
'/monitor/statistics.json' endpoint
I0828 21:48:05.110644  6566 slave.cpp:843] Agent terminating
[       OK ] Endpoint/SlaveEndpointTest.NoAuthorizer/1 (34 ms)
[ RUN      ] Endpoint/SlaveEndpointTest.NoAuthorizer/2
I0828 21:48:05.121950  6566 containerizer.cpp:246] Using isolation: posix/cpu,posix/mem,filesystem/posix,network/cni,environment_secret
W0828 21:48:05.122481  6566 backend.cpp:76] Failed to create 'aufs' backend: AufsBackend requires
root privileges
W0828 21:48:05.122606  6566 backend.cpp:76] Failed to create 'bind' backend: BindBackend requires
root privileges
I0828 21:48:05.122638  6566 provisioner.cpp:255] Using default backend 'copy'
I0828 21:48:05.124416  6566 cluster.cpp:448] Creating default 'local' authorizer
I0828 21:48:05.126210  6595 slave.cpp:250] Mesos agent started on (802)@172.17.0.11:46469
I0828 21:48:05.126230  6595 slave.cpp:251] Flags at startup: --acls="" --appc_simple_discovery_uri_prefix="http://"
--appc_store_dir="/tmp/Endpoint_SlaveEndpointTest_NoAuthorizer_2_5FL9FE/store/appc" --authenticate_http_readonly="true"
--authenticate_http_readwrite="true" --authenticatee="crammd5" --authentication_backoff_factor="1secs"
--authorizer="local" --cgroups_cpu_enable_pids_and_tids_count="false" --cgroups_enable_cfs="false"
--cgroups_hierarchy="/sys/fs/cgroup" --cgroups_limit_swap="false" --cgroups_root="mesos" --container_disk_watch_interval="15secs"
--containerizers="mesos" --credential="/tmp/Endpoint_SlaveEndpointTest_NoAuthorizer_2_5FL9FE/credential"
--default_role="*" --disallow_sharing_agent_pid_namespace="false" --disk_watch_interval="1mins"
--docker="docker" --docker_kill_orphans="true" --docker_registry="https://registry-1.docker.io"
--docker_remove_delay="6hrs" --docker_socket="/var/run/docker.sock" --docker_stop_timeout="0ns"
--docker_store_dir="/tmp/Endpoint_SlaveEndpointTest_NoAuthorizer_2_5FL9FE/store/docker" --docker_volume_checkpoint_dir="/var/run/mesos/isolators/docker/volume"
--enforce_container_disk_quota="false" --executor_registration_timeout="1mins" --executor_reregistration_timeout="2secs"
--executor_shutdown_grace_period="5secs" --fetcher_cache_dir="/tmp/Endpoint_SlaveEndpointTest_NoAuthorizer_2_5FL9FE/fetch"
--fetcher_cache_size="2GB" --frameworks_home="" --gc_delay="1weeks" --gc_disk_headroom="0.1"
--hadoop_home="" --help="false" --hostname_lookup="true" --http_command_executor="false" --http_credentials="/tmp/Endpoint_SlaveEndpointTest_NoAuthorizer_2_5FL9FE/http_credentials"
--http_heartbeat_interval="30secs" --initialize_driver_logging="true" --isolation="posix/cpu,posix/mem"
--launcher="posix" --launcher_dir="/mesos/mesos-1.4.0/_build/src" --logbufsecs="0" --logging_level="INFO"
--max_completed_executors_per_framework="150" --oversubscribed_resources_interval="15secs"
--perf_duration="10secs" --perf_interval="1mins" --port="5051" --qos_correction_interval_min="0ns"
--quiet="false" --recover="reconnect" --recovery_timeout="15mins" --registration_backoff_factor="10ms"
--resources="cpus:2;gpus:0;mem:1024;disk:1024;ports:[31000-32000]" --revocable_cpu_low_priority="true"
--runtime_dir="/tmp/Endpoint_SlaveEndpointTest_NoAuthorizer_2_5FL9FE" --sandbox_directory="/mnt/mesos/sandbox"
--strict="true" --switch_user="true" --systemd_enable_support="true" --systemd_runtime_directory="/run/systemd/system"
--version="false" --work_dir="/tmp/Endpoint_SlaveEndpointTest_NoAuthorizer_2_tVoxDu"
I0828 21:48:05.126606  6595 credentials.hpp:86] Loading credential for authentication from
'/tmp/Endpoint_SlaveEndpointTest_NoAuthorizer_2_5FL9FE/credential'
I0828 21:48:05.126790  6595 slave.cpp:283] Agent using credential for: test-principal
I0828 21:48:05.126809  6595 credentials.hpp:37] Loading credentials for authentication from
'/tmp/Endpoint_SlaveEndpointTest_NoAuthorizer_2_5FL9FE/http_credentials'
I0828 21:48:05.127118  6595 http.cpp:1026] Creating default 'basic' HTTP authenticator for
realm 'mesos-agent-readonly'
I0828 21:48:05.127300  6595 http.cpp:1026] Creating default 'basic' HTTP authenticator for
realm 'mesos-agent-readwrite'
I0828 21:48:05.128927  6595 slave.cpp:565] Agent resources: [{"name":"cpus","scalar":{"value":2.0},"type":"SCALAR"},{"name":"mem","scalar":{"value":1024.0},"type":"SCALAR"},{"name":"disk","scalar":{"value":1024.0},"type":"SCALAR"},{"name":"ports","ranges":{"range":[{"begin":31000,"end":32000}]},"type":"RANGES"}]
I0828 21:48:05.129269  6595 slave.cpp:573] Agent attributes: [  ]
I0828 21:48:05.129300  6595 slave.cpp:582] Agent hostname: 3b7ca7caaca2
I0828 21:48:05.129456  6594 status_update_manager.cpp:177] Pausing sending status updates
I0828 21:48:05.131121  6585 state.cpp:64] Recovering state from '/tmp/Endpoint_SlaveEndpointTest_NoAuthorizer_2_tVoxDu/meta'
I0828 21:48:05.131438  6596 status_update_manager.cpp:203] Recovering status update manager
I0828 21:48:05.131664  6603 containerizer.cpp:609] Recovering containerizer
I0828 21:48:05.132982  6593 provisioner.cpp:416] Provisioner recovery complete
I0828 21:48:05.133383  6595 slave.cpp:6271] Finished recovery
I0828 21:48:05.133875  6595 slave.cpp:6453] Querying resource estimator for oversubscribable
resources
I0828 21:48:05.134169  6587 slave.cpp:6467] Received oversubscribable resources {} from the
resource estimator
I0828 21:48:05.136452  6607 process.cpp:3933] Handling HTTP event for process 'slave(802)'
with path: '/slave(802)/containers'
I0828 21:48:05.137625  6596 http.cpp:1166] HTTP GET for /slave(802)/containers from 172.17.0.11:45618
I0828 21:48:05.137687  6596 http.cpp:957] Authorizing principal 'test-principal' to GET the
'/containers' endpoint
I0828 21:48:05.141616  6566 slave.cpp:843] Agent terminating
[       OK ] Endpoint/SlaveEndpointTest.NoAuthorizer/2 (32 ms)
[----------] 9 tests from Endpoint/SlaveEndpointTest (302 ms total)

[----------] 2 tests from ContainerizerType/DefaultContainerDNSFlagTest
[ RUN      ] ContainerizerType/DefaultContainerDNSFlagTest.ValidateFlag/0
[       OK ] ContainerizerType/DefaultContainerDNSFlagTest.ValidateFlag/0 (17 ms)
[ RUN      ] ContainerizerType/DefaultContainerDNSFlagTest.ValidateFlag/1
[       OK ] ContainerizerType/DefaultContainerDNSFlagTest.ValidateFlag/1 (13 ms)
[----------] 2 tests from ContainerizerType/DefaultContainerDNSFlagTest (30 ms total)

[----------] Global test environment tear-down
[==========] 1652 tests from 182 test cases ran. (642470 ms total)
[  PASSED  ] 1647 tests.
[  FAILED  ] 5 tests, listed below:
[  FAILED  ] CommandExecutorCheckTest.CommandCheckDeliveredAndReconciled
[  FAILED  ] DefaultExecutorCheckTest.CommandCheckDeliveredAndReconciled
[  FAILED  ] DefaultExecutorCheckTest.CommandCheckStatusChange
[  FAILED  ] DefaultExecutorCheckTest.CommandCheckSeesParentsEnv
[  FAILED  ] DefaultExecutorCheckTest.CommandCheckSharesWorkDirWithTask

 5 FAILED TESTS
  YOU HAVE 20 DISABLED TESTS

I0828 21:48:05.234248  6609 process.cpp:1072] Failed to accept socket: future discarded
make[4]: *** [check-local] Error 1
make[4]: Leaving directory `/mesos/mesos-1.4.0/_build/src'
make[3]: *** [check-am] Error 2
make[3]: Leaving directory `/mesos/mesos-1.4.0/_build/src'
make[2]: *** [check] Error 2
make[2]: Leaving directory `/mesos/mesos-1.4.0/_build/src'
make[1]: *** [check-recursive] Error 1
make[1]: Leaving directory `/mesos/mesos-1.4.0/_build'
make: *** [distcheck] Error 1
+ docker rmi mesos-1503953994-8301
Untagged: mesos-1503953994-8301:latest
Deleted: sha256:1e39b178164bd5714c270f529016d421f8fcd677770dcceef6bca98ca4cf8048
Deleted: sha256:b00f03ab04e77002874f29ad6bd072f4481ccdb35252e9fbdd67e8e55f37d931
Deleted: sha256:1510f014dda4317ae79feaa7db2779680feb5984430e2ae2381654c878de6dad
Deleted: sha256:cf0674b4efcdc233eb2308c8780a59fbc3070041e99062c1b43f946035feb4ed
Deleted: sha256:d4160df97da6ad557509c8a57e71394fc2f03c20080d2216f5ce35283ad4c05e
Deleted: sha256:f50986671264a67ed143027e92b1ec1d7be624d083ff346d1c709f0119596f8f
Deleted: sha256:18431899f774ee44883dc23d027c3403fba9701eebc7d3f3437966b02a97e271
Deleted: sha256:c1bf191d475397d9b392bd9a5a28f158d0de88afdb39c86b8145ba647a4ff59b
Deleted: sha256:5f2c8a7e936511f07cd92bec2756ea83559dc16e6a5e538b8f6156c3266d994f
Deleted: sha256:6d3131f1b4e3345664ffa1c0006053f7449cac376cda4dd50ff6b6c7e9504f44
Deleted: sha256:d33e71496739d2708197212d15b76c9e360c18ff6d627590f08b2847691edf27
Deleted: sha256:3d677588133f205190b3dc6f9632b657a230fb60113d40700366130cb497f96b
Deleted: sha256:e71cad00dae35dffd0afb7ea1c73801af976efd51370a7048301fc980d17a5d4
Deleted: sha256:345f69a78a2aeb127964f7b297b9e1f2708e63b345f42185c3dde0531ac9fd2e
Deleted: sha256:9e761c4139bab27383a48bde1d92c6cf025964c2c7356b9a89dc774e2e7376ed
Deleted: sha256:a6a85f4ce0297b793ad11212d021823709741c8e3e060d01c1e786b41020ca63
Deleted: sha256:d1ecb4f67e654714947bc7e1b28b3bcca492ecf55e41c6b391d0b7012e5feda0
Deleted: sha256:b394c980b9279185229b240c0a2eeb91471507ceaf2ffdf9186ade8b6649a8fa
Deleted: sha256:bd6bfa04e9118e150b2bd08eb4fe854b07edd4b007631bbdb28cdf05079c1796
Deleted: sha256:31d73fd16a66c126212c4a11de9c7dff6862b79f0fc324542c800f7e4b70daab
Deleted: sha256:80fc0e9d6979fcf80debd0e609c72b1749a4b3b97aed5da64ba83485283aa654
Deleted: sha256:22d79e855b016313ab03332306b601b2fd6654065b5610cd5aa60fc94130cdb8
Deleted: sha256:dad730563cd8e24f54fc854e77003091495da06a5da63558fe62f98f401527c7
Deleted: sha256:c0e69711ba9b79fec5c26314e1466cf3ea920fdb87353c7979d1ef2a40928fe5
Deleted: sha256:646a8b57408ad2f7c155adbe6ab54f05e40294ee1b0968f828c0dae675b48599
Build step 'Execute shell' marked build as failure

Mime
View raw message