mesos-builds mailing list archives

Site index · List index
Message view « Date » · « Thread »
Top « Date » · « Thread »
From Apache Jenkins Server <jenk...@builds.apache.org>
Subject Build failed in Jenkins: Mesos-Reviewbot #18665
Date Tue, 01 Aug 2017 17:18:24 GMT
See <https://builds.apache.org/job/Mesos-Reviewbot/18665/display/redirect>

------------------------------------------
[...truncated 30.49 MB...]
I0801 17:18:16.840596  5108 containerizer.cpp:230] Using isolation: posix/cpu,posix/mem,filesystem/posix,network/cni,environment_secret
W0801 17:18:16.841364  5108 backend.cpp:76] Failed to create 'overlay' backend: OverlayBackend
requires root privileges
W0801 17:18:16.841531  5108 backend.cpp:76] Failed to create 'bind' backend: BindBackend requires
root privileges
I0801 17:18:16.841575  5108 provisioner.cpp:255] Using default backend 'copy'
I0801 17:18:16.846493  5134 slave.cpp:250] Mesos agent started on (795)@172.17.0.3:45141
I0801 17:18:16.846573  5134 slave.cpp:251] Flags at startup: --acls="" --appc_simple_discovery_uri_prefix="http://"
--appc_store_dir="/tmp/Endpoint_SlaveEndpointTest_AuthorizedRequest_2_rthgda/store/appc" --authenticate_http_readonly="true"
--authenticate_http_readwrite="true" --authenticatee="crammd5" --authentication_backoff_factor="1secs"
--authorizer="local" --cgroups_cpu_enable_pids_and_tids_count="false" --cgroups_enable_cfs="false"
--cgroups_hierarchy="/sys/fs/cgroup" --cgroups_limit_swap="false" --cgroups_root="mesos" --container_disk_watch_interval="15secs"
--containerizers="mesos" --credential="/tmp/Endpoint_SlaveEndpointTest_AuthorizedRequest_2_rthgda/credential"
--default_role="*" --disk_watch_interval="1mins" --docker="docker" --docker_kill_orphans="true"
--docker_registry="https://registry-1.docker.io" --docker_remove_delay="6hrs" --docker_socket="/var/run/docker.sock"
--docker_stop_timeout="0ns" --docker_store_dir="/tmp/Endpoint_SlaveEndpointTest_AuthorizedRequest_2_rthgda/store/docker"
--docker_volume_checkpoint_dir="/var/run/mesos/isolators/docker/volume" --enforce_container_disk_quota="false"
--executor_registration_timeout="1mins" --executor_reregistration_timeout="2secs" --executor_shutdown_grace_period="5secs"
--fetcher_cache_dir="/tmp/Endpoint_SlaveEndpointTest_AuthorizedRequest_2_rthgda/fetch" --fetcher_cache_size="2GB"
--frameworks_home="" --gc_delay="1weeks" --gc_disk_headroom="0.1" --hadoop_home="" --help="false"
--hostname_lookup="true" --http_command_executor="false" --http_credentials="/tmp/Endpoint_SlaveEndpointTest_AuthorizedRequest_2_rthgda/http_credentials"
--http_heartbeat_interval="30secs" --initialize_driver_logging="true" --isolation="posix/cpu,posix/mem"
--launcher="posix" --launcher_dir="/mesos/mesos-1.4.0/_build/src" --logbufsecs="0" --logging_level="INFO"
--max_completed_executors_per_framework="150" --oversubscribed_resources_interval="15secs"
--perf_duration="10secs" --perf_interval="1mins" --port="5051" --qos_correction_interval_min="0ns"
--quiet="false" --recover="reconnect" --recovery_timeout="15mins" --registration_backoff_factor="10ms"
--resources="cpus:2;gpus:0;mem:1024;disk:1024;ports:[31000-32000]" --revocable_cpu_low_priority="true"
--runtime_dir="/tmp/Endpoint_SlaveEndpointTest_AuthorizedRequest_2_rthgda" --sandbox_directory="/mnt/mesos/sandbox"
--strict="true" --switch_user="true" --systemd_enable_support="true" --systemd_runtime_directory="/run/systemd/system"
--version="false" --work_dir="/tmp/Endpoint_SlaveEndpointTest_AuthorizedRequest_2_Joh27h"
I0801 17:18:16.847508  5134 credentials.hpp:86] Loading credential for authentication from
'/tmp/Endpoint_SlaveEndpointTest_AuthorizedRequest_2_rthgda/credential'
I0801 17:18:16.847826  5134 slave.cpp:283] Agent using credential for: test-principal
I0801 17:18:16.847932  5134 credentials.hpp:37] Loading credentials for authentication from
'/tmp/Endpoint_SlaveEndpointTest_AuthorizedRequest_2_rthgda/http_credentials'
I0801 17:18:16.848397  5134 http.cpp:993] Creating default 'basic' HTTP authenticator for
realm 'mesos-agent-readonly'
I0801 17:18:16.848706  5134 http.cpp:993] Creating default 'basic' HTTP authenticator for
realm 'mesos-agent-readwrite'
I0801 17:18:16.850962  5134 slave.cpp:565] Agent resources: [{"name":"cpus","scalar":{"value":2.0},"type":"SCALAR"},{"name":"mem","scalar":{"value":1024.0},"type":"SCALAR"},{"name":"disk","scalar":{"value":1024.0},"type":"SCALAR"},{"name":"ports","ranges":{"range":[{"begin":31000,"end":32000}]},"type":"RANGES"}]
I0801 17:18:16.851510  5134 slave.cpp:573] Agent attributes: [  ]
I0801 17:18:16.851588  5134 slave.cpp:582] Agent hostname: d74ff794ec99
I0801 17:18:16.851927  5128 status_update_manager.cpp:177] Pausing sending status updates
I0801 17:18:16.853801  5129 state.cpp:64] Recovering state from '/tmp/Endpoint_SlaveEndpointTest_AuthorizedRequest_2_Joh27h/meta'
I0801 17:18:16.862406  5127 status_update_manager.cpp:203] Recovering status update manager
I0801 17:18:16.862686  5131 containerizer.cpp:582] Recovering containerizer
I0801 17:18:16.864930  5131 provisioner.cpp:416] Provisioner recovery complete
I0801 17:18:16.865492  5133 slave.cpp:6207] Finished recovery
I0801 17:18:16.866183  5133 slave.cpp:6389] Querying resource estimator for oversubscribable
resources
I0801 17:18:16.866729  5128 slave.cpp:6403] Received oversubscribable resources {} from the
resource estimator
I0801 17:18:16.870908  5128 process.cpp:3836] Handling HTTP event for process 'slave(795)'
with path: '/slave(795)/containers'
I0801 17:18:16.873252  5129 http.cpp:1133] HTTP GET for /slave(795)/containers from 172.17.0.3:50846
I0801 17:18:16.873457  5129 http.cpp:957] Authorizing principal 'test-principal' to GET the
'/containers' endpoint
I0801 17:18:16.879786  5129 slave.cpp:843] Agent terminating
[       OK ] Endpoint/SlaveEndpointTest.AuthorizedRequest/2 (57 ms)
[ RUN      ] Endpoint/SlaveEndpointTest.UnauthorizedRequest/0
I0801 17:18:16.897034  5108 containerizer.cpp:230] Using isolation: posix/cpu,posix/mem,filesystem/posix,network/cni,environment_secret
W0801 17:18:16.897801  5108 backend.cpp:76] Failed to create 'overlay' backend: OverlayBackend
requires root privileges
W0801 17:18:16.897966  5108 backend.cpp:76] Failed to create 'bind' backend: BindBackend requires
root privileges
I0801 17:18:16.898008  5108 provisioner.cpp:255] Using default backend 'copy'
I0801 17:18:16.903085  5127 slave.cpp:250] Mesos agent started on (796)@172.17.0.3:45141
I0801 17:18:16.903126  5127 slave.cpp:251] Flags at startup: --acls="" --appc_simple_discovery_uri_prefix="http://"
--appc_store_dir="/tmp/Endpoint_SlaveEndpointTest_UnauthorizedRequest_0_3SUP3E/store/appc"
--authenticate_http_readonly="true" --authenticate_http_readwrite="true" --authenticatee="crammd5"
--authentication_backoff_factor="1secs" --authorizer="local" --cgroups_cpu_enable_pids_and_tids_count="false"
--cgroups_enable_cfs="false" --cgroups_hierarchy="/sys/fs/cgroup" --cgroups_limit_swap="false"
--cgroups_root="mesos" --container_disk_watch_interval="15secs" --containerizers="mesos" --credential="/tmp/Endpoint_SlaveEndpointTest_UnauthorizedRequest_0_3SUP3E/credential"
--default_role="*" --disk_watch_interval="1mins" --docker="docker" --docker_kill_orphans="true"
--docker_registry="https://registry-1.docker.io" --docker_remove_delay="6hrs" --docker_socket="/var/run/docker.sock"
--docker_stop_timeout="0ns" --docker_store_dir="/tmp/Endpoint_SlaveEndpointTest_UnauthorizedRequest_0_3SUP3E/store/docker"
--docker_volume_checkpoint_dir="/var/run/mesos/isolators/docker/volume" --enforce_container_disk_quota="false"
--executor_registration_timeout="1mins" --executor_reregistration_timeout="2secs" --executor_shutdown_grace_period="5secs"
--fetcher_cache_dir="/tmp/Endpoint_SlaveEndpointTest_UnauthorizedRequest_0_3SUP3E/fetch" --fetcher_cache_size="2GB"
--frameworks_home="" --gc_delay="1weeks" --gc_disk_headroom="0.1" --hadoop_home="" --help="false"
--hostname_lookup="true" --http_command_executor="false" --http_credentials="/tmp/Endpoint_SlaveEndpointTest_UnauthorizedRequest_0_3SUP3E/http_credentials"
--http_heartbeat_interval="30secs" --initialize_driver_logging="true" --isolation="posix/cpu,posix/mem"
--launcher="posix" --launcher_dir="/mesos/mesos-1.4.0/_build/src" --logbufsecs="0" --logging_level="INFO"
--max_completed_executors_per_framework="150" --oversubscribed_resources_interval="15secs"
--perf_duration="10secs" --perf_interval="1mins" --port="5051" --qos_correction_interval_min="0ns"
--quiet="false" --recover="reconnect" --recovery_timeout="15mins" --registration_backoff_factor="10ms"
--resources="cpus:2;gpus:0;mem:1024;disk:1024;ports:[31000-32000]" --revocable_cpu_low_priority="true"
--runtime_dir="/tmp/Endpoint_SlaveEndpointTest_UnauthorizedRequest_0_3SUP3E" --sandbox_directory="/mnt/mesos/sandbox"
--strict="true" --switch_user="true" --systemd_enable_support="true" --systemd_runtime_directory="/run/systemd/system"
--version="false" --work_dir="/tmp/Endpoint_SlaveEndpointTest_UnauthorizedRequest_0_fziuPM"
I0801 17:18:16.904060  5127 credentials.hpp:86] Loading credential for authentication from
'/tmp/Endpoint_SlaveEndpointTest_UnauthorizedRequest_0_3SUP3E/credential'
I0801 17:18:16.904503  5127 slave.cpp:283] Agent using credential for: test-principal
I0801 17:18:16.904533  5127 credentials.hpp:37] Loading credentials for authentication from
'/tmp/Endpoint_SlaveEndpointTest_UnauthorizedRequest_0_3SUP3E/http_credentials'
I0801 17:18:16.904994  5127 http.cpp:993] Creating default 'basic' HTTP authenticator for
realm 'mesos-agent-readonly'
I0801 17:18:16.905310  5127 http.cpp:993] Creating default 'basic' HTTP authenticator for
realm 'mesos-agent-readwrite'
I0801 17:18:16.907505  5127 slave.cpp:565] Agent resources: [{"name":"cpus","scalar":{"value":2.0},"type":"SCALAR"},{"name":"mem","scalar":{"value":1024.0},"type":"SCALAR"},{"name":"disk","scalar":{"value":1024.0},"type":"SCALAR"},{"name":"ports","ranges":{"range":[{"begin":31000,"end":32000}]},"type":"RANGES"}]
I0801 17:18:16.907932  5127 slave.cpp:573] Agent attributes: [  ]
I0801 17:18:16.907953  5127 slave.cpp:582] Agent hostname: d74ff794ec99
I0801 17:18:16.908324  5131 status_update_manager.cpp:177] Pausing sending status updates
I0801 17:18:16.910223  5128 state.cpp:64] Recovering state from '/tmp/Endpoint_SlaveEndpointTest_UnauthorizedRequest_0_fziuPM/meta'
I0801 17:18:16.910843  5131 status_update_manager.cpp:203] Recovering status update manager
I0801 17:18:16.911104  5129 containerizer.cpp:582] Recovering containerizer
I0801 17:18:16.913200  5129 provisioner.cpp:416] Provisioner recovery complete
I0801 17:18:16.913832  5128 slave.cpp:6207] Finished recovery
I0801 17:18:16.914872  5128 slave.cpp:6389] Querying resource estimator for oversubscribable
resources
I0801 17:18:16.915319  5132 slave.cpp:6403] Received oversubscribable resources {} from the
resource estimator
I0801 17:18:16.919320  5128 process.cpp:3836] Handling HTTP event for process 'slave(796)'
with path: '/slave(796)/monitor/statistics'
I0801 17:18:16.921444  5132 http.cpp:1133] HTTP GET for /slave(796)/monitor/statistics from
172.17.0.3:50848
I0801 17:18:16.921571  5132 http.cpp:957] Authorizing principal 'test-principal' to GET the
'/monitor/statistics' endpoint
I0801 17:18:16.925225  5128 slave.cpp:843] Agent terminating
[       OK ] Endpoint/SlaveEndpointTest.UnauthorizedRequest/0 (44 ms)
[ RUN      ] Endpoint/SlaveEndpointTest.UnauthorizedRequest/1
I0801 17:18:16.942147  5108 containerizer.cpp:230] Using isolation: posix/cpu,posix/mem,filesystem/posix,network/cni,environment_secret
W0801 17:18:16.942934  5108 backend.cpp:76] Failed to create 'overlay' backend: OverlayBackend
requires root privileges
W0801 17:18:16.943107  5108 backend.cpp:76] Failed to create 'bind' backend: BindBackend requires
root privileges
I0801 17:18:16.943151  5108 provisioner.cpp:255] Using default backend 'copy'
I0801 17:18:16.948292  5131 slave.cpp:250] Mesos agent started on (797)@172.17.0.3:45141
I0801 17:18:16.948334  5131 slave.cpp:251] Flags at startup: --acls="" --appc_simple_discovery_uri_prefix="http://"
--appc_store_dir="/tmp/Endpoint_SlaveEndpointTest_UnauthorizedRequest_1_NUzeoa/store/appc"
--authenticate_http_readonly="true" --authenticate_http_readwrite="true" --authenticatee="crammd5"
--authentication_backoff_factor="1secs" --authorizer="local" --cgroups_cpu_enable_pids_and_tids_count="false"
--cgroups_enable_cfs="false" --cgroups_hierarchy="/sys/fs/cgroup" --cgroups_limit_swap="false"
--cgroups_root="mesos" --container_disk_watch_interval="15secs" --containerizers="mesos" --credential="/tmp/Endpoint_SlaveEndpointTest_UnauthorizedRequest_1_NUzeoa/credential"
--default_role="*" --disk_watch_interval="1mins" --docker="docker" --docker_kill_orphans="true"
--docker_registry="https://registry-1.docker.io" --docker_remove_delay="6hrs" --docker_socket="/var/run/docker.sock"
--docker_stop_timeout="0ns" --docker_store_dir="/tmp/Endpoint_SlaveEndpointTest_UnauthorizedRequest_1_NUzeoa/store/docker"
--docker_volume_checkpoint_dir="/var/run/mesos/isolators/docker/volume" --enforce_container_disk_quota="false"
--executor_registration_timeout="1mins" --executor_reregistration_timeout="2secs" --executor_shutdown_grace_period="5secs"
--fetcher_cache_dir="/tmp/Endpoint_SlaveEndpointTest_UnauthorizedRequest_1_NUzeoa/fetch" --fetcher_cache_size="2GB"
--frameworks_home="" --gc_delay="1weeks" --gc_disk_headroom="0.1" --hadoop_home="" --help="false"
--hostname_lookup="true" --http_command_executor="false" --http_credentials="/tmp/Endpoint_SlaveEndpointTest_UnauthorizedRequest_1_NUzeoa/http_credentials"
--http_heartbeat_interval="30secs" --initialize_driver_logging="true" --isolation="posix/cpu,posix/mem"
--launcher="posix" --launcher_dir="/mesos/mesos-1.4.0/_build/src" --logbufsecs="0" --logging_level="INFO"
--max_completed_executors_per_framework="150" --oversubscribed_resources_interval="15secs"
--perf_duration="10secs" --perf_interval="1mins" --port="5051" --qos_correction_interval_min="0ns"
--quiet="false" --recover="reconnect" --recovery_timeout="15mins" --registration_backoff_factor="10ms"
--resources="cpus:2;gpus:0;mem:1024;disk:1024;ports:[31000-32000]" --revocable_cpu_low_priority="true"
--runtime_dir="/tmp/Endpoint_SlaveEndpointTest_UnauthorizedRequest_1_NUzeoa" --sandbox_directory="/mnt/mesos/sandbox"
--strict="true" --switch_user="true" --systemd_enable_support="true" --systemd_runtime_directory="/run/systemd/system"
--version="false" --work_dir="/tmp/Endpoint_SlaveEndpointTest_UnauthorizedRequest_1_Hxiz2h"
I0801 17:18:16.949066  5131 credentials.hpp:86] Loading credential for authentication from
'/tmp/Endpoint_SlaveEndpointTest_UnauthorizedRequest_1_NUzeoa/credential'
I0801 17:18:16.949326  5131 slave.cpp:283] Agent using credential for: test-principal
I0801 17:18:16.949353  5131 credentials.hpp:37] Loading credentials for authentication from
'/tmp/Endpoint_SlaveEndpointTest_UnauthorizedRequest_1_NUzeoa/http_credentials'
I0801 17:18:16.949714  5131 http.cpp:993] Creating default 'basic' HTTP authenticator for
realm 'mesos-agent-readonly'
I0801 17:18:16.949944  5131 http.cpp:993] Creating default 'basic' HTTP authenticator for
realm 'mesos-agent-readwrite'
I0801 17:18:16.952105  5131 slave.cpp:565] Agent resources: [{"name":"cpus","scalar":{"value":2.0},"type":"SCALAR"},{"name":"mem","scalar":{"value":1024.0},"type":"SCALAR"},{"name":"disk","scalar":{"value":1024.0},"type":"SCALAR"},{"name":"ports","ranges":{"range":[{"begin":31000,"end":32000}]},"type":"RANGES"}]
I0801 17:18:16.952528  5131 slave.cpp:573] Agent attributes: [  ]
I0801 17:18:16.952550  5131 slave.cpp:582] Agent hostname: d74ff794ec99
I0801 17:18:16.952842  5127 status_update_manager.cpp:177] Pausing sending status updates
I0801 17:18:16.954850  5134 state.cpp:64] Recovering state from '/tmp/Endpoint_SlaveEndpointTest_UnauthorizedRequest_1_Hxiz2h/meta'
I0801 17:18:16.955478  5130 status_update_manager.cpp:203] Recovering status update manager
I0801 17:18:16.955875  5130 containerizer.cpp:582] Recovering containerizer
I0801 17:18:16.958036  5130 provisioner.cpp:416] Provisioner recovery complete
I0801 17:18:16.958689  5134 slave.cpp:6207] Finished recovery
I0801 17:18:16.959580  5134 slave.cpp:6389] Querying resource estimator for oversubscribable
resources
I0801 17:18:16.960029  5129 slave.cpp:6403] Received oversubscribable resources {} from the
resource estimator
I0801 17:18:16.964490  5133 process.cpp:3836] Handling HTTP event for process 'slave(797)'
with path: '/slave(797)/monitor/statistics.json'
I0801 17:18:16.966738  5131 http.cpp:1133] HTTP GET for /slave(797)/monitor/statistics.json
from 172.17.0.3:50850
I0801 17:18:16.966862  5131 http.cpp:957] Authorizing principal 'test-principal' to GET the
'/monitor/statistics.json' endpoint
I0801 17:18:16.970203  5108 slave.cpp:843] Agent terminating
[       OK ] Endpoint/SlaveEndpointTest.UnauthorizedRequest/1 (44 ms)
[ RUN      ] Endpoint/SlaveEndpointTest.UnauthorizedRequest/2
I0801 17:18:16.986786  5108 containerizer.cpp:230] Using isolation: posix/cpu,posix/mem,filesystem/posix,network/cni,environment_secret
W0801 17:18:16.987565  5108 backend.cpp:76] Failed to create 'overlay' backend: OverlayBackend
requires root privileges
W0801 17:18:16.987731  5108 backend.cpp:76] Failed to create 'bind' backend: BindBackend requires
root privileges
I0801 17:18:16.987776  5108 provisioner.cpp:255] Using default backend 'copy'
I0801 17:18:16.992725  5132 slave.cpp:250] Mesos agent started on (798)@172.17.0.3:45141
I0801 17:18:16.992765  5132 slave.cpp:251] Flags at startup: --acls="" --appc_simple_discovery_uri_prefix="http://"
--appc_store_dir="/tmp/Endpoint_SlaveEndpointTest_UnauthorizedRequest_2_5PKAbG/store/appc"
--authenticate_http_readonly="true" --authenticate_http_readwrite="true" --authenticatee="crammd5"
--authentication_backoff_factor="1secs" --authorizer="local" --cgroups_cpu_enable_pids_and_tids_count="false"
--cgroups_enable_cfs="false" --cgroups_hierarchy="/sys/fs/cgroup" --cgroups_limit_swap="false"
--cgroups_root="mesos" --container_disk_watch_interval="15secs" --containerizers="mesos" --credential="/tmp/Endpoint_SlaveEndpointTest_UnauthorizedRequest_2_5PKAbG/credential"
--default_role="*" --disk_watch_interval="1mins" --docker="docker" --docker_kill_orphans="true"
--docker_registry="https://registry-1.docker.io" --docker_remove_delay="6hrs" --docker_socket="/var/run/docker.sock"
--docker_stop_timeout="0ns" --docker_store_dir="/tmp/Endpoint_SlaveEndpointTest_UnauthorizedRequest_2_5PKAbG/store/docker"
--docker_volume_checkpoint_dir="/var/run/mesos/isolators/docker/volume" --enforce_container_disk_quota="false"
--executor_registration_timeout="1mins" --executor_reregistration_timeout="2secs" --executor_shutdown_grace_period="5secs"
--fetcher_cache_dir="/tmp/Endpoint_SlaveEndpointTest_UnauthorizedRequest_2_5PKAbG/fetch" --fetcher_cache_size="2GB"
--frameworks_home="" --gc_delay="1weeks" --gc_disk_headroom="0.1" --hadoop_home="" --help="false"
--hostname_lookup="true" --http_command_executor="false" --http_credentials="/tmp/Endpoint_SlaveEndpointTest_UnauthorizedRequest_2_5PKAbG/http_credentials"
--http_heartbeat_interval="30secs" --initialize_driver_logging="true" --isolation="posix/cpu,posix/mem"
--launcher="posix" --launcher_dir="/mesos/mesos-1.4.0/_build/src" --logbufsecs="0" --logging_level="INFO"
--max_completed_executors_per_framework="150" --oversubscribed_resources_interval="15secs"
--perf_duration="10secs" --perf_interval="1mins" --port="5051" --qos_correction_interval_min="0ns"
--quiet="false" --recover="reconnect" --recovery_timeout="15mins" --registration_backoff_factor="10ms"
--resources="cpus:2;gpus:0;mem:1024;disk:1024;ports:[31000-32000]" --revocable_cpu_low_priority="true"
--runtime_dir="/tmp/Endpoint_SlaveEndpointTest_UnauthorizedRequest_2_5PKAbG" --sandbox_directory="/mnt/mesos/sandbox"
--strict="true" --switch_user="true" --systemd_enable_support="true" --systemd_runtime_directory="/run/systemd/system"
--version="false" --work_dir="/tmp/Endpoint_SlaveEndpointTest_UnauthorizedRequest_2_dG4GIN"
I0801 17:18:16.993548  5132 credentials.hpp:86] Loading credential for authentication from
'/tmp/Endpoint_SlaveEndpointTest_UnauthorizedRequest_2_5PKAbG/credential'
I0801 17:18:16.993914  5132 slave.cpp:283] Agent using credential for: test-principal
I0801 17:18:16.993952  5132 credentials.hpp:37] Loading credentials for authentication from
'/tmp/Endpoint_SlaveEndpointTest_UnauthorizedRequest_2_5PKAbG/http_credentials'
I0801 17:18:16.994398  5132 http.cpp:993] Creating default 'basic' HTTP authenticator for
realm 'mesos-agent-readonly'
I0801 17:18:16.994719  5132 http.cpp:993] Creating default 'basic' HTTP authenticator for
realm 'mesos-agent-readwrite'
I0801 17:18:16.996999  5132 slave.cpp:565] Agent resources: [{"name":"cpus","scalar":{"value":2.0},"type":"SCALAR"},{"name":"mem","scalar":{"value":1024.0},"type":"SCALAR"},{"name":"disk","scalar":{"value":1024.0},"type":"SCALAR"},{"name":"ports","ranges":{"range":[{"begin":31000,"end":32000}]},"type":"RANGES"}]
I0801 17:18:16.997426  5132 slave.cpp:573] Agent attributes: [  ]
I0801 17:18:16.997449  5132 slave.cpp:582] Agent hostname: d74ff794ec99
I0801 17:18:16.997757  5130 status_update_manager.cpp:177] Pausing sending status updates
I0801 17:18:16.999850  5133 state.cpp:64] Recovering state from '/tmp/Endpoint_SlaveEndpointTest_UnauthorizedRequest_2_dG4GIN/meta'
I0801 17:18:17.000588  5131 status_update_manager.cpp:203] Recovering status update manager
I0801 17:18:17.000882  5127 containerizer.cpp:582] Recovering containerizer
I0801 17:18:17.002813  5131 provisioner.cpp:416] Provisioner recovery complete
I0801 17:18:17.003453  5130 slave.cpp:6207] Finished recovery
I0801 17:18:17.004302  5130 slave.cpp:6389] Querying resource estimator for oversubscribable
resources
I0801 17:18:17.004662  5132 slave.cpp:6403] Received oversubscribable resources {} from the
resource estimator
I0801 17:18:17.008738  5131 process.cpp:3836] Handling HTTP event for process 'slave(798)'
with path: '/slave(798)/containers'
I0801 17:18:17.010615  5129 http.cpp:1133] HTTP GET for /slave(798)/containers from 172.17.0.3:50852
I0801 17:18:17.010753  5129 http.cpp:957] Authorizing principal 'test-principal' to GET the
'/containers' endpoint
I0801 17:18:17.013835  5127 slave.cpp:843] Agent terminating
[       OK ] Endpoint/SlaveEndpointTest.UnauthorizedRequest/2 (48 ms)
[ RUN      ] Endpoint/SlaveEndpointTest.NoAuthorizer/0
I0801 17:18:17.036116  5108 containerizer.cpp:230] Using isolation: posix/cpu,posix/mem,filesystem/posix,network/cni,environment_secret
W0801 17:18:17.036917  5108 backend.cpp:76] Failed to create 'overlay' backend: OverlayBackend
requires root privileges
W0801 17:18:17.037096  5108 backend.cpp:76] Failed to create 'bind' backend: BindBackend requires
root privileges
I0801 17:18:17.037142  5108 provisioner.cpp:255] Using default backend 'copy'
I0801 17:18:17.039537  5108 cluster.cpp:448] Creating default 'local' authorizer
I0801 17:18:17.042340  5129 slave.cpp:250] Mesos agent started on (799)@172.17.0.3:45141
I0801 17:18:17.042382  5129 slave.cpp:251] Flags at startup: --acls="" --appc_simple_discovery_uri_prefix="http://"
--appc_store_dir="/tmp/Endpoint_SlaveEndpointTest_NoAuthorizer_0_lU6Xtc/store/appc" --authenticate_http_readonly="true"
--authenticate_http_readwrite="true" --authenticatee="crammd5" --authentication_backoff_factor="1secs"
--authorizer="local" --cgroups_cpu_enable_pids_and_tids_count="false" --cgroups_enable_cfs="false"
--cgroups_hierarchy="/sys/fs/cgroup" --cgroups_limit_swap="false" --cgroups_root="mesos" --container_disk_watch_interval="15secs"
--containerizers="mesos" --credential="/tmp/Endpoint_SlaveEndpointTest_NoAuthorizer_0_lU6Xtc/credential"
--default_role="*" --disk_watch_interval="1mins" --docker="docker" --docker_kill_orphans="true"
--docker_registry="https://registry-1.docker.io" --docker_remove_delay="6hrs" --docker_socket="/var/run/docker.sock"
--docker_stop_timeout="0ns" --docker_store_dir="/tmp/Endpoint_SlaveEndpointTest_NoAuthorizer_0_lU6Xtc/store/docker"
--docker_volume_checkpoint_dir="/var/run/mesos/isolators/docker/volume" --enforce_container_disk_quota="false"
--executor_registration_timeout="1mins" --executor_reregistration_timeout="2secs" --executor_shutdown_grace_period="5secs"
--fetcher_cache_dir="/tmp/Endpoint_SlaveEndpointTest_NoAuthorizer_0_lU6Xtc/fetch" --fetcher_cache_size="2GB"
--frameworks_home="" --gc_delay="1weeks" --gc_disk_headroom="0.1" --hadoop_home="" --help="false"
--hostname_lookup="true" --http_command_executor="false" --http_credentials="/tmp/Endpoint_SlaveEndpointTest_NoAuthorizer_0_lU6Xtc/http_credentials"
--http_heartbeat_interval="30secs" --initialize_driver_logging="true" --isolation="posix/cpu,posix/mem"
--launcher="posix" --launcher_dir="/mesos/mesos-1.4.0/_build/src" --logbufsecs="0" --logging_level="INFO"
--max_completed_executors_per_framework="150" --oversubscribed_resources_interval="15secs"
--perf_duration="10secs" --perf_interval="1mins" --port="5051" --qos_correction_interval_min="0ns"
--quiet="false" --recover="reconnect" --recovery_timeout="15mins" --registration_backoff_factor="10ms"
--resources="cpus:2;gpus:0;mem:1024;disk:1024;ports:[31000-32000]" --revocable_cpu_low_priority="true"
--runtime_dir="/tmp/Endpoint_SlaveEndpointTest_NoAuthorizer_0_lU6Xtc" --sandbox_directory="/mnt/mesos/sandbox"
--strict="true" --switch_user="true" --systemd_enable_support="true" --systemd_runtime_directory="/run/systemd/system"
--version="false" --work_dir="/tmp/Endpoint_SlaveEndpointTest_NoAuthorizer_0_HnX8Sj"
I0801 17:18:17.043087  5129 credentials.hpp:86] Loading credential for authentication from
'/tmp/Endpoint_SlaveEndpointTest_NoAuthorizer_0_lU6Xtc/credential'
I0801 17:18:17.043337  5129 slave.cpp:283] Agent using credential for: test-principal
I0801 17:18:17.043360  5129 credentials.hpp:37] Loading credentials for authentication from
'/tmp/Endpoint_SlaveEndpointTest_NoAuthorizer_0_lU6Xtc/http_credentials'
I0801 17:18:17.043710  5129 http.cpp:993] Creating default 'basic' HTTP authenticator for
realm 'mesos-agent-readonly'
I0801 17:18:17.043952  5129 http.cpp:993] Creating default 'basic' HTTP authenticator for
realm 'mesos-agent-readwrite'
I0801 17:18:17.046072  5129 slave.cpp:565] Agent resources: [{"name":"cpus","scalar":{"value":2.0},"type":"SCALAR"},{"name":"mem","scalar":{"value":1024.0},"type":"SCALAR"},{"name":"disk","scalar":{"value":1024.0},"type":"SCALAR"},{"name":"ports","ranges":{"range":[{"begin":31000,"end":32000}]},"type":"RANGES"}]
I0801 17:18:17.046492  5129 slave.cpp:573] Agent attributes: [  ]
I0801 17:18:17.046511  5129 slave.cpp:582] Agent hostname: d74ff794ec99
I0801 17:18:17.046725  5127 status_update_manager.cpp:177] Pausing sending status updates
I0801 17:18:17.048599  5128 state.cpp:64] Recovering state from '/tmp/Endpoint_SlaveEndpointTest_NoAuthorizer_0_HnX8Sj/meta'
I0801 17:18:17.049182  5131 status_update_manager.cpp:203] Recovering status update manager
I0801 17:18:17.049468  5132 containerizer.cpp:582] Recovering containerizer
I0801 17:18:17.051501  5129 provisioner.cpp:416] Provisioner recovery complete
I0801 17:18:17.052086  5131 slave.cpp:6207] Finished recovery
I0801 17:18:17.052744  5131 slave.cpp:6389] Querying resource estimator for oversubscribable
resources
I0801 17:18:17.053153  5128 slave.cpp:6403] Received oversubscribable resources {} from the
resource estimator
I0801 17:18:17.057210  5128 process.cpp:3836] Handling HTTP event for process 'slave(799)'
with path: '/slave(799)/monitor/statistics'
I0801 17:18:17.059212  5134 http.cpp:1133] HTTP GET for /slave(799)/monitor/statistics from
172.17.0.3:50854
I0801 17:18:17.059336  5134 http.cpp:957] Authorizing principal 'test-principal' to GET the
'/monitor/statistics' endpoint
I0801 17:18:17.064684  5108 slave.cpp:843] Agent terminating
[       OK ] Endpoint/SlaveEndpointTest.NoAuthorizer/0 (46 ms)
[ RUN      ] Endpoint/SlaveEndpointTest.NoAuthorizer/1
I0801 17:18:17.082074  5108 containerizer.cpp:230] Using isolation: posix/cpu,posix/mem,filesystem/posix,network/cni,environment_secret
W0801 17:18:17.082852  5108 backend.cpp:76] Failed to create 'overlay' backend: OverlayBackend
requires root privileges
W0801 17:18:17.083029  5108 backend.cpp:76] Failed to create 'bind' backend: BindBackend requires
root privileges
I0801 17:18:17.083070  5108 provisioner.cpp:255] Using default backend 'copy'
I0801 17:18:17.085592  5108 cluster.cpp:448] Creating default 'local' authorizer
I0801 17:18:17.088397  5132 slave.cpp:250] Mesos agent started on (800)@172.17.0.3:45141
I0801 17:18:17.088436  5132 slave.cpp:251] Flags at startup: --acls="" --appc_simple_discovery_uri_prefix="http://"
--appc_store_dir="/tmp/Endpoint_SlaveEndpointTest_NoAuthorizer_1_7yRwgJ/store/appc" --authenticate_http_readonly="true"
--authenticate_http_readwrite="true" --authenticatee="crammd5" --authentication_backoff_factor="1secs"
--authorizer="local" --cgroups_cpu_enable_pids_and_tids_count="false" --cgroups_enable_cfs="false"
--cgroups_hierarchy="/sys/fs/cgroup" --cgroups_limit_swap="false" --cgroups_root="mesos" --container_disk_watch_interval="15secs"
--containerizers="mesos" --credential="/tmp/Endpoint_SlaveEndpointTest_NoAuthorizer_1_7yRwgJ/credential"
--default_role="*" --disk_watch_interval="1mins" --docker="docker" --docker_kill_orphans="true"
--docker_registry="https://registry-1.docker.io" --docker_remove_delay="6hrs" --docker_socket="/var/run/docker.sock"
--docker_stop_timeout="0ns" --docker_store_dir="/tmp/Endpoint_SlaveEndpointTest_NoAuthorizer_1_7yRwgJ/store/docker"
--docker_volume_checkpoint_dir="/var/run/mesos/isolators/docker/volume" --enforce_container_disk_quota="false"
--executor_registration_timeout="1mins" --executor_reregistration_timeout="2secs" --executor_shutdown_grace_period="5secs"
--fetcher_cache_dir="/tmp/Endpoint_SlaveEndpointTest_NoAuthorizer_1_7yRwgJ/fetch" --fetcher_cache_size="2GB"
--frameworks_home="" --gc_delay="1weeks" --gc_disk_headroom="0.1" --hadoop_home="" --help="false"
--hostname_lookup="true" --http_command_executor="false" --http_credentials="/tmp/Endpoint_SlaveEndpointTest_NoAuthorizer_1_7yRwgJ/http_credentials"
--http_heartbeat_interval="30secs" --initialize_driver_logging="true" --isolation="posix/cpu,posix/mem"
--launcher="posix" --launcher_dir="/mesos/mesos-1.4.0/_build/src" --logbufsecs="0" --logging_level="INFO"
--max_completed_executors_per_framework="150" --oversubscribed_resources_interval="15secs"
--perf_duration="10secs" --perf_interval="1mins" --port="5051" --qos_correction_interval_min="0ns"
--quiet="false" --recover="reconnect" --recovery_timeout="15mins" --registration_backoff_factor="10ms"
--resources="cpus:2;gpus:0;mem:1024;disk:1024;ports:[31000-32000]" --revocable_cpu_low_priority="true"
--runtime_dir="/tmp/Endpoint_SlaveEndpointTest_NoAuthorizer_1_7yRwgJ" --sandbox_directory="/mnt/mesos/sandbox"
--strict="true" --switch_user="true" --systemd_enable_support="true" --systemd_runtime_directory="/run/systemd/system"
--version="false" --work_dir="/tmp/Endpoint_SlaveEndpointTest_NoAuthorizer_1_VwmgyQ"
I0801 17:18:17.089172  5132 credentials.hpp:86] Loading credential for authentication from
'/tmp/Endpoint_SlaveEndpointTest_NoAuthorizer_1_7yRwgJ/credential'
I0801 17:18:17.089437  5132 slave.cpp:283] Agent using credential for: test-principal
I0801 17:18:17.089470  5132 credentials.hpp:37] Loading credentials for authentication from
'/tmp/Endpoint_SlaveEndpointTest_NoAuthorizer_1_7yRwgJ/http_credentials'
I0801 17:18:17.089864  5132 http.cpp:993] Creating default 'basic' HTTP authenticator for
realm 'mesos-agent-readonly'
I0801 17:18:17.090091  5132 http.cpp:993] Creating default 'basic' HTTP authenticator for
realm 'mesos-agent-readwrite'
I0801 17:18:17.092234  5132 slave.cpp:565] Agent resources: [{"name":"cpus","scalar":{"value":2.0},"type":"SCALAR"},{"name":"mem","scalar":{"value":1024.0},"type":"SCALAR"},{"name":"disk","scalar":{"value":1024.0},"type":"SCALAR"},{"name":"ports","ranges":{"range":[{"begin":31000,"end":32000}]},"type":"RANGES"}]
I0801 17:18:17.092658  5132 slave.cpp:573] Agent attributes: [  ]
I0801 17:18:17.092679  5132 slave.cpp:582] Agent hostname: d74ff794ec99
I0801 17:18:17.092919  5127 status_update_manager.cpp:177] Pausing sending status updates
I0801 17:18:17.094842  5131 state.cpp:64] Recovering state from '/tmp/Endpoint_SlaveEndpointTest_NoAuthorizer_1_VwmgyQ/meta'
I0801 17:18:17.095463  5129 status_update_manager.cpp:203] Recovering status update manager
I0801 17:18:17.095790  5134 containerizer.cpp:582] Recovering containerizer
I0801 17:18:17.098247  5129 provisioner.cpp:416] Provisioner recovery complete
I0801 17:18:17.098990  5134 slave.cpp:6207] Finished recovery
I0801 17:18:17.099592  5134 slave.cpp:6389] Querying resource estimator for oversubscribable
resources
I0801 17:18:17.100039  5132 slave.cpp:6403] Received oversubscribable resources {} from the
resource estimator
I0801 17:18:17.104179  5133 process.cpp:3836] Handling HTTP event for process 'slave(800)'
with path: '/slave(800)/monitor/statistics.json'
I0801 17:18:17.106391  5131 http.cpp:1133] HTTP GET for /slave(800)/monitor/statistics.json
from 172.17.0.3:50856
I0801 17:18:17.106520  5131 http.cpp:957] Authorizing principal 'test-principal' to GET the
'/monitor/statistics.json' endpoint
I0801 17:18:17.114208  5133 slave.cpp:843] Agent terminating
[       OK ] Endpoint/SlaveEndpointTest.NoAuthorizer/1 (49 ms)
[ RUN      ] Endpoint/SlaveEndpointTest.NoAuthorizer/2
I0801 17:18:17.131489  5108 containerizer.cpp:230] Using isolation: posix/cpu,posix/mem,filesystem/posix,network/cni,environment_secret
W0801 17:18:17.132238  5108 backend.cpp:76] Failed to create 'overlay' backend: OverlayBackend
requires root privileges
W0801 17:18:17.132395  5108 backend.cpp:76] Failed to create 'bind' backend: BindBackend requires
root privileges
I0801 17:18:17.132436  5108 provisioner.cpp:255] Using default backend 'copy'
I0801 17:18:17.134802  5108 cluster.cpp:448] Creating default 'local' authorizer
I0801 17:18:17.137476  5130 slave.cpp:250] Mesos agent started on (801)@172.17.0.3:45141
I0801 17:18:17.137516  5130 slave.cpp:251] Flags at startup: --acls="" --appc_simple_discovery_uri_prefix="http://"
--appc_store_dir="/tmp/Endpoint_SlaveEndpointTest_NoAuthorizer_2_Ph7Eyg/store/appc" --authenticate_http_readonly="true"
--authenticate_http_readwrite="true" --authenticatee="crammd5" --authentication_backoff_factor="1secs"
--authorizer="local" --cgroups_cpu_enable_pids_and_tids_count="false" --cgroups_enable_cfs="false"
--cgroups_hierarchy="/sys/fs/cgroup" --cgroups_limit_swap="false" --cgroups_root="mesos" --container_disk_watch_interval="15secs"
--containerizers="mesos" --credential="/tmp/Endpoint_SlaveEndpointTest_NoAuthorizer_2_Ph7Eyg/credential"
--default_role="*" --disk_watch_interval="1mins" --docker="docker" --docker_kill_orphans="true"
--docker_registry="https://registry-1.docker.io" --docker_remove_delay="6hrs" --docker_socket="/var/run/docker.sock"
--docker_stop_timeout="0ns" --docker_store_dir="/tmp/Endpoint_SlaveEndpointTest_NoAuthorizer_2_Ph7Eyg/store/docker"
--docker_volume_checkpoint_dir="/var/run/mesos/isolators/docker/volume" --enforce_container_disk_quota="false"
--executor_registration_timeout="1mins" --executor_reregistration_timeout="2secs" --executor_shutdown_grace_period="5secs"
--fetcher_cache_dir="/tmp/Endpoint_SlaveEndpointTest_NoAuthorizer_2_Ph7Eyg/fetch" --fetcher_cache_size="2GB"
--frameworks_home="" --gc_delay="1weeks" --gc_disk_headroom="0.1" --hadoop_home="" --help="false"
--hostname_lookup="true" --http_command_executor="false" --http_credentials="/tmp/Endpoint_SlaveEndpointTest_NoAuthorizer_2_Ph7Eyg/http_credentials"
--http_heartbeat_interval="30secs" --initialize_driver_logging="true" --isolation="posix/cpu,posix/mem"
--launcher="posix" --launcher_dir="/mesos/mesos-1.4.0/_build/src" --logbufsecs="0" --logging_level="INFO"
--max_completed_executors_per_framework="150" --oversubscribed_resources_interval="15secs"
--perf_duration="10secs" --perf_interval="1mins" --port="5051" --qos_correction_interval_min="0ns"
--quiet="false" --recover="reconnect" --recovery_timeout="15mins" --registration_backoff_factor="10ms"
--resources="cpus:2;gpus:0;mem:1024;disk:1024;ports:[31000-32000]" --revocable_cpu_low_priority="true"
--runtime_dir="/tmp/Endpoint_SlaveEndpointTest_NoAuthorizer_2_Ph7Eyg" --sandbox_directory="/mnt/mesos/sandbox"
--strict="true" --switch_user="true" --systemd_enable_support="true" --systemd_runtime_directory="/run/systemd/system"
--version="false" --work_dir="/tmp/Endpoint_SlaveEndpointTest_NoAuthorizer_2_pq7oIn"
I0801 17:18:17.138242  5130 credentials.hpp:86] Loading credential for authentication from
'/tmp/Endpoint_SlaveEndpointTest_NoAuthorizer_2_Ph7Eyg/credential'
I0801 17:18:17.138509  5130 slave.cpp:283] Agent using credential for: test-principal
I0801 17:18:17.138538  5130 credentials.hpp:37] Loading credentials for authentication from
'/tmp/Endpoint_SlaveEndpointTest_NoAuthorizer_2_Ph7Eyg/http_credentials'
I0801 17:18:17.138942  5130 http.cpp:993] Creating default 'basic' HTTP authenticator for
realm 'mesos-agent-readonly'
I0801 17:18:17.139216  5130 http.cpp:993] Creating default 'basic' HTTP authenticator for
realm 'mesos-agent-readwrite'
I0801 17:18:17.141386  5130 slave.cpp:565] Agent resources: [{"name":"cpus","scalar":{"value":2.0},"type":"SCALAR"},{"name":"mem","scalar":{"value":1024.0},"type":"SCALAR"},{"name":"disk","scalar":{"value":1024.0},"type":"SCALAR"},{"name":"ports","ranges":{"range":[{"begin":31000,"end":32000}]},"type":"RANGES"}]
I0801 17:18:17.141810  5130 slave.cpp:573] Agent attributes: [  ]
I0801 17:18:17.141832  5130 slave.cpp:582] Agent hostname: d74ff794ec99
I0801 17:18:17.142113  5129 status_update_manager.cpp:177] Pausing sending status updates
I0801 17:18:17.144196  5128 state.cpp:64] Recovering state from '/tmp/Endpoint_SlaveEndpointTest_NoAuthorizer_2_pq7oIn/meta'
I0801 17:18:17.144775  5134 status_update_manager.cpp:203] Recovering status update manager
I0801 17:18:17.145043  5131 containerizer.cpp:582] Recovering containerizer
I0801 17:18:17.147245  5134 provisioner.cpp:416] Provisioner recovery complete
I0801 17:18:17.147789  5129 slave.cpp:6207] Finished recovery
I0801 17:18:17.148488  5129 slave.cpp:6389] Querying resource estimator for oversubscribable
resources
I0801 17:18:17.148938  5127 slave.cpp:6403] Received oversubscribable resources {} from the
resource estimator
I0801 17:18:17.152930  5132 process.cpp:3836] Handling HTTP event for process 'slave(801)'
with path: '/slave(801)/containers'
I0801 17:18:17.154894  5127 http.cpp:1133] HTTP GET for /slave(801)/containers from 172.17.0.3:50858
I0801 17:18:17.155141  5127 http.cpp:957] Authorizing principal 'test-principal' to GET the
'/containers' endpoint
I0801 17:18:17.160889  5130 slave.cpp:843] Agent terminating
[       OK ] Endpoint/SlaveEndpointTest.NoAuthorizer/2 (46 ms)
[----------] 9 tests from Endpoint/SlaveEndpointTest (443 ms total)

[----------] Global test environment tear-down
[==========] 1649 tests from 181 test cases ran. (709906 ms total)
[  PASSED  ] 1645 tests.
[  FAILED  ] 4 tests, listed below:
[  FAILED  ] DefaultExecutorCheckTest.CommandCheckDeliveredAndReconciled
[  FAILED  ] DefaultExecutorCheckTest.CommandCheckStatusChange
[  FAILED  ] DefaultExecutorCheckTest.CommandCheckSeesParentsEnv
[  FAILED  ] DefaultExecutorCheckTest.CommandCheckSharesWorkDirWithTask

 4 FAILED TESTS
  YOU HAVE 20 DISABLED TESTS

I0801 17:18:17.306077  5135 process.cpp:1006] Failed to accept socket: future discarded
make[4]: *** [check-local] Error 1
make[4]: Leaving directory `/mesos/mesos-1.4.0/_build/src'
make[3]: *** [check-am] Error 2
make[3]: Leaving directory `/mesos/mesos-1.4.0/_build/src'
make[2]: *** [check] Error 2
make[2]: Leaving directory `/mesos/mesos-1.4.0/_build/src'
make[1]: *** [check-recursive] Error 1
make[1]: Leaving directory `/mesos/mesos-1.4.0/_build'
make: *** [distcheck] Error 1
+ docker rmi mesos-1501601689-30612
Untagged: mesos-1501601689-30612:latest
Deleted: sha256:8be7ba4a881b42da27b1333e8940707213099eea53514ce1a2ef3535c7b9d8bd
Deleted: sha256:5beba8b191c4d6aa1fd00a52726b93fcb6e08819005f956d43692ca377be5862
Deleted: sha256:9ef3d1ad491c9da5668539efc44cb124dcd353697d1f5f4632ea5d1df2c843fc
Deleted: sha256:1541f4e554bffcffd5c40f5300d3aeb2b4f87aae256f5429e2900736bb26336e
Deleted: sha256:4ad168dab1110c7cdc3e1151c2762e48c56269e94284636c21693e0794c351a1
Deleted: sha256:5abd9363656e8058d74c1fd3a1ba0f5887c5cdc523867d8c8834218f2d32b35b
Deleted: sha256:9b617434284cf1f422e1132289a4a9a3bf4f88787398d92ac21dede330d57fa6
Deleted: sha256:e706f3672516706805ab445638735906779d643ff892f20b984db632acf6f808
Deleted: sha256:ef5888a518e562549f56df523c177e46376be1f01079d32ac2207af7e99a14a1
Deleted: sha256:b1a8e696dd0d73a6c55e7cfb5fe0b4bf59575b2f484640c30a73ab12bd06a289
Deleted: sha256:5e39163b21835616862749cd064e2e9d41784f3f1800619035a08dc0523594ea
Deleted: sha256:9522a64e0090b19cf3aae229253fd01b7f982f0cc15f9091afb03ed440b793b2
Deleted: sha256:90cc6ead5932f903c5e7cc61badbe4ad78782f082ce87ffe094c74b4ccb14393
Deleted: sha256:ed730e6e10c725219634207339e8a7caa51bf956fdfbcb6410441ba2712314ac
Deleted: sha256:a8470ed5ea65a97a99379afd308f462131851784d45082ffd702d6eee9ca3bfa
Deleted: sha256:c2178e32ebd11aa674572ce97b624d3aebfa82bc0b79952dc7b441aa7a3170b1
Deleted: sha256:33ec12f6ffb678a894956ca22c1a695434ee703a748b5462b7bd36c2a8bf6636
Deleted: sha256:2e2f28cdb91b0a78d4f43570af142c4ee7b1dd0f8b4d9d0afcde899e788f357b
Deleted: sha256:03aac59ec70e185ebe11741c3c00ffde9d64c9a5018ee6ab8e965762fbf9551c
Deleted: sha256:4d647670b846109dc521a64500bb29a4244e63ddab6f88d5d6e4895698aac263
Deleted: sha256:33073f4dfc33b9b5b95e2f18b3ed6f79abbdeb343b82eed337e2dbdc23d47343
Deleted: sha256:3f18ce5f340852cd7619234c756caecae8c720066b3c800d1c1c29286ac6faa0
Deleted: sha256:f2427396c6579e9de92dcd59725314fafb94e904c78c8afe140722ba59bc40e5
Deleted: sha256:eab2f2ad2b431459d2dc5a49355416608ed022e8a6b4d3f2b7e10ea8fda03582
Build step 'Execute shell' marked build as failure

Mime
View raw message