mesos-builds mailing list archives

Site index · List index
Message view « Date » · « Thread »
Top « Date » · « Thread »
From Apache Jenkins Server <jenk...@builds.apache.org>
Subject Build failed in Jenkins: Mesos-Buildbot » cmake,clang,--verbose,GLOG_v=1 MESOS_VERBOSE=1,ubuntu:14.04,(ubuntu)&&(!ubuntu-us1)&&(!ubuntu-eu2) #4035
Date Tue, 01 Aug 2017 19:06:58 GMT
See <https://builds.apache.org/job/Mesos-Buildbot/BUILDTOOL=cmake,COMPILER=clang,CONFIGURATION=--verbose,ENVIRONMENT=GLOG_v=1%20MESOS_VERBOSE=1,OS=ubuntu%3A14.04,label_exp=(ubuntu)&&(!ubuntu-us1)&&(!ubuntu-eu2)/4035/display/redirect>

------------------------------------------
[...truncated 28.38 MB...]
I0801 19:06:51.930591 30864 http.cpp:1133] HTTP GET for /slave(791)/monitor/statistics.json
from 172.17.0.2:37963
I0801 19:06:51.930677 30864 http.cpp:957] Authorizing principal 'test-principal' to GET the
'/monitor/statistics.json' endpoint
I0801 19:06:51.933807 30852 slave.cpp:843] Agent terminating
[       OK ] Endpoint/SlaveEndpointTest.AuthorizedRequest/1 (29 ms)
[ RUN      ] Endpoint/SlaveEndpointTest.AuthorizedRequest/2
I0801 19:06:51.945066 30852 containerizer.cpp:230] Using isolation: posix/cpu,posix/mem,filesystem/posix,network/cni,environment_secret
W0801 19:06:51.945591 30852 backend.cpp:76] Failed to create 'aufs' backend: AufsBackend requires
root privileges
W0801 19:06:51.945706 30852 backend.cpp:76] Failed to create 'bind' backend: BindBackend requires
root privileges
I0801 19:06:51.945746 30852 provisioner.cpp:255] Using default backend 'copy'
I0801 19:06:51.950525 30856 slave.cpp:250] Mesos agent started on (792)@172.17.0.2:60329
I0801 19:06:51.950577 30856 slave.cpp:251] Flags at startup: --acls="" --appc_simple_discovery_uri_prefix="http://"
--appc_store_dir="/tmp/Endpoint_SlaveEndpointTest_AuthorizedRequest_2_Ztr6c4/store/appc" --authenticate_http_readonly="true"
--authenticate_http_readwrite="true" --authenticatee="crammd5" --authentication_backoff_factor="1secs"
--authorizer="local" --cgroups_cpu_enable_pids_and_tids_count="false" --cgroups_enable_cfs="false"
--cgroups_hierarchy="/sys/fs/cgroup" --cgroups_limit_swap="false" --cgroups_root="mesos" --container_disk_watch_interval="15secs"
--containerizers="mesos" --credential="/tmp/Endpoint_SlaveEndpointTest_AuthorizedRequest_2_Ztr6c4/credential"
--default_role="*" --disk_watch_interval="1mins" --docker="docker" --docker_kill_orphans="true"
--docker_registry="https://registry-1.docker.io" --docker_remove_delay="6hrs" --docker_socket="/var/run/docker.sock"
--docker_stop_timeout="0ns" --docker_store_dir="/tmp/Endpoint_SlaveEndpointTest_AuthorizedRequest_2_Ztr6c4/store/docker"
--docker_volume_checkpoint_dir="/var/run/mesos/isolators/docker/volume" --enforce_container_disk_quota="false"
--executor_registration_timeout="1mins" --executor_reregistration_timeout="2secs" --executor_shutdown_grace_period="5secs"
--fetcher_cache_dir="/tmp/Endpoint_SlaveEndpointTest_AuthorizedRequest_2_Ztr6c4/fetch" --fetcher_cache_size="2GB"
--frameworks_home="" --gc_delay="1weeks" --gc_disk_headroom="0.1" --hadoop_home="" --help="false"
--hostname_lookup="true" --http_command_executor="false" --http_credentials="/tmp/Endpoint_SlaveEndpointTest_AuthorizedRequest_2_Ztr6c4/http_credentials"
--http_heartbeat_interval="30secs" --initialize_driver_logging="true" --isolation="posix/cpu,posix/mem"
--launcher="posix" --launcher_dir="/mesos/build/src" --logbufsecs="0" --logging_level="INFO"
--max_completed_executors_per_framework="150" --oversubscribed_resources_interval="15secs"
--perf_duration="10secs" --perf_interval="1mins" --port="5051" --qos_correction_interval_min="0ns"
--quiet="false" --recover="reconnect" --recovery_timeout="15mins" --registration_backoff_factor="10ms"
--resources="cpus:2;gpus:0;mem:1024;disk:1024;ports:[31000-32000]" --revocable_cpu_low_priority="true"
--runtime_dir="/tmp/Endpoint_SlaveEndpointTest_AuthorizedRequest_2_Ztr6c4" --sandbox_directory="/mnt/mesos/sandbox"
--strict="true" --switch_user="true" --systemd_enable_support="true" --systemd_runtime_directory="/run/systemd/system"
--version="false" --work_dir="/tmp/Endpoint_SlaveEndpointTest_AuthorizedRequest_2_pW4Ccw"
I0801 19:06:51.951122 30856 credentials.hpp:86] Loading credential for authentication from
'/tmp/Endpoint_SlaveEndpointTest_AuthorizedRequest_2_Ztr6c4/credential'
I0801 19:06:51.951416 30856 slave.cpp:283] Agent using credential for: test-principal
I0801 19:06:51.951444 30856 credentials.hpp:37] Loading credentials for authentication from
'/tmp/Endpoint_SlaveEndpointTest_AuthorizedRequest_2_Ztr6c4/http_credentials'
I0801 19:06:51.951721 30856 http.cpp:993] Creating default 'basic' HTTP authenticator for
realm 'mesos-agent-readonly'
I0801 19:06:51.951905 30856 http.cpp:993] Creating default 'basic' HTTP authenticator for
realm 'mesos-agent-readwrite'
I0801 19:06:51.953605 30856 slave.cpp:565] Agent resources: [{"name":"cpus","scalar":{"value":2.0},"type":"SCALAR"},{"name":"mem","scalar":{"value":1024.0},"type":"SCALAR"},{"name":"disk","scalar":{"value":1024.0},"type":"SCALAR"},{"name":"ports","ranges":{"range":[{"begin":31000,"end":32000}]},"type":"RANGES"}]
I0801 19:06:51.953874 30856 slave.cpp:573] Agent attributes: [  ]
I0801 19:06:51.953887 30856 slave.cpp:582] Agent hostname: d5a8e0f6f0d9
I0801 19:06:51.954053 30860 status_update_manager.cpp:177] Pausing sending status updates
I0801 19:06:51.955802 30861 state.cpp:64] Recovering state from '/tmp/Endpoint_SlaveEndpointTest_AuthorizedRequest_2_pW4Ccw/meta'
I0801 19:06:51.956081 30862 status_update_manager.cpp:203] Recovering status update manager
I0801 19:06:51.956266 30865 containerizer.cpp:582] Recovering containerizer
I0801 19:06:51.957620 30862 provisioner.cpp:416] Provisioner recovery complete
I0801 19:06:51.957926 30859 slave.cpp:6207] Finished recovery
I0801 19:06:51.958544 30859 slave.cpp:6389] Querying resource estimator for oversubscribable
resources
I0801 19:06:51.958755 30855 slave.cpp:6403] Received oversubscribable resources {} from the
resource estimator
I0801 19:06:51.962404 30860 process.cpp:3836] Handling HTTP event for process 'slave(792)'
with path: '/slave(792)/containers'
I0801 19:06:51.963500 30855 http.cpp:1133] HTTP GET for /slave(792)/containers from 172.17.0.2:37964
I0801 19:06:51.963593 30855 http.cpp:957] Authorizing principal 'test-principal' to GET the
'/containers' endpoint
I0801 19:06:51.967358 30852 slave.cpp:843] Agent terminating
[       OK ] Endpoint/SlaveEndpointTest.AuthorizedRequest/2 (32 ms)
[ RUN      ] Endpoint/SlaveEndpointTest.UnauthorizedRequest/0
I0801 19:06:51.977713 30852 containerizer.cpp:230] Using isolation: posix/cpu,posix/mem,filesystem/posix,network/cni,environment_secret
W0801 19:06:51.978284 30852 backend.cpp:76] Failed to create 'aufs' backend: AufsBackend requires
root privileges
W0801 19:06:51.978413 30852 backend.cpp:76] Failed to create 'bind' backend: BindBackend requires
root privileges
I0801 19:06:51.978456 30852 provisioner.cpp:255] Using default backend 'copy'
I0801 19:06:51.981606 30853 slave.cpp:250] Mesos agent started on (793)@172.17.0.2:60329
I0801 19:06:51.981647 30853 slave.cpp:251] Flags at startup: --acls="" --appc_simple_discovery_uri_prefix="http://"
--appc_store_dir="/tmp/Endpoint_SlaveEndpointTest_UnauthorizedRequest_0_xCq6wg/store/appc"
--authenticate_http_readonly="true" --authenticate_http_readwrite="true" --authenticatee="crammd5"
--authentication_backoff_factor="1secs" --authorizer="local" --cgroups_cpu_enable_pids_and_tids_count="false"
--cgroups_enable_cfs="false" --cgroups_hierarchy="/sys/fs/cgroup" --cgroups_limit_swap="false"
--cgroups_root="mesos" --container_disk_watch_interval="15secs" --containerizers="mesos" --credential="/tmp/Endpoint_SlaveEndpointTest_UnauthorizedRequest_0_xCq6wg/credential"
--default_role="*" --disk_watch_interval="1mins" --docker="docker" --docker_kill_orphans="true"
--docker_registry="https://registry-1.docker.io" --docker_remove_delay="6hrs" --docker_socket="/var/run/docker.sock"
--docker_stop_timeout="0ns" --docker_store_dir="/tmp/Endpoint_SlaveEndpointTest_UnauthorizedRequest_0_xCq6wg/store/docker"
--docker_volume_checkpoint_dir="/var/run/mesos/isolators/docker/volume" --enforce_container_disk_quota="false"
--executor_registration_timeout="1mins" --executor_reregistration_timeout="2secs" --executor_shutdown_grace_period="5secs"
--fetcher_cache_dir="/tmp/Endpoint_SlaveEndpointTest_UnauthorizedRequest_0_xCq6wg/fetch" --fetcher_cache_size="2GB"
--frameworks_home="" --gc_delay="1weeks" --gc_disk_headroom="0.1" --hadoop_home="" --help="false"
--hostname_lookup="true" --http_command_executor="false" --http_credentials="/tmp/Endpoint_SlaveEndpointTest_UnauthorizedRequest_0_xCq6wg/http_credentials"
--http_heartbeat_interval="30secs" --initialize_driver_logging="true" --isolation="posix/cpu,posix/mem"
--launcher="posix" --launcher_dir="/mesos/build/src" --logbufsecs="0" --logging_level="INFO"
--max_completed_executors_per_framework="150" --oversubscribed_resources_interval="15secs"
--perf_duration="10secs" --perf_interval="1mins" --port="5051" --qos_correction_interval_min="0ns"
--quiet="false" --recover="reconnect" --recovery_timeout="15mins" --registration_backoff_factor="10ms"
--resources="cpus:2;gpus:0;mem:1024;disk:1024;ports:[31000-32000]" --revocable_cpu_low_priority="true"
--runtime_dir="/tmp/Endpoint_SlaveEndpointTest_UnauthorizedRequest_0_xCq6wg" --sandbox_directory="/mnt/mesos/sandbox"
--strict="true" --switch_user="true" --systemd_enable_support="true" --systemd_runtime_directory="/run/systemd/system"
--version="false" --work_dir="/tmp/Endpoint_SlaveEndpointTest_UnauthorizedRequest_0_ZpNkrI"
I0801 19:06:51.982163 30853 credentials.hpp:86] Loading credential for authentication from
'/tmp/Endpoint_SlaveEndpointTest_UnauthorizedRequest_0_xCq6wg/credential'
I0801 19:06:51.982378 30853 slave.cpp:283] Agent using credential for: test-principal
I0801 19:06:51.982424 30853 credentials.hpp:37] Loading credentials for authentication from
'/tmp/Endpoint_SlaveEndpointTest_UnauthorizedRequest_0_xCq6wg/http_credentials'
I0801 19:06:51.982695 30853 http.cpp:993] Creating default 'basic' HTTP authenticator for
realm 'mesos-agent-readonly'
I0801 19:06:51.982839 30853 http.cpp:993] Creating default 'basic' HTTP authenticator for
realm 'mesos-agent-readwrite'
I0801 19:06:51.984088 30853 slave.cpp:565] Agent resources: [{"name":"cpus","scalar":{"value":2.0},"type":"SCALAR"},{"name":"mem","scalar":{"value":1024.0},"type":"SCALAR"},{"name":"disk","scalar":{"value":1024.0},"type":"SCALAR"},{"name":"ports","ranges":{"range":[{"begin":31000,"end":32000}]},"type":"RANGES"}]
I0801 19:06:51.984263 30853 slave.cpp:573] Agent attributes: [  ]
I0801 19:06:51.984273 30853 slave.cpp:582] Agent hostname: d5a8e0f6f0d9
I0801 19:06:51.984397 30859 status_update_manager.cpp:177] Pausing sending status updates
I0801 19:06:51.985680 30857 state.cpp:64] Recovering state from '/tmp/Endpoint_SlaveEndpointTest_UnauthorizedRequest_0_ZpNkrI/meta'
I0801 19:06:51.985991 30858 status_update_manager.cpp:203] Recovering status update manager
I0801 19:06:51.986201 30856 containerizer.cpp:582] Recovering containerizer
I0801 19:06:51.987568 30858 provisioner.cpp:416] Provisioner recovery complete
I0801 19:06:51.987906 30860 slave.cpp:6207] Finished recovery
I0801 19:06:51.988462 30860 slave.cpp:6389] Querying resource estimator for oversubscribable
resources
I0801 19:06:51.988694 30853 slave.cpp:6403] Received oversubscribable resources {} from the
resource estimator
I0801 19:06:51.991226 30859 process.cpp:3836] Handling HTTP event for process 'slave(793)'
with path: '/slave(793)/monitor/statistics'
I0801 19:06:51.992293 30857 http.cpp:1133] HTTP GET for /slave(793)/monitor/statistics from
172.17.0.2:37965
I0801 19:06:51.992374 30857 http.cpp:957] Authorizing principal 'test-principal' to GET the
'/monitor/statistics' endpoint
I0801 19:06:51.994302 30854 slave.cpp:843] Agent terminating
[       OK ] Endpoint/SlaveEndpointTest.UnauthorizedRequest/0 (27 ms)
[ RUN      ] Endpoint/SlaveEndpointTest.UnauthorizedRequest/1
I0801 19:06:52.007196 30852 containerizer.cpp:230] Using isolation: posix/cpu,posix/mem,filesystem/posix,network/cni,environment_secret
W0801 19:06:52.008116 30852 backend.cpp:76] Failed to create 'aufs' backend: AufsBackend requires
root privileges
W0801 19:06:52.008345 30852 backend.cpp:76] Failed to create 'bind' backend: BindBackend requires
root privileges
I0801 19:06:52.008471 30852 provisioner.cpp:255] Using default backend 'copy'
I0801 19:06:52.012670 30864 slave.cpp:250] Mesos agent started on (794)@172.17.0.2:60329
I0801 19:06:52.012706 30864 slave.cpp:251] Flags at startup: --acls="" --appc_simple_discovery_uri_prefix="http://"
--appc_store_dir="/tmp/Endpoint_SlaveEndpointTest_UnauthorizedRequest_1_vVdC9s/store/appc"
--authenticate_http_readonly="true" --authenticate_http_readwrite="true" --authenticatee="crammd5"
--authentication_backoff_factor="1secs" --authorizer="local" --cgroups_cpu_enable_pids_and_tids_count="false"
--cgroups_enable_cfs="false" --cgroups_hierarchy="/sys/fs/cgroup" --cgroups_limit_swap="false"
--cgroups_root="mesos" --container_disk_watch_interval="15secs" --containerizers="mesos" --credential="/tmp/Endpoint_SlaveEndpointTest_UnauthorizedRequest_1_vVdC9s/credential"
--default_role="*" --disk_watch_interval="1mins" --docker="docker" --docker_kill_orphans="true"
--docker_registry="https://registry-1.docker.io" --docker_remove_delay="6hrs" --docker_socket="/var/run/docker.sock"
--docker_stop_timeout="0ns" --docker_store_dir="/tmp/Endpoint_SlaveEndpointTest_UnauthorizedRequest_1_vVdC9s/store/docker"
--docker_volume_checkpoint_dir="/var/run/mesos/isolators/docker/volume" --enforce_container_disk_quota="false"
--executor_registration_timeout="1mins" --executor_reregistration_timeout="2secs" --executor_shutdown_grace_period="5secs"
--fetcher_cache_dir="/tmp/Endpoint_SlaveEndpointTest_UnauthorizedRequest_1_vVdC9s/fetch" --fetcher_cache_size="2GB"
--frameworks_home="" --gc_delay="1weeks" --gc_disk_headroom="0.1" --hadoop_home="" --help="false"
--hostname_lookup="true" --http_command_executor="false" --http_credentials="/tmp/Endpoint_SlaveEndpointTest_UnauthorizedRequest_1_vVdC9s/http_credentials"
--http_heartbeat_interval="30secs" --initialize_driver_logging="true" --isolation="posix/cpu,posix/mem"
--launcher="posix" --launcher_dir="/mesos/build/src" --logbufsecs="0" --logging_level="INFO"
--max_completed_executors_per_framework="150" --oversubscribed_resources_interval="15secs"
--perf_duration="10secs" --perf_interval="1mins" --port="5051" --qos_correction_interval_min="0ns"
--quiet="false" --recover="reconnect" --recovery_timeout="15mins" --registration_backoff_factor="10ms"
--resources="cpus:2;gpus:0;mem:1024;disk:1024;ports:[31000-32000]" --revocable_cpu_low_priority="true"
--runtime_dir="/tmp/Endpoint_SlaveEndpointTest_UnauthorizedRequest_1_vVdC9s" --sandbox_directory="/mnt/mesos/sandbox"
--strict="true" --switch_user="true" --systemd_enable_support="true" --systemd_runtime_directory="/run/systemd/system"
--version="false" --work_dir="/tmp/Endpoint_SlaveEndpointTest_UnauthorizedRequest_1_xTsgZU"
I0801 19:06:52.013131 30864 credentials.hpp:86] Loading credential for authentication from
'/tmp/Endpoint_SlaveEndpointTest_UnauthorizedRequest_1_vVdC9s/credential'
I0801 19:06:52.013304 30864 slave.cpp:283] Agent using credential for: test-principal
I0801 19:06:52.013324 30864 credentials.hpp:37] Loading credentials for authentication from
'/tmp/Endpoint_SlaveEndpointTest_UnauthorizedRequest_1_vVdC9s/http_credentials'
I0801 19:06:52.013562 30864 http.cpp:993] Creating default 'basic' HTTP authenticator for
realm 'mesos-agent-readonly'
I0801 19:06:52.013715 30864 http.cpp:993] Creating default 'basic' HTTP authenticator for
realm 'mesos-agent-readwrite'
I0801 19:06:52.015313 30864 slave.cpp:565] Agent resources: [{"name":"cpus","scalar":{"value":2.0},"type":"SCALAR"},{"name":"mem","scalar":{"value":1024.0},"type":"SCALAR"},{"name":"disk","scalar":{"value":1024.0},"type":"SCALAR"},{"name":"ports","ranges":{"range":[{"begin":31000,"end":32000}]},"type":"RANGES"}]
I0801 19:06:52.015532 30864 slave.cpp:573] Agent attributes: [  ]
I0801 19:06:52.015547 30864 slave.cpp:582] Agent hostname: d5a8e0f6f0d9
I0801 19:06:52.015955 30854 status_update_manager.cpp:177] Pausing sending status updates
I0801 19:06:52.017354 30864 state.cpp:64] Recovering state from '/tmp/Endpoint_SlaveEndpointTest_UnauthorizedRequest_1_xTsgZU/meta'
I0801 19:06:52.017706 30859 status_update_manager.cpp:203] Recovering status update manager
I0801 19:06:52.017922 30859 containerizer.cpp:582] Recovering containerizer
I0801 19:06:52.019685 30860 provisioner.cpp:416] Provisioner recovery complete
I0801 19:06:52.020090 30865 slave.cpp:6207] Finished recovery
I0801 19:06:52.020800 30865 slave.cpp:6389] Querying resource estimator for oversubscribable
resources
I0801 19:06:52.021034 30862 slave.cpp:6403] Received oversubscribable resources {} from the
resource estimator
I0801 19:06:52.023620 30853 process.cpp:3836] Handling HTTP event for process 'slave(794)'
with path: '/slave(794)/monitor/statistics.json'
I0801 19:06:52.025265 30866 http.cpp:1133] HTTP GET for /slave(794)/monitor/statistics.json
from 172.17.0.2:37966
I0801 19:06:52.025347 30866 http.cpp:957] Authorizing principal 'test-principal' to GET the
'/monitor/statistics.json' endpoint
I0801 19:06:52.027184 30859 slave.cpp:843] Agent terminating
[       OK ] Endpoint/SlaveEndpointTest.UnauthorizedRequest/1 (34 ms)
[ RUN      ] Endpoint/SlaveEndpointTest.UnauthorizedRequest/2
I0801 19:06:52.040907 30852 containerizer.cpp:230] Using isolation: posix/cpu,posix/mem,filesystem/posix,network/cni,environment_secret
W0801 19:06:52.041389 30852 backend.cpp:76] Failed to create 'aufs' backend: AufsBackend requires
root privileges
W0801 19:06:52.041489 30852 backend.cpp:76] Failed to create 'bind' backend: BindBackend requires
root privileges
I0801 19:06:52.041522 30852 provisioner.cpp:255] Using default backend 'copy'
I0801 19:06:52.044773 30862 slave.cpp:250] Mesos agent started on (795)@172.17.0.2:60329
I0801 19:06:52.044847 30862 slave.cpp:251] Flags at startup: --acls="" --appc_simple_discovery_uri_prefix="http://"
--appc_store_dir="/tmp/Endpoint_SlaveEndpointTest_UnauthorizedRequest_2_Hp6o8F/store/appc"
--authenticate_http_readonly="true" --authenticate_http_readwrite="true" --authenticatee="crammd5"
--authentication_backoff_factor="1secs" --authorizer="local" --cgroups_cpu_enable_pids_and_tids_count="false"
--cgroups_enable_cfs="false" --cgroups_hierarchy="/sys/fs/cgroup" --cgroups_limit_swap="false"
--cgroups_root="mesos" --container_disk_watch_interval="15secs" --containerizers="mesos" --credential="/tmp/Endpoint_SlaveEndpointTest_UnauthorizedRequest_2_Hp6o8F/credential"
--default_role="*" --disk_watch_interval="1mins" --docker="docker" --docker_kill_orphans="true"
--docker_registry="https://registry-1.docker.io" --docker_remove_delay="6hrs" --docker_socket="/var/run/docker.sock"
--docker_stop_timeout="0ns" --docker_store_dir="/tmp/Endpoint_SlaveEndpointTest_UnauthorizedRequest_2_Hp6o8F/store/docker"
--docker_volume_checkpoint_dir="/var/run/mesos/isolators/docker/volume" --enforce_container_disk_quota="false"
--executor_registration_timeout="1mins" --executor_reregistration_timeout="2secs" --executor_shutdown_grace_period="5secs"
--fetcher_cache_dir="/tmp/Endpoint_SlaveEndpointTest_UnauthorizedRequest_2_Hp6o8F/fetch" --fetcher_cache_size="2GB"
--frameworks_home="" --gc_delay="1weeks" --gc_disk_headroom="0.1" --hadoop_home="" --help="false"
--hostname_lookup="true" --http_command_executor="false" --http_credentials="/tmp/Endpoint_SlaveEndpointTest_UnauthorizedRequest_2_Hp6o8F/http_credentials"
--http_heartbeat_interval="30secs" --initialize_driver_logging="true" --isolation="posix/cpu,posix/mem"
--launcher="posix" --launcher_dir="/mesos/build/src" --logbufsecs="0" --logging_level="INFO"
--max_completed_executors_per_framework="150" --oversubscribed_resources_interval="15secs"
--perf_duration="10secs" --perf_interval="1mins" --port="5051" --qos_correction_interval_min="0ns"
--quiet="false" --recover="reconnect" --recovery_timeout="15mins" --registration_backoff_factor="10ms"
--resources="cpus:2;gpus:0;mem:1024;disk:1024;ports:[31000-32000]" --revocable_cpu_low_priority="true"
--runtime_dir="/tmp/Endpoint_SlaveEndpointTest_UnauthorizedRequest_2_Hp6o8F" --sandbox_directory="/mnt/mesos/sandbox"
--strict="true" --switch_user="true" --systemd_enable_support="true" --systemd_runtime_directory="/run/systemd/system"
--version="false" --work_dir="/tmp/Endpoint_SlaveEndpointTest_UnauthorizedRequest_2_th7nS7"
I0801 19:06:52.045424 30862 credentials.hpp:86] Loading credential for authentication from
'/tmp/Endpoint_SlaveEndpointTest_UnauthorizedRequest_2_Hp6o8F/credential'
I0801 19:06:52.045655 30862 slave.cpp:283] Agent using credential for: test-principal
I0801 19:06:52.045676 30862 credentials.hpp:37] Loading credentials for authentication from
'/tmp/Endpoint_SlaveEndpointTest_UnauthorizedRequest_2_Hp6o8F/http_credentials'
I0801 19:06:52.045934 30862 http.cpp:993] Creating default 'basic' HTTP authenticator for
realm 'mesos-agent-readonly'
I0801 19:06:52.046159 30862 http.cpp:993] Creating default 'basic' HTTP authenticator for
realm 'mesos-agent-readwrite'
I0801 19:06:52.047968 30862 slave.cpp:565] Agent resources: [{"name":"cpus","scalar":{"value":2.0},"type":"SCALAR"},{"name":"mem","scalar":{"value":1024.0},"type":"SCALAR"},{"name":"disk","scalar":{"value":1024.0},"type":"SCALAR"},{"name":"ports","ranges":{"range":[{"begin":31000,"end":32000}]},"type":"RANGES"}]
I0801 19:06:52.048274 30862 slave.cpp:573] Agent attributes: [  ]
I0801 19:06:52.048305 30862 slave.cpp:582] Agent hostname: d5a8e0f6f0d9
I0801 19:06:52.050093 30855 status_update_manager.cpp:177] Pausing sending status updates
I0801 19:06:52.050185 30855 state.cpp:64] Recovering state from '/tmp/Endpoint_SlaveEndpointTest_UnauthorizedRequest_2_th7nS7/meta'
I0801 19:06:52.050770 30864 status_update_manager.cpp:203] Recovering status update manager
I0801 19:06:52.050977 30859 containerizer.cpp:582] Recovering containerizer
I0801 19:06:52.057636 30862 provisioner.cpp:416] Provisioner recovery complete
I0801 19:06:52.058475 30862 slave.cpp:6207] Finished recovery
I0801 19:06:52.068570 30862 slave.cpp:6389] Querying resource estimator for oversubscribable
resources
I0801 19:06:52.069005 30862 slave.cpp:6403] Received oversubscribable resources {} from the
resource estimator
I0801 19:06:52.073129 30861 process.cpp:3836] Handling HTTP event for process 'slave(795)'
with path: '/slave(795)/containers'
I0801 19:06:52.074302 30856 http.cpp:1133] HTTP GET for /slave(795)/containers from 172.17.0.2:37967
I0801 19:06:52.074380 30856 http.cpp:957] Authorizing principal 'test-principal' to GET the
'/containers' endpoint
I0801 19:06:52.076320 30863 slave.cpp:843] Agent terminating
[       OK ] Endpoint/SlaveEndpointTest.UnauthorizedRequest/2 (46 ms)
[ RUN      ] Endpoint/SlaveEndpointTest.NoAuthorizer/0
I0801 19:06:52.087041 30852 containerizer.cpp:230] Using isolation: posix/cpu,posix/mem,filesystem/posix,network/cni,environment_secret
W0801 19:06:52.087648 30852 backend.cpp:76] Failed to create 'aufs' backend: AufsBackend requires
root privileges
W0801 19:06:52.087779 30852 backend.cpp:76] Failed to create 'bind' backend: BindBackend requires
root privileges
I0801 19:06:52.087822 30852 provisioner.cpp:255] Using default backend 'copy'
I0801 19:06:52.089653 30852 cluster.cpp:448] Creating default 'local' authorizer
I0801 19:06:52.091346 30868 slave.cpp:250] Mesos agent started on (796)@172.17.0.2:60329
I0801 19:06:52.091383 30868 slave.cpp:251] Flags at startup: --acls="" --appc_simple_discovery_uri_prefix="http://"
--appc_store_dir="/tmp/Endpoint_SlaveEndpointTest_NoAuthorizer_0_3QLXzT/store/appc" --authenticate_http_readonly="true"
--authenticate_http_readwrite="true" --authenticatee="crammd5" --authentication_backoff_factor="1secs"
--authorizer="local" --cgroups_cpu_enable_pids_and_tids_count="false" --cgroups_enable_cfs="false"
--cgroups_hierarchy="/sys/fs/cgroup" --cgroups_limit_swap="false" --cgroups_root="mesos" --container_disk_watch_interval="15secs"
--containerizers="mesos" --credential="/tmp/Endpoint_SlaveEndpointTest_NoAuthorizer_0_3QLXzT/credential"
--default_role="*" --disk_watch_interval="1mins" --docker="docker" --docker_kill_orphans="true"
--docker_registry="https://registry-1.docker.io" --docker_remove_delay="6hrs" --docker_socket="/var/run/docker.sock"
--docker_stop_timeout="0ns" --docker_store_dir="/tmp/Endpoint_SlaveEndpointTest_NoAuthorizer_0_3QLXzT/store/docker"
--docker_volume_checkpoint_dir="/var/run/mesos/isolators/docker/volume" --enforce_container_disk_quota="false"
--executor_registration_timeout="1mins" --executor_reregistration_timeout="2secs" --executor_shutdown_grace_period="5secs"
--fetcher_cache_dir="/tmp/Endpoint_SlaveEndpointTest_NoAuthorizer_0_3QLXzT/fetch" --fetcher_cache_size="2GB"
--frameworks_home="" --gc_delay="1weeks" --gc_disk_headroom="0.1" --hadoop_home="" --help="false"
--hostname_lookup="true" --http_command_executor="false" --http_credentials="/tmp/Endpoint_SlaveEndpointTest_NoAuthorizer_0_3QLXzT/http_credentials"
--http_heartbeat_interval="30secs" --initialize_driver_logging="true" --isolation="posix/cpu,posix/mem"
--launcher="posix" --launcher_dir="/mesos/build/src" --logbufsecs="0" --logging_level="INFO"
--max_completed_executors_per_framework="150" --oversubscribed_resources_interval="15secs"
--perf_duration="10secs" --perf_interval="1mins" --port="5051" --qos_correction_interval_min="0ns"
--quiet="false" --recover="reconnect" --recovery_timeout="15mins" --registration_backoff_factor="10ms"
--resources="cpus:2;gpus:0;mem:1024;disk:1024;ports:[31000-32000]" --revocable_cpu_low_priority="true"
--runtime_dir="/tmp/Endpoint_SlaveEndpointTest_NoAuthorizer_0_3QLXzT" --sandbox_directory="/mnt/mesos/sandbox"
--strict="true" --switch_user="true" --systemd_enable_support="true" --systemd_runtime_directory="/run/systemd/system"
--version="false" --work_dir="/tmp/Endpoint_SlaveEndpointTest_NoAuthorizer_0_nDNxcl"
I0801 19:06:52.091923 30868 credentials.hpp:86] Loading credential for authentication from
'/tmp/Endpoint_SlaveEndpointTest_NoAuthorizer_0_3QLXzT/credential'
I0801 19:06:52.092121 30868 slave.cpp:283] Agent using credential for: test-principal
I0801 19:06:52.092141 30868 credentials.hpp:37] Loading credentials for authentication from
'/tmp/Endpoint_SlaveEndpointTest_NoAuthorizer_0_3QLXzT/http_credentials'
I0801 19:06:52.092346 30868 http.cpp:993] Creating default 'basic' HTTP authenticator for
realm 'mesos-agent-readonly'
I0801 19:06:52.092492 30868 http.cpp:993] Creating default 'basic' HTTP authenticator for
realm 'mesos-agent-readwrite'
I0801 19:06:52.093724 30868 slave.cpp:565] Agent resources: [{"name":"cpus","scalar":{"value":2.0},"type":"SCALAR"},{"name":"mem","scalar":{"value":1024.0},"type":"SCALAR"},{"name":"disk","scalar":{"value":1024.0},"type":"SCALAR"},{"name":"ports","ranges":{"range":[{"begin":31000,"end":32000}]},"type":"RANGES"}]
I0801 19:06:52.093904 30868 slave.cpp:573] Agent attributes: [  ]
I0801 19:06:52.093919 30868 slave.cpp:582] Agent hostname: d5a8e0f6f0d9
I0801 19:06:52.094045 30867 status_update_manager.cpp:177] Pausing sending status updates
I0801 19:06:52.095291 30862 state.cpp:64] Recovering state from '/tmp/Endpoint_SlaveEndpointTest_NoAuthorizer_0_nDNxcl/meta'
I0801 19:06:52.095585 30854 status_update_manager.cpp:203] Recovering status update manager
I0801 19:06:52.095765 30856 containerizer.cpp:582] Recovering containerizer
I0801 19:06:52.097172 30854 provisioner.cpp:416] Provisioner recovery complete
I0801 19:06:52.097486 30861 slave.cpp:6207] Finished recovery
I0801 19:06:52.098021 30861 slave.cpp:6389] Querying resource estimator for oversubscribable
resources
I0801 19:06:52.098304 30868 slave.cpp:6403] Received oversubscribable resources {} from the
resource estimator
I0801 19:06:52.100639 30855 process.cpp:3836] Handling HTTP event for process 'slave(796)'
with path: '/slave(796)/monitor/statistics'
I0801 19:06:52.101672 30855 http.cpp:1133] HTTP GET for /slave(796)/monitor/statistics from
172.17.0.2:37968
I0801 19:06:52.101744 30855 http.cpp:957] Authorizing principal 'test-principal' to GET the
'/monitor/statistics' endpoint
I0801 19:06:52.104496 30863 slave.cpp:843] Agent terminating
[       OK ] Endpoint/SlaveEndpointTest.NoAuthorizer/0 (28 ms)
[ RUN      ] Endpoint/SlaveEndpointTest.NoAuthorizer/1
I0801 19:06:52.115283 30852 containerizer.cpp:230] Using isolation: posix/cpu,posix/mem,filesystem/posix,network/cni,environment_secret
W0801 19:06:52.115792 30852 backend.cpp:76] Failed to create 'aufs' backend: AufsBackend requires
root privileges
W0801 19:06:52.115916 30852 backend.cpp:76] Failed to create 'bind' backend: BindBackend requires
root privileges
I0801 19:06:52.115957 30852 provisioner.cpp:255] Using default backend 'copy'
I0801 19:06:52.117630 30852 cluster.cpp:448] Creating default 'local' authorizer
I0801 19:06:52.119202 30864 slave.cpp:250] Mesos agent started on (797)@172.17.0.2:60329
I0801 19:06:52.119242 30864 slave.cpp:251] Flags at startup: --acls="" --appc_simple_discovery_uri_prefix="http://"
--appc_store_dir="/tmp/Endpoint_SlaveEndpointTest_NoAuthorizer_1_Vlivl7/store/appc" --authenticate_http_readonly="true"
--authenticate_http_readwrite="true" --authenticatee="crammd5" --authentication_backoff_factor="1secs"
--authorizer="local" --cgroups_cpu_enable_pids_and_tids_count="false" --cgroups_enable_cfs="false"
--cgroups_hierarchy="/sys/fs/cgroup" --cgroups_limit_swap="false" --cgroups_root="mesos" --container_disk_watch_interval="15secs"
--containerizers="mesos" --credential="/tmp/Endpoint_SlaveEndpointTest_NoAuthorizer_1_Vlivl7/credential"
--default_role="*" --disk_watch_interval="1mins" --docker="docker" --docker_kill_orphans="true"
--docker_registry="https://registry-1.docker.io" --docker_remove_delay="6hrs" --docker_socket="/var/run/docker.sock"
--docker_stop_timeout="0ns" --docker_store_dir="/tmp/Endpoint_SlaveEndpointTest_NoAuthorizer_1_Vlivl7/store/docker"
--docker_volume_checkpoint_dir="/var/run/mesos/isolators/docker/volume" --enforce_container_disk_quota="false"
--executor_registration_timeout="1mins" --executor_reregistration_timeout="2secs" --executor_shutdown_grace_period="5secs"
--fetcher_cache_dir="/tmp/Endpoint_SlaveEndpointTest_NoAuthorizer_1_Vlivl7/fetch" --fetcher_cache_size="2GB"
--frameworks_home="" --gc_delay="1weeks" --gc_disk_headroom="0.1" --hadoop_home="" --help="false"
--hostname_lookup="true" --http_command_executor="false" --http_credentials="/tmp/Endpoint_SlaveEndpointTest_NoAuthorizer_1_Vlivl7/http_credentials"
--http_heartbeat_interval="30secs" --initialize_driver_logging="true" --isolation="posix/cpu,posix/mem"
--launcher="posix" --launcher_dir="/mesos/build/src" --logbufsecs="0" --logging_level="INFO"
--max_completed_executors_per_framework="150" --oversubscribed_resources_interval="15secs"
--perf_duration="10secs" --perf_interval="1mins" --port="5051" --qos_correction_interval_min="0ns"
--quiet="false" --recover="reconnect" --recovery_timeout="15mins" --registration_backoff_factor="10ms"
--resources="cpus:2;gpus:0;mem:1024;disk:1024;ports:[31000-32000]" --revocable_cpu_low_priority="true"
--runtime_dir="/tmp/Endpoint_SlaveEndpointTest_NoAuthorizer_1_Vlivl7" --sandbox_directory="/mnt/mesos/sandbox"
--strict="true" --switch_user="true" --systemd_enable_support="true" --systemd_runtime_directory="/run/systemd/system"
--version="false" --work_dir="/tmp/Endpoint_SlaveEndpointTest_NoAuthorizer_1_Rf9qTy"
I0801 19:06:52.119781 30864 credentials.hpp:86] Loading credential for authentication from
'/tmp/Endpoint_SlaveEndpointTest_NoAuthorizer_1_Vlivl7/credential'
I0801 19:06:52.120046 30864 slave.cpp:283] Agent using credential for: test-principal
I0801 19:06:52.120069 30864 credentials.hpp:37] Loading credentials for authentication from
'/tmp/Endpoint_SlaveEndpointTest_NoAuthorizer_1_Vlivl7/http_credentials'
I0801 19:06:52.120334 30864 http.cpp:993] Creating default 'basic' HTTP authenticator for
realm 'mesos-agent-readonly'
I0801 19:06:52.120484 30864 http.cpp:993] Creating default 'basic' HTTP authenticator for
realm 'mesos-agent-readwrite'
I0801 19:06:52.121750 30864 slave.cpp:565] Agent resources: [{"name":"cpus","scalar":{"value":2.0},"type":"SCALAR"},{"name":"mem","scalar":{"value":1024.0},"type":"SCALAR"},{"name":"disk","scalar":{"value":1024.0},"type":"SCALAR"},{"name":"ports","ranges":{"range":[{"begin":31000,"end":32000}]},"type":"RANGES"}]
I0801 19:06:52.121933 30864 slave.cpp:573] Agent attributes: [  ]
I0801 19:06:52.121949 30864 slave.cpp:582] Agent hostname: d5a8e0f6f0d9
I0801 19:06:52.122094 30863 status_update_manager.cpp:177] Pausing sending status updates
I0801 19:06:52.123469 30854 state.cpp:64] Recovering state from '/tmp/Endpoint_SlaveEndpointTest_NoAuthorizer_1_Rf9qTy/meta'
I0801 19:06:52.123793 30853 status_update_manager.cpp:203] Recovering status update manager
I0801 19:06:52.123984 30867 containerizer.cpp:582] Recovering containerizer
I0801 19:06:52.125891 30855 provisioner.cpp:416] Provisioner recovery complete
I0801 19:06:52.126428 30861 slave.cpp:6207] Finished recovery
I0801 19:06:52.127055 30861 slave.cpp:6389] Querying resource estimator for oversubscribable
resources
I0801 19:06:52.127280 30860 slave.cpp:6403] Received oversubscribable resources {} from the
resource estimator
I0801 19:06:52.130154 30856 process.cpp:3836] Handling HTTP event for process 'slave(797)'
with path: '/slave(797)/monitor/statistics.json'
I0801 19:06:52.131291 30860 http.cpp:1133] HTTP GET for /slave(797)/monitor/statistics.json
from 172.17.0.2:37969
I0801 19:06:52.131377 30860 http.cpp:957] Authorizing principal 'test-principal' to GET the
'/monitor/statistics.json' endpoint
I0801 19:06:52.135680 30853 slave.cpp:843] Agent terminating
[       OK ] Endpoint/SlaveEndpointTest.NoAuthorizer/1 (33 ms)
[ RUN      ] Endpoint/SlaveEndpointTest.NoAuthorizer/2
I0801 19:06:52.149237 30852 containerizer.cpp:230] Using isolation: posix/cpu,posix/mem,filesystem/posix,network/cni,environment_secret
W0801 19:06:52.149777 30852 backend.cpp:76] Failed to create 'aufs' backend: AufsBackend requires
root privileges
W0801 19:06:52.149885 30852 backend.cpp:76] Failed to create 'bind' backend: BindBackend requires
root privileges
I0801 19:06:52.149922 30852 provisioner.cpp:255] Using default backend 'copy'
I0801 19:06:52.151697 30852 cluster.cpp:448] Creating default 'local' authorizer
I0801 19:06:52.153753 30868 slave.cpp:250] Mesos agent started on (798)@172.17.0.2:60329
I0801 19:06:52.153795 30868 slave.cpp:251] Flags at startup: --acls="" --appc_simple_discovery_uri_prefix="http://"
--appc_store_dir="/tmp/Endpoint_SlaveEndpointTest_NoAuthorizer_2_rwbhsl/store/appc" --authenticate_http_readonly="true"
--authenticate_http_readwrite="true" --authenticatee="crammd5" --authentication_backoff_factor="1secs"
--authorizer="local" --cgroups_cpu_enable_pids_and_tids_count="false" --cgroups_enable_cfs="false"
--cgroups_hierarchy="/sys/fs/cgroup" --cgroups_limit_swap="false" --cgroups_root="mesos" --container_disk_watch_interval="15secs"
--containerizers="mesos" --credential="/tmp/Endpoint_SlaveEndpointTest_NoAuthorizer_2_rwbhsl/credential"
--default_role="*" --disk_watch_interval="1mins" --docker="docker" --docker_kill_orphans="true"
--docker_registry="https://registry-1.docker.io" --docker_remove_delay="6hrs" --docker_socket="/var/run/docker.sock"
--docker_stop_timeout="0ns" --docker_store_dir="/tmp/Endpoint_SlaveEndpointTest_NoAuthorizer_2_rwbhsl/store/docker"
--docker_volume_checkpoint_dir="/var/run/mesos/isolators/docker/volume" --enforce_container_disk_quota="false"
--executor_registration_timeout="1mins" --executor_reregistration_timeout="2secs" --executor_shutdown_grace_period="5secs"
--fetcher_cache_dir="/tmp/Endpoint_SlaveEndpointTest_NoAuthorizer_2_rwbhsl/fetch" --fetcher_cache_size="2GB"
--frameworks_home="" --gc_delay="1weeks" --gc_disk_headroom="0.1" --hadoop_home="" --help="false"
--hostname_lookup="true" --http_command_executor="false" --http_credentials="/tmp/Endpoint_SlaveEndpointTest_NoAuthorizer_2_rwbhsl/http_credentials"
--http_heartbeat_interval="30secs" --initialize_driver_logging="true" --isolation="posix/cpu,posix/mem"
--launcher="posix" --launcher_dir="/mesos/build/src" --logbufsecs="0" --logging_level="INFO"
--max_completed_executors_per_framework="150" --oversubscribed_resources_interval="15secs"
--perf_duration="10secs" --perf_interval="1mins" --port="5051" --qos_correction_interval_min="0ns"
--quiet="false" --recover="reconnect" --recovery_timeout="15mins" --registration_backoff_factor="10ms"
--resources="cpus:2;gpus:0;mem:1024;disk:1024;ports:[31000-32000]" --revocable_cpu_low_priority="true"
--runtime_dir="/tmp/Endpoint_SlaveEndpointTest_NoAuthorizer_2_rwbhsl" --sandbox_directory="/mnt/mesos/sandbox"
--strict="true" --switch_user="true" --systemd_enable_support="true" --systemd_runtime_directory="/run/systemd/system"
--version="false" --work_dir="/tmp/Endpoint_SlaveEndpointTest_NoAuthorizer_2_PTdIUM"
I0801 19:06:52.154666 30868 credentials.hpp:86] Loading credential for authentication from
'/tmp/Endpoint_SlaveEndpointTest_NoAuthorizer_2_rwbhsl/credential'
I0801 19:06:52.154913 30868 slave.cpp:283] Agent using credential for: test-principal
I0801 19:06:52.154985 30868 credentials.hpp:37] Loading credentials for authentication from
'/tmp/Endpoint_SlaveEndpointTest_NoAuthorizer_2_rwbhsl/http_credentials'
I0801 19:06:52.155270 30868 http.cpp:993] Creating default 'basic' HTTP authenticator for
realm 'mesos-agent-readonly'
I0801 19:06:52.155620 30868 http.cpp:993] Creating default 'basic' HTTP authenticator for
realm 'mesos-agent-readwrite'
I0801 19:06:52.156949 30868 slave.cpp:565] Agent resources: [{"name":"cpus","scalar":{"value":2.0},"type":"SCALAR"},{"name":"mem","scalar":{"value":1024.0},"type":"SCALAR"},{"name":"disk","scalar":{"value":1024.0},"type":"SCALAR"},{"name":"ports","ranges":{"range":[{"begin":31000,"end":32000}]},"type":"RANGES"}]
I0801 19:06:52.157140 30868 slave.cpp:573] Agent attributes: [  ]
I0801 19:06:52.157151 30868 slave.cpp:582] Agent hostname: d5a8e0f6f0d9
I0801 19:06:52.157282 30865 status_update_manager.cpp:177] Pausing sending status updates
I0801 19:06:52.158702 30853 state.cpp:64] Recovering state from '/tmp/Endpoint_SlaveEndpointTest_NoAuthorizer_2_PTdIUM/meta'
I0801 19:06:52.159221 30861 status_update_manager.cpp:203] Recovering status update manager
I0801 19:06:52.159406 30866 containerizer.cpp:582] Recovering containerizer
I0801 19:06:52.160774 30864 provisioner.cpp:416] Provisioner recovery complete
I0801 19:06:52.161121 30856 slave.cpp:6207] Finished recovery
I0801 19:06:52.161751 30856 slave.cpp:6389] Querying resource estimator for oversubscribable
resources
I0801 19:06:52.161998 30868 slave.cpp:6403] Received oversubscribable resources {} from the
resource estimator
I0801 19:06:52.164852 30854 process.cpp:3836] Handling HTTP event for process 'slave(798)'
with path: '/slave(798)/containers'
I0801 19:06:52.165959 30855 http.cpp:1133] HTTP GET for /slave(798)/containers from 172.17.0.2:37970
I0801 19:06:52.166043 30855 http.cpp:957] Authorizing principal 'test-principal' to GET the
'/containers' endpoint
I0801 19:06:52.170724 30866 slave.cpp:843] Agent terminating
[       OK ] Endpoint/SlaveEndpointTest.NoAuthorizer/2 (33 ms)
[----------] 9 tests from Endpoint/SlaveEndpointTest (319 ms total)

[----------] Global test environment tear-down
[==========] 1602 tests from 174 test cases ran. (307810 ms total)
[  PASSED  ] 1601 tests.
[  FAILED  ] 1 test, listed below:
[  FAILED  ] HealthCheckTest.HealthyTaskViaHTTPWithoutType

 1 FAILED TEST
  YOU HAVE 20 DISABLED TESTS

I0801 19:06:52.253149 30869 process.cpp:1006] Failed to accept socket: future discarded
make[3]: Leaving directory `/mesos/build'
make[3]: *** [CMakeFiles/check] Error 1
make[2]: *** [CMakeFiles/check.dir/all] Error 2
make[2]: Leaving directory `/mesos/build'
make[1]: Leaving directory `/mesos/build'
make[1]: *** [CMakeFiles/check.dir/rule] Error 2
make: *** [check] Error 2
+ docker rmi mesos-1501612035-20688
Untagged: mesos-1501612035-20688:latest
Deleted: sha256:9fb1be1c0bd7080fb7a026eb046d4e9fb0f5e0464d180554215a667da1bfb3d4
Deleted: sha256:38a0f65adbc9be11ee521a8ab42e9c780f633ee2aea8c277dd4cf0771f9a550d
Deleted: sha256:fa67f1731b3ff26a9bb1ea6412921f2ad5351abc81b497962bf0eaed74d88d7c
Deleted: sha256:23e9e230299fa2a1059417ebd92c7255fa611a61c8f90e494324282c28e97ce8
Deleted: sha256:e4cac1110a18dfb3d47a0c1295323a9414c05a2985216283f81dc78e7190cfe0
Deleted: sha256:d6cc547f6baa26c4c4c79dd1acbc7412807ead0c9da60f725bd0227c2156b8be
Deleted: sha256:5e74f63ad388bb8005ab62c0883a21eb3d55f0954576b2b6cd76fba0522bf8e0
Deleted: sha256:43401b2e653833cac12c7d9a865d046b1abcb1b54183f43d8cf46656b2824dde
Deleted: sha256:ef06ed73f4b9cc61c4480dc3d95defe115943d9058cab81504a3e81defed4326
Deleted: sha256:b59286e0d52bd065d85ad97c53036dd8d33defbf618afc7e5123732af0e53b2e
Deleted: sha256:0389ab7b176af167a895a0f4e3420222e7d7c2ab29e5250b291020f5184ea7f8
Deleted: sha256:15a36d95bd2c5ba739f8cdbee38c265564afb6f3f3a735f47ffbf8242d53b38b
Deleted: sha256:8c10a160ceed24904b64934c35392b45954c9b5a28a7f169bb8ec92d20d2cd98
Deleted: sha256:51bf2259ab7199d83c55b55ed1a0cf141c1fe8ff9dec41a62f292a3027088e52
Deleted: sha256:4d68d4e6f16700f63ffe5b4f7fb481e4291d7186fc4a91aa9651723cbde2d444
Deleted: sha256:f8a0b272e8da731b1cab82379a944fa8b7fc87315b96f1da5f74d5d041ac5cc6
Deleted: sha256:01facf97ac75b3166dc0684cb8e29c62a97ca6d64bdc47852193ec225a732c21
Deleted: sha256:88f5fce23b8712c07c756bb03e8cac49768d7935b09277a45d67ea340261ad8e
Deleted: sha256:48fa8e902bad75cce650e11317d8f3ea83718bca68e4105486957601b426ad2f
Deleted: sha256:5ea7615ae95a594affb65fa3c56496d6c60f7223c7451c23cccb3dc366a8a231
Deleted: sha256:18ddc68f1d940d8d765ac15461834d41230d912548dda43366ea2bda551bf7af
Deleted: sha256:245e119d64809b2ff00911eefb5d3713bd1b7958ce89517812d3dc24b785be0c
Deleted: sha256:c4ce273011724f6fe754883afa43146bd4c962a14184250ed4e106fdfeea83d6
Deleted: sha256:e8c0b84c69280ce9ff81704adf28dd2eafaccf86647da5f32ea3934a4a56bf3a
Build step 'Execute shell' marked build as failure

Mime
View raw message