mesos-builds mailing list archives

Site index · List index
Message view « Date » · « Thread »
Top « Date » · « Thread »
From Apache Jenkins Server <jenk...@builds.apache.org>
Subject Build failed in Jenkins: Mesos-Buildbot » autotools,gcc,--verbose --enable-libevent --enable-ssl,GLOG_v=1 MESOS_VERBOSE=1,ubuntu:14.04,(ubuntu)&&(!ubuntu-us1)&&(!ubuntu-eu2) #4121
Date Thu, 17 Aug 2017 19:58:51 GMT
See <https://builds.apache.org/job/Mesos-Buildbot/BUILDTOOL=autotools,COMPILER=gcc,CONFIGURATION=--verbose%20--enable-libevent%20--enable-ssl,ENVIRONMENT=GLOG_v=1%20MESOS_VERBOSE=1,OS=ubuntu%3A14.04,label_exp=(ubuntu)&&(!ubuntu-us1)&&(!ubuntu-eu2)/4121/display/redirect?page=changes>

Changes:

[songzihao1990] Change launcher working directory before dropping privilege.

[songzihao1990] Fixed mesos containerizer to support docker image WORKDIR missing.

[songzihao1990] Added MESOS-7652 to 1.3.2 CHANGELOG.

------------------------------------------
[...truncated 28.22 MB...]
I0817 19:58:43.900434 20964 http.cpp:936] Authorizing principal 'test-principal' to GET the
'/containers' endpoint
I0817 19:58:43.904480 20962 slave.cpp:796] Agent terminating
[       OK ] Endpoint/SlaveEndpointTest.AuthorizedRequest/2 (29 ms)
[ RUN      ] Endpoint/SlaveEndpointTest.UnauthorizedRequest/0
I0817 19:58:43.915019  1263 containerizer.cpp:221] Using isolation: posix/cpu,posix/mem,filesystem/posix,network/cni
W0817 19:58:43.915581  1263 backend.cpp:76] Failed to create 'aufs' backend: AufsBackend requires
root privileges
W0817 19:58:43.915693  1263 backend.cpp:76] Failed to create 'bind' backend: BindBackend requires
root privileges
I0817 19:58:43.915724  1263 provisioner.cpp:249] Using default backend 'copy'
I0817 19:58:43.919301 20968 slave.cpp:231] Mesos agent started on (747)@172.17.0.5:45737
I0817 19:58:43.919324 20968 slave.cpp:232] Flags at startup: --acls="" --appc_simple_discovery_uri_prefix="http://"
--appc_store_dir="/tmp/mesos/store/appc" --authenticate_http_executors="true" --authenticate_http_readonly="true"
--authenticate_http_readwrite="true" --authenticatee="crammd5" --authentication_backoff_factor="1secs"
--authorizer="local" --cgroups_cpu_enable_pids_and_tids_count="false" --cgroups_enable_cfs="false"
--cgroups_hierarchy="/sys/fs/cgroup" --cgroups_limit_swap="false" --cgroups_root="mesos" --container_disk_watch_interval="15secs"
--containerizers="mesos" --credential="/tmp/Endpoint_SlaveEndpointTest_UnauthorizedRequest_0_0aSHcA/credential"
--default_role="*" --disk_watch_interval="1mins" --docker="docker" --docker_kill_orphans="true"
--docker_registry="https://registry-1.docker.io" --docker_remove_delay="6hrs" --docker_socket="/var/run/docker.sock"
--docker_stop_timeout="0ns" --docker_store_dir="/tmp/mesos/store/docker" --docker_volume_checkpoint_dir="/var/run/mesos/isolators/docker/volume"
--enforce_container_disk_quota="false" --executor_registration_timeout="1mins" --executor_reregistration_timeout="2secs"
--executor_secret_key="/tmp/Endpoint_SlaveEndpointTest_UnauthorizedRequest_0_0aSHcA/executor_secret_key"
--executor_shutdown_grace_period="5secs" --fetcher_cache_dir="/tmp/Endpoint_SlaveEndpointTest_UnauthorizedRequest_0_0aSHcA/fetch"
--fetcher_cache_size="2GB" --frameworks_home="" --gc_delay="1weeks" --gc_disk_headroom="0.1"
--hadoop_home="" --help="false" --hostname_lookup="true" --http_command_executor="false" --http_credentials="/tmp/Endpoint_SlaveEndpointTest_UnauthorizedRequest_0_0aSHcA/http_credentials"
--http_heartbeat_interval="30secs" --initialize_driver_logging="true" --isolation="posix/cpu,posix/mem"
--launcher="posix" --launcher_dir="/mesos/mesos-1.3.2/_build/src" --logbufsecs="0" --logging_level="INFO"
--max_completed_executors_per_framework="150" --oversubscribed_resources_interval="15secs"
--perf_duration="10secs" --perf_interval="1mins" --port="5051" --qos_correction_interval_min="0ns"
--quiet="false" --recover="reconnect" --recovery_timeout="15mins" --registration_backoff_factor="10ms"
--resources="cpus:2;gpus:0;mem:1024;disk:1024;ports:[31000-32000]" --revocable_cpu_low_priority="true"
--runtime_dir="/tmp/Endpoint_SlaveEndpointTest_UnauthorizedRequest_0_0aSHcA" --sandbox_directory="/mnt/mesos/sandbox"
--strict="true" --switch_user="true" --systemd_enable_support="true" --systemd_runtime_directory="/run/systemd/system"
--version="false" --work_dir="/tmp/Endpoint_SlaveEndpointTest_UnauthorizedRequest_0_xP2PTN"
I0817 19:58:43.919718 20968 credentials.hpp:86] Loading credential for authentication from
'/tmp/Endpoint_SlaveEndpointTest_UnauthorizedRequest_0_0aSHcA/credential'
I0817 19:58:43.919864 20968 slave.cpp:264] Agent using credential for: test-principal
I0817 19:58:43.919885 20968 credentials.hpp:37] Loading credentials for authentication from
'/tmp/Endpoint_SlaveEndpointTest_UnauthorizedRequest_0_0aSHcA/http_credentials'
I0817 19:58:43.920162 20968 http.cpp:975] Creating default 'basic' HTTP authenticator for
realm 'mesos-agent-executor'
I0817 19:58:43.920284 20968 http.cpp:996] Creating default 'jwt' HTTP authenticator for realm
'mesos-agent-executor'
I0817 19:58:43.920486 20968 http.cpp:975] Creating default 'basic' HTTP authenticator for
realm 'mesos-agent-readonly'
I0817 19:58:43.920768 20968 http.cpp:996] Creating default 'jwt' HTTP authenticator for realm
'mesos-agent-readonly'
I0817 19:58:43.920984 20968 http.cpp:975] Creating default 'basic' HTTP authenticator for
realm 'mesos-agent-readwrite'
I0817 19:58:43.921171 20968 http.cpp:996] Creating default 'jwt' HTTP authenticator for realm
'mesos-agent-readwrite'
I0817 19:58:43.922679 20968 slave.cpp:531] Agent resources: cpus(*):2; mem(*):1024; disk(*):1024;
ports(*):[31000-32000]
I0817 19:58:43.922770 20968 slave.cpp:539] Agent attributes: [  ]
I0817 19:58:43.922785 20968 slave.cpp:544] Agent hostname: 997b8569d37c
I0817 19:58:43.922988 20960 status_update_manager.cpp:177] Pausing sending status updates
I0817 19:58:43.924475 20951 state.cpp:62] Recovering state from '/tmp/Endpoint_SlaveEndpointTest_UnauthorizedRequest_0_xP2PTN/meta'
I0817 19:58:43.924834 20952 status_update_manager.cpp:203] Recovering status update manager
I0817 19:58:43.925057 20966 containerizer.cpp:608] Recovering containerizer
I0817 19:58:43.926434 20966 provisioner.cpp:410] Provisioner recovery complete
I0817 19:58:43.926818 20951 slave.cpp:6075] Finished recovery
I0817 19:58:43.927284 20951 slave.cpp:6257] Querying resource estimator for oversubscribable
resources
I0817 19:58:43.927640 20968 slave.cpp:6271] Received oversubscribable resources {} from the
resource estimator
I0817 19:58:43.929797 20970 process.cpp:3741] Handling HTTP event for process 'slave(747)'
with path: '/slave(747)/monitor/statistics'
I0817 19:58:43.931694 20964 http.cpp:1115] HTTP GET for /slave(747)/monitor/statistics from
172.17.0.5:47690
I0817 19:58:43.931787 20964 http.cpp:936] Authorizing principal 'test-principal' to GET the
'/monitor/statistics' endpoint
I0817 19:58:43.934159 20966 slave.cpp:796] Agent terminating
[       OK ] Endpoint/SlaveEndpointTest.UnauthorizedRequest/0 (30 ms)
[ RUN      ] Endpoint/SlaveEndpointTest.UnauthorizedRequest/1
I0817 19:58:43.944718  1263 containerizer.cpp:221] Using isolation: posix/cpu,posix/mem,filesystem/posix,network/cni
W0817 19:58:43.945225  1263 backend.cpp:76] Failed to create 'aufs' backend: AufsBackend requires
root privileges
W0817 19:58:43.945317  1263 backend.cpp:76] Failed to create 'bind' backend: BindBackend requires
root privileges
I0817 19:58:43.945345  1263 provisioner.cpp:249] Using default backend 'copy'
I0817 19:58:43.948247 20955 slave.cpp:231] Mesos agent started on (748)@172.17.0.5:45737
I0817 19:58:43.948266 20955 slave.cpp:232] Flags at startup: --acls="" --appc_simple_discovery_uri_prefix="http://"
--appc_store_dir="/tmp/mesos/store/appc" --authenticate_http_executors="true" --authenticate_http_readonly="true"
--authenticate_http_readwrite="true" --authenticatee="crammd5" --authentication_backoff_factor="1secs"
--authorizer="local" --cgroups_cpu_enable_pids_and_tids_count="false" --cgroups_enable_cfs="false"
--cgroups_hierarchy="/sys/fs/cgroup" --cgroups_limit_swap="false" --cgroups_root="mesos" --container_disk_watch_interval="15secs"
--containerizers="mesos" --credential="/tmp/Endpoint_SlaveEndpointTest_UnauthorizedRequest_1_ifZnFH/credential"
--default_role="*" --disk_watch_interval="1mins" --docker="docker" --docker_kill_orphans="true"
--docker_registry="https://registry-1.docker.io" --docker_remove_delay="6hrs" --docker_socket="/var/run/docker.sock"
--docker_stop_timeout="0ns" --docker_store_dir="/tmp/mesos/store/docker" --docker_volume_checkpoint_dir="/var/run/mesos/isolators/docker/volume"
--enforce_container_disk_quota="false" --executor_registration_timeout="1mins" --executor_reregistration_timeout="2secs"
--executor_secret_key="/tmp/Endpoint_SlaveEndpointTest_UnauthorizedRequest_1_ifZnFH/executor_secret_key"
--executor_shutdown_grace_period="5secs" --fetcher_cache_dir="/tmp/Endpoint_SlaveEndpointTest_UnauthorizedRequest_1_ifZnFH/fetch"
--fetcher_cache_size="2GB" --frameworks_home="" --gc_delay="1weeks" --gc_disk_headroom="0.1"
--hadoop_home="" --help="false" --hostname_lookup="true" --http_command_executor="false" --http_credentials="/tmp/Endpoint_SlaveEndpointTest_UnauthorizedRequest_1_ifZnFH/http_credentials"
--http_heartbeat_interval="30secs" --initialize_driver_logging="true" --isolation="posix/cpu,posix/mem"
--launcher="posix" --launcher_dir="/mesos/mesos-1.3.2/_build/src" --logbufsecs="0" --logging_level="INFO"
--max_completed_executors_per_framework="150" --oversubscribed_resources_interval="15secs"
--perf_duration="10secs" --perf_interval="1mins" --port="5051" --qos_correction_interval_min="0ns"
--quiet="false" --recover="reconnect" --recovery_timeout="15mins" --registration_backoff_factor="10ms"
--resources="cpus:2;gpus:0;mem:1024;disk:1024;ports:[31000-32000]" --revocable_cpu_low_priority="true"
--runtime_dir="/tmp/Endpoint_SlaveEndpointTest_UnauthorizedRequest_1_ifZnFH" --sandbox_directory="/mnt/mesos/sandbox"
--strict="true" --switch_user="true" --systemd_enable_support="true" --systemd_runtime_directory="/run/systemd/system"
--version="false" --work_dir="/tmp/Endpoint_SlaveEndpointTest_UnauthorizedRequest_1_loG4hV"
I0817 19:58:43.948618 20955 credentials.hpp:86] Loading credential for authentication from
'/tmp/Endpoint_SlaveEndpointTest_UnauthorizedRequest_1_ifZnFH/credential'
I0817 19:58:43.948767 20955 slave.cpp:264] Agent using credential for: test-principal
I0817 19:58:43.948787 20955 credentials.hpp:37] Loading credentials for authentication from
'/tmp/Endpoint_SlaveEndpointTest_UnauthorizedRequest_1_ifZnFH/http_credentials'
I0817 19:58:43.949077 20955 http.cpp:975] Creating default 'basic' HTTP authenticator for
realm 'mesos-agent-executor'
I0817 19:58:43.949193 20955 http.cpp:996] Creating default 'jwt' HTTP authenticator for realm
'mesos-agent-executor'
I0817 19:58:43.949385 20955 http.cpp:975] Creating default 'basic' HTTP authenticator for
realm 'mesos-agent-readonly'
I0817 19:58:43.949524 20955 http.cpp:996] Creating default 'jwt' HTTP authenticator for realm
'mesos-agent-readonly'
I0817 19:58:43.949731 20955 http.cpp:975] Creating default 'basic' HTTP authenticator for
realm 'mesos-agent-readwrite'
I0817 19:58:43.949908 20955 http.cpp:996] Creating default 'jwt' HTTP authenticator for realm
'mesos-agent-readwrite'
I0817 19:58:43.951637 20955 slave.cpp:531] Agent resources: cpus(*):2; mem(*):1024; disk(*):1024;
ports(*):[31000-32000]
I0817 19:58:43.951732 20955 slave.cpp:539] Agent attributes: [  ]
I0817 19:58:43.951746 20955 slave.cpp:544] Agent hostname: 997b8569d37c
I0817 19:58:43.951891 20968 status_update_manager.cpp:177] Pausing sending status updates
I0817 19:58:43.953364 20951 state.cpp:62] Recovering state from '/tmp/Endpoint_SlaveEndpointTest_UnauthorizedRequest_1_loG4hV/meta'
I0817 19:58:43.953660 20954 status_update_manager.cpp:203] Recovering status update manager
I0817 19:58:43.953826 20968 containerizer.cpp:608] Recovering containerizer
I0817 19:58:43.955255 20952 provisioner.cpp:410] Provisioner recovery complete
I0817 19:58:43.955623 20962 slave.cpp:6075] Finished recovery
I0817 19:58:43.956123 20962 slave.cpp:6257] Querying resource estimator for oversubscribable
resources
I0817 19:58:43.956362 20957 slave.cpp:6271] Received oversubscribable resources {} from the
resource estimator
I0817 19:58:43.958549 20968 process.cpp:3741] Handling HTTP event for process 'slave(748)'
with path: '/slave(748)/monitor/statistics.json'
I0817 19:58:43.960408 20959 http.cpp:1115] HTTP GET for /slave(748)/monitor/statistics.json
from 172.17.0.5:47692
I0817 19:58:43.960480 20959 http.cpp:936] Authorizing principal 'test-principal' to GET the
'/monitor/statistics.json' endpoint
I0817 19:58:43.962986 20972 slave.cpp:796] Agent terminating
[       OK ] Endpoint/SlaveEndpointTest.UnauthorizedRequest/1 (28 ms)
[ RUN      ] Endpoint/SlaveEndpointTest.UnauthorizedRequest/2
I0817 19:58:43.973512  1263 containerizer.cpp:221] Using isolation: posix/cpu,posix/mem,filesystem/posix,network/cni
W0817 19:58:43.974020  1263 backend.cpp:76] Failed to create 'aufs' backend: AufsBackend requires
root privileges
W0817 19:58:43.974128  1263 backend.cpp:76] Failed to create 'bind' backend: BindBackend requires
root privileges
I0817 19:58:43.974156  1263 provisioner.cpp:249] Using default backend 'copy'
I0817 19:58:43.977635 20966 slave.cpp:231] Mesos agent started on (749)@172.17.0.5:45737
I0817 19:58:43.977660 20966 slave.cpp:232] Flags at startup: --acls="" --appc_simple_discovery_uri_prefix="http://"
--appc_store_dir="/tmp/mesos/store/appc" --authenticate_http_executors="true" --authenticate_http_readonly="true"
--authenticate_http_readwrite="true" --authenticatee="crammd5" --authentication_backoff_factor="1secs"
--authorizer="local" --cgroups_cpu_enable_pids_and_tids_count="false" --cgroups_enable_cfs="false"
--cgroups_hierarchy="/sys/fs/cgroup" --cgroups_limit_swap="false" --cgroups_root="mesos" --container_disk_watch_interval="15secs"
--containerizers="mesos" --credential="/tmp/Endpoint_SlaveEndpointTest_UnauthorizedRequest_2_89PapP/credential"
--default_role="*" --disk_watch_interval="1mins" --docker="docker" --docker_kill_orphans="true"
--docker_registry="https://registry-1.docker.io" --docker_remove_delay="6hrs" --docker_socket="/var/run/docker.sock"
--docker_stop_timeout="0ns" --docker_store_dir="/tmp/mesos/store/docker" --docker_volume_checkpoint_dir="/var/run/mesos/isolators/docker/volume"
--enforce_container_disk_quota="false" --executor_registration_timeout="1mins" --executor_reregistration_timeout="2secs"
--executor_secret_key="/tmp/Endpoint_SlaveEndpointTest_UnauthorizedRequest_2_89PapP/executor_secret_key"
--executor_shutdown_grace_period="5secs" --fetcher_cache_dir="/tmp/Endpoint_SlaveEndpointTest_UnauthorizedRequest_2_89PapP/fetch"
--fetcher_cache_size="2GB" --frameworks_home="" --gc_delay="1weeks" --gc_disk_headroom="0.1"
--hadoop_home="" --help="false" --hostname_lookup="true" --http_command_executor="false" --http_credentials="/tmp/Endpoint_SlaveEndpointTest_UnauthorizedRequest_2_89PapP/http_credentials"
--http_heartbeat_interval="30secs" --initialize_driver_logging="true" --isolation="posix/cpu,posix/mem"
--launcher="posix" --launcher_dir="/mesos/mesos-1.3.2/_build/src" --logbufsecs="0" --logging_level="INFO"
--max_completed_executors_per_framework="150" --oversubscribed_resources_interval="15secs"
--perf_duration="10secs" --perf_interval="1mins" --port="5051" --qos_correction_interval_min="0ns"
--quiet="false" --recover="reconnect" --recovery_timeout="15mins" --registration_backoff_factor="10ms"
--resources="cpus:2;gpus:0;mem:1024;disk:1024;ports:[31000-32000]" --revocable_cpu_low_priority="true"
--runtime_dir="/tmp/Endpoint_SlaveEndpointTest_UnauthorizedRequest_2_89PapP" --sandbox_directory="/mnt/mesos/sandbox"
--strict="true" --switch_user="true" --systemd_enable_support="true" --systemd_runtime_directory="/run/systemd/system"
--version="false" --work_dir="/tmp/Endpoint_SlaveEndpointTest_UnauthorizedRequest_2_ZGxAX2"
I0817 19:58:43.978119 20966 credentials.hpp:86] Loading credential for authentication from
'/tmp/Endpoint_SlaveEndpointTest_UnauthorizedRequest_2_89PapP/credential'
I0817 19:58:43.978292 20966 slave.cpp:264] Agent using credential for: test-principal
I0817 19:58:43.978313 20966 credentials.hpp:37] Loading credentials for authentication from
'/tmp/Endpoint_SlaveEndpointTest_UnauthorizedRequest_2_89PapP/http_credentials'
I0817 19:58:43.978587 20966 http.cpp:975] Creating default 'basic' HTTP authenticator for
realm 'mesos-agent-executor'
I0817 19:58:43.978699 20966 http.cpp:996] Creating default 'jwt' HTTP authenticator for realm
'mesos-agent-executor'
I0817 19:58:43.978893 20966 http.cpp:975] Creating default 'basic' HTTP authenticator for
realm 'mesos-agent-readonly'
I0817 19:58:43.979051 20966 http.cpp:996] Creating default 'jwt' HTTP authenticator for realm
'mesos-agent-readonly'
I0817 19:58:43.979532 20966 http.cpp:975] Creating default 'basic' HTTP authenticator for
realm 'mesos-agent-readwrite'
I0817 19:58:43.979660 20966 http.cpp:996] Creating default 'jwt' HTTP authenticator for realm
'mesos-agent-readwrite'
I0817 19:58:43.981186 20966 slave.cpp:531] Agent resources: cpus(*):2; mem(*):1024; disk(*):1024;
ports(*):[31000-32000]
I0817 19:58:43.981271 20966 slave.cpp:539] Agent attributes: [  ]
I0817 19:58:43.981281 20966 slave.cpp:544] Agent hostname: 997b8569d37c
I0817 19:58:43.981401 20961 status_update_manager.cpp:177] Pausing sending status updates
I0817 19:58:43.982558 20972 state.cpp:62] Recovering state from '/tmp/Endpoint_SlaveEndpointTest_UnauthorizedRequest_2_ZGxAX2/meta'
I0817 19:58:43.982867 20970 status_update_manager.cpp:203] Recovering status update manager
I0817 19:58:43.983077 20958 containerizer.cpp:608] Recovering containerizer
I0817 19:58:43.984701 20958 provisioner.cpp:410] Provisioner recovery complete
I0817 19:58:43.985097 20961 slave.cpp:6075] Finished recovery
I0817 19:58:43.985644 20961 slave.cpp:6257] Querying resource estimator for oversubscribable
resources
I0817 19:58:43.985908 20955 slave.cpp:6271] Received oversubscribable resources {} from the
resource estimator
I0817 19:58:43.987957 20971 process.cpp:3741] Handling HTTP event for process 'slave(749)'
with path: '/slave(749)/containers'
I0817 19:58:43.990175 20968 http.cpp:1115] HTTP GET for /slave(749)/containers from 172.17.0.5:47694
I0817 19:58:43.990268 20968 http.cpp:936] Authorizing principal 'test-principal' to GET the
'/containers' endpoint
I0817 19:58:43.992156 20952 slave.cpp:796] Agent terminating
[       OK ] Endpoint/SlaveEndpointTest.UnauthorizedRequest/2 (28 ms)
[ RUN      ] Endpoint/SlaveEndpointTest.NoAuthorizer/0
I0817 19:58:44.002827  1263 containerizer.cpp:221] Using isolation: posix/cpu,posix/mem,filesystem/posix,network/cni
W0817 19:58:44.003350  1263 backend.cpp:76] Failed to create 'aufs' backend: AufsBackend requires
root privileges
W0817 19:58:44.003454  1263 backend.cpp:76] Failed to create 'bind' backend: BindBackend requires
root privileges
I0817 19:58:44.003494  1263 provisioner.cpp:249] Using default backend 'copy'
I0817 19:58:44.005930  1263 cluster.cpp:448] Creating default 'local' authorizer
I0817 19:58:44.007840 20971 slave.cpp:231] Mesos agent started on (750)@172.17.0.5:45737
I0817 19:58:44.007861 20971 slave.cpp:232] Flags at startup: --acls="" --appc_simple_discovery_uri_prefix="http://"
--appc_store_dir="/tmp/mesos/store/appc" --authenticate_http_executors="true" --authenticate_http_readonly="true"
--authenticate_http_readwrite="true" --authenticatee="crammd5" --authentication_backoff_factor="1secs"
--authorizer="local" --cgroups_cpu_enable_pids_and_tids_count="false" --cgroups_enable_cfs="false"
--cgroups_hierarchy="/sys/fs/cgroup" --cgroups_limit_swap="false" --cgroups_root="mesos" --container_disk_watch_interval="15secs"
--containerizers="mesos" --credential="/tmp/Endpoint_SlaveEndpointTest_NoAuthorizer_0_mEqlqX/credential"
--default_role="*" --disk_watch_interval="1mins" --docker="docker" --docker_kill_orphans="true"
--docker_registry="https://registry-1.docker.io" --docker_remove_delay="6hrs" --docker_socket="/var/run/docker.sock"
--docker_stop_timeout="0ns" --docker_store_dir="/tmp/mesos/store/docker" --docker_volume_checkpoint_dir="/var/run/mesos/isolators/docker/volume"
--enforce_container_disk_quota="false" --executor_registration_timeout="1mins" --executor_reregistration_timeout="2secs"
--executor_secret_key="/tmp/Endpoint_SlaveEndpointTest_NoAuthorizer_0_mEqlqX/executor_secret_key"
--executor_shutdown_grace_period="5secs" --fetcher_cache_dir="/tmp/Endpoint_SlaveEndpointTest_NoAuthorizer_0_mEqlqX/fetch"
--fetcher_cache_size="2GB" --frameworks_home="" --gc_delay="1weeks" --gc_disk_headroom="0.1"
--hadoop_home="" --help="false" --hostname_lookup="true" --http_command_executor="false" --http_credentials="/tmp/Endpoint_SlaveEndpointTest_NoAuthorizer_0_mEqlqX/http_credentials"
--http_heartbeat_interval="30secs" --initialize_driver_logging="true" --isolation="posix/cpu,posix/mem"
--launcher="posix" --launcher_dir="/mesos/mesos-1.3.2/_build/src" --logbufsecs="0" --logging_level="INFO"
--max_completed_executors_per_framework="150" --oversubscribed_resources_interval="15secs"
--perf_duration="10secs" --perf_interval="1mins" --port="5051" --qos_correction_interval_min="0ns"
--quiet="false" --recover="reconnect" --recovery_timeout="15mins" --registration_backoff_factor="10ms"
--resources="cpus:2;gpus:0;mem:1024;disk:1024;ports:[31000-32000]" --revocable_cpu_low_priority="true"
--runtime_dir="/tmp/Endpoint_SlaveEndpointTest_NoAuthorizer_0_mEqlqX" --sandbox_directory="/mnt/mesos/sandbox"
--strict="true" --switch_user="true" --systemd_enable_support="true" --systemd_runtime_directory="/run/systemd/system"
--version="false" --work_dir="/tmp/Endpoint_SlaveEndpointTest_NoAuthorizer_0_NeQqUa"
I0817 19:58:44.008198 20971 credentials.hpp:86] Loading credential for authentication from
'/tmp/Endpoint_SlaveEndpointTest_NoAuthorizer_0_mEqlqX/credential'
I0817 19:58:44.008363 20971 slave.cpp:264] Agent using credential for: test-principal
I0817 19:58:44.008390 20971 credentials.hpp:37] Loading credentials for authentication from
'/tmp/Endpoint_SlaveEndpointTest_NoAuthorizer_0_mEqlqX/http_credentials'
I0817 19:58:44.008664 20971 http.cpp:975] Creating default 'basic' HTTP authenticator for
realm 'mesos-agent-executor'
I0817 19:58:44.008756 20971 http.cpp:996] Creating default 'jwt' HTTP authenticator for realm
'mesos-agent-executor'
I0817 19:58:44.008950 20971 http.cpp:975] Creating default 'basic' HTTP authenticator for
realm 'mesos-agent-readonly'
I0817 19:58:44.009054 20971 http.cpp:996] Creating default 'jwt' HTTP authenticator for realm
'mesos-agent-readonly'
I0817 19:58:44.009383 20971 http.cpp:975] Creating default 'basic' HTTP authenticator for
realm 'mesos-agent-readwrite'
I0817 19:58:44.009493 20971 http.cpp:996] Creating default 'jwt' HTTP authenticator for realm
'mesos-agent-readwrite'
I0817 19:58:44.011258 20971 slave.cpp:531] Agent resources: cpus(*):2; mem(*):1024; disk(*):1024;
ports(*):[31000-32000]
I0817 19:58:44.011348 20971 slave.cpp:539] Agent attributes: [  ]
I0817 19:58:44.011361 20971 slave.cpp:544] Agent hostname: 997b8569d37c
I0817 19:58:44.011478 20965 status_update_manager.cpp:177] Pausing sending status updates
I0817 19:58:44.012816 20949 state.cpp:62] Recovering state from '/tmp/Endpoint_SlaveEndpointTest_NoAuthorizer_0_NeQqUa/meta'
I0817 19:58:44.013216 20953 status_update_manager.cpp:203] Recovering status update manager
I0817 19:58:44.013489 20970 containerizer.cpp:608] Recovering containerizer
I0817 19:58:44.015084 20966 provisioner.cpp:410] Provisioner recovery complete
I0817 19:58:44.015552 20962 slave.cpp:6075] Finished recovery
I0817 19:58:44.015959 20962 slave.cpp:6257] Querying resource estimator for oversubscribable
resources
I0817 19:58:44.016258 20963 slave.cpp:6271] Received oversubscribable resources {} from the
resource estimator
I0817 19:58:44.017896 20958 process.cpp:3741] Handling HTTP event for process 'slave(750)'
with path: '/slave(750)/monitor/statistics'
I0817 19:58:44.019505 20962 http.cpp:1115] HTTP GET for /slave(750)/monitor/statistics from
172.17.0.5:47700
I0817 19:58:44.019573 20962 http.cpp:936] Authorizing principal 'test-principal' to GET the
'/monitor/statistics' endpoint
I0817 19:58:44.022958 20960 slave.cpp:796] Agent terminating
[       OK ] Endpoint/SlaveEndpointTest.NoAuthorizer/0 (30 ms)
[ RUN      ] Endpoint/SlaveEndpointTest.NoAuthorizer/1
I0817 19:58:44.033417  1263 containerizer.cpp:221] Using isolation: posix/cpu,posix/mem,filesystem/posix,network/cni
W0817 19:58:44.033936  1263 backend.cpp:76] Failed to create 'aufs' backend: AufsBackend requires
root privileges
W0817 19:58:44.034035  1263 backend.cpp:76] Failed to create 'bind' backend: BindBackend requires
root privileges
I0817 19:58:44.034067  1263 provisioner.cpp:249] Using default backend 'copy'
I0817 19:58:44.035974  1263 cluster.cpp:448] Creating default 'local' authorizer
I0817 19:58:44.038271 20965 slave.cpp:231] Mesos agent started on (751)@172.17.0.5:45737
I0817 19:58:44.038298 20965 slave.cpp:232] Flags at startup: --acls="" --appc_simple_discovery_uri_prefix="http://"
--appc_store_dir="/tmp/mesos/store/appc" --authenticate_http_executors="true" --authenticate_http_readonly="true"
--authenticate_http_readwrite="true" --authenticatee="crammd5" --authentication_backoff_factor="1secs"
--authorizer="local" --cgroups_cpu_enable_pids_and_tids_count="false" --cgroups_enable_cfs="false"
--cgroups_hierarchy="/sys/fs/cgroup" --cgroups_limit_swap="false" --cgroups_root="mesos" --container_disk_watch_interval="15secs"
--containerizers="mesos" --credential="/tmp/Endpoint_SlaveEndpointTest_NoAuthorizer_1_60HHJ5/credential"
--default_role="*" --disk_watch_interval="1mins" --docker="docker" --docker_kill_orphans="true"
--docker_registry="https://registry-1.docker.io" --docker_remove_delay="6hrs" --docker_socket="/var/run/docker.sock"
--docker_stop_timeout="0ns" --docker_store_dir="/tmp/mesos/store/docker" --docker_volume_checkpoint_dir="/var/run/mesos/isolators/docker/volume"
--enforce_container_disk_quota="false" --executor_registration_timeout="1mins" --executor_reregistration_timeout="2secs"
--executor_secret_key="/tmp/Endpoint_SlaveEndpointTest_NoAuthorizer_1_60HHJ5/executor_secret_key"
--executor_shutdown_grace_period="5secs" --fetcher_cache_dir="/tmp/Endpoint_SlaveEndpointTest_NoAuthorizer_1_60HHJ5/fetch"
--fetcher_cache_size="2GB" --frameworks_home="" --gc_delay="1weeks" --gc_disk_headroom="0.1"
--hadoop_home="" --help="false" --hostname_lookup="true" --http_command_executor="false" --http_credentials="/tmp/Endpoint_SlaveEndpointTest_NoAuthorizer_1_60HHJ5/http_credentials"
--http_heartbeat_interval="30secs" --initialize_driver_logging="true" --isolation="posix/cpu,posix/mem"
--launcher="posix" --launcher_dir="/mesos/mesos-1.3.2/_build/src" --logbufsecs="0" --logging_level="INFO"
--max_completed_executors_per_framework="150" --oversubscribed_resources_interval="15secs"
--perf_duration="10secs" --perf_interval="1mins" --port="5051" --qos_correction_interval_min="0ns"
--quiet="false" --recover="reconnect" --recovery_timeout="15mins" --registration_backoff_factor="10ms"
--resources="cpus:2;gpus:0;mem:1024;disk:1024;ports:[31000-32000]" --revocable_cpu_low_priority="true"
--runtime_dir="/tmp/Endpoint_SlaveEndpointTest_NoAuthorizer_1_60HHJ5" --sandbox_directory="/mnt/mesos/sandbox"
--strict="true" --switch_user="true" --systemd_enable_support="true" --systemd_runtime_directory="/run/systemd/system"
--version="false" --work_dir="/tmp/Endpoint_SlaveEndpointTest_NoAuthorizer_1_Plpe9i"
I0817 19:58:44.038727 20965 credentials.hpp:86] Loading credential for authentication from
'/tmp/Endpoint_SlaveEndpointTest_NoAuthorizer_1_60HHJ5/credential'
I0817 19:58:44.038918 20965 slave.cpp:264] Agent using credential for: test-principal
I0817 19:58:44.038938 20965 credentials.hpp:37] Loading credentials for authentication from
'/tmp/Endpoint_SlaveEndpointTest_NoAuthorizer_1_60HHJ5/http_credentials'
I0817 19:58:44.039248 20965 http.cpp:975] Creating default 'basic' HTTP authenticator for
realm 'mesos-agent-executor'
I0817 19:58:44.039373 20965 http.cpp:996] Creating default 'jwt' HTTP authenticator for realm
'mesos-agent-executor'
I0817 19:58:44.039805 20965 http.cpp:975] Creating default 'basic' HTTP authenticator for
realm 'mesos-agent-readonly'
I0817 19:58:44.040019 20965 http.cpp:996] Creating default 'jwt' HTTP authenticator for realm
'mesos-agent-readonly'
I0817 19:58:44.040336 20965 http.cpp:975] Creating default 'basic' HTTP authenticator for
realm 'mesos-agent-readwrite'
I0817 19:58:44.040446 20965 http.cpp:996] Creating default 'jwt' HTTP authenticator for realm
'mesos-agent-readwrite'
I0817 19:58:44.042050 20965 slave.cpp:531] Agent resources: cpus(*):2; mem(*):1024; disk(*):1024;
ports(*):[31000-32000]
I0817 19:58:44.042136 20965 slave.cpp:539] Agent attributes: [  ]
I0817 19:58:44.042150 20965 slave.cpp:544] Agent hostname: 997b8569d37c
I0817 19:58:44.042268 20961 status_update_manager.cpp:177] Pausing sending status updates
I0817 19:58:44.043697 20963 state.cpp:62] Recovering state from '/tmp/Endpoint_SlaveEndpointTest_NoAuthorizer_1_Plpe9i/meta'
I0817 19:58:44.043931 20959 status_update_manager.cpp:203] Recovering status update manager
I0817 19:58:44.044226 20955 containerizer.cpp:608] Recovering containerizer
I0817 19:58:44.045547 20955 provisioner.cpp:410] Provisioner recovery complete
I0817 19:58:44.045990 20972 slave.cpp:6075] Finished recovery
I0817 19:58:44.046388 20972 slave.cpp:6257] Querying resource estimator for oversubscribable
resources
I0817 19:58:44.046641 20957 slave.cpp:6271] Received oversubscribable resources {} from the
resource estimator
I0817 19:58:44.048633 20960 process.cpp:3741] Handling HTTP event for process 'slave(751)'
with path: '/slave(751)/monitor/statistics.json'
I0817 19:58:44.050379 20971 http.cpp:1115] HTTP GET for /slave(751)/monitor/statistics.json
from 172.17.0.5:47704
I0817 19:58:44.050458 20971 http.cpp:936] Authorizing principal 'test-principal' to GET the
'/monitor/statistics.json' endpoint
I0817 19:58:44.054244 20967 slave.cpp:796] Agent terminating
[       OK ] Endpoint/SlaveEndpointTest.NoAuthorizer/1 (31 ms)
[ RUN      ] Endpoint/SlaveEndpointTest.NoAuthorizer/2
I0817 19:58:44.065419  1263 containerizer.cpp:221] Using isolation: posix/cpu,posix/mem,filesystem/posix,network/cni
W0817 19:58:44.065996  1263 backend.cpp:76] Failed to create 'aufs' backend: AufsBackend requires
root privileges
W0817 19:58:44.066105  1263 backend.cpp:76] Failed to create 'bind' backend: BindBackend requires
root privileges
I0817 19:58:44.066136  1263 provisioner.cpp:249] Using default backend 'copy'
I0817 19:58:44.067939  1263 cluster.cpp:448] Creating default 'local' authorizer
I0817 19:58:44.069676 20972 slave.cpp:231] Mesos agent started on (752)@172.17.0.5:45737
I0817 19:58:44.069699 20972 slave.cpp:232] Flags at startup: --acls="" --appc_simple_discovery_uri_prefix="http://"
--appc_store_dir="/tmp/mesos/store/appc" --authenticate_http_executors="true" --authenticate_http_readonly="true"
--authenticate_http_readwrite="true" --authenticatee="crammd5" --authentication_backoff_factor="1secs"
--authorizer="local" --cgroups_cpu_enable_pids_and_tids_count="false" --cgroups_enable_cfs="false"
--cgroups_hierarchy="/sys/fs/cgroup" --cgroups_limit_swap="false" --cgroups_root="mesos" --container_disk_watch_interval="15secs"
--containerizers="mesos" --credential="/tmp/Endpoint_SlaveEndpointTest_NoAuthorizer_2_KTbMle/credential"
--default_role="*" --disk_watch_interval="1mins" --docker="docker" --docker_kill_orphans="true"
--docker_registry="https://registry-1.docker.io" --docker_remove_delay="6hrs" --docker_socket="/var/run/docker.sock"
--docker_stop_timeout="0ns" --docker_store_dir="/tmp/mesos/store/docker" --docker_volume_checkpoint_dir="/var/run/mesos/isolators/docker/volume"
--enforce_container_disk_quota="false" --executor_registration_timeout="1mins" --executor_reregistration_timeout="2secs"
--executor_secret_key="/tmp/Endpoint_SlaveEndpointTest_NoAuthorizer_2_KTbMle/executor_secret_key"
--executor_shutdown_grace_period="5secs" --fetcher_cache_dir="/tmp/Endpoint_SlaveEndpointTest_NoAuthorizer_2_KTbMle/fetch"
--fetcher_cache_size="2GB" --frameworks_home="" --gc_delay="1weeks" --gc_disk_headroom="0.1"
--hadoop_home="" --help="false" --hostname_lookup="true" --http_command_executor="false" --http_credentials="/tmp/Endpoint_SlaveEndpointTest_NoAuthorizer_2_KTbMle/http_credentials"
--http_heartbeat_interval="30secs" --initialize_driver_logging="true" --isolation="posix/cpu,posix/mem"
--launcher="posix" --launcher_dir="/mesos/mesos-1.3.2/_build/src" --logbufsecs="0" --logging_level="INFO"
--max_completed_executors_per_framework="150" --oversubscribed_resources_interval="15secs"
--perf_duration="10secs" --perf_interval="1mins" --port="5051" --qos_correction_interval_min="0ns"
--quiet="false" --recover="reconnect" --recovery_timeout="15mins" --registration_backoff_factor="10ms"
--resources="cpus:2;gpus:0;mem:1024;disk:1024;ports:[31000-32000]" --revocable_cpu_low_priority="true"
--runtime_dir="/tmp/Endpoint_SlaveEndpointTest_NoAuthorizer_2_KTbMle" --sandbox_directory="/mnt/mesos/sandbox"
--strict="true" --switch_user="true" --systemd_enable_support="true" --systemd_runtime_directory="/run/systemd/system"
--version="false" --work_dir="/tmp/Endpoint_SlaveEndpointTest_NoAuthorizer_2_HCFzGr"
I0817 19:58:44.070062 20972 credentials.hpp:86] Loading credential for authentication from
'/tmp/Endpoint_SlaveEndpointTest_NoAuthorizer_2_KTbMle/credential'
I0817 19:58:44.070221 20972 slave.cpp:264] Agent using credential for: test-principal
I0817 19:58:44.070246 20972 credentials.hpp:37] Loading credentials for authentication from
'/tmp/Endpoint_SlaveEndpointTest_NoAuthorizer_2_KTbMle/http_credentials'
I0817 19:58:44.070511 20972 http.cpp:975] Creating default 'basic' HTTP authenticator for
realm 'mesos-agent-executor'
I0817 19:58:44.070605 20972 http.cpp:996] Creating default 'jwt' HTTP authenticator for realm
'mesos-agent-executor'
I0817 19:58:44.070852 20972 http.cpp:975] Creating default 'basic' HTTP authenticator for
realm 'mesos-agent-readonly'
I0817 19:58:44.070996 20972 http.cpp:996] Creating default 'jwt' HTTP authenticator for realm
'mesos-agent-readonly'
I0817 19:58:44.071313 20972 http.cpp:975] Creating default 'basic' HTTP authenticator for
realm 'mesos-agent-readwrite'
I0817 19:58:44.071424 20972 http.cpp:996] Creating default 'jwt' HTTP authenticator for realm
'mesos-agent-readwrite'
I0817 19:58:44.072942 20972 slave.cpp:531] Agent resources: cpus(*):2; mem(*):1024; disk(*):1024;
ports(*):[31000-32000]
I0817 19:58:44.073029 20972 slave.cpp:539] Agent attributes: [  ]
I0817 19:58:44.073063 20972 slave.cpp:544] Agent hostname: 997b8569d37c
I0817 19:58:44.073200 20960 status_update_manager.cpp:177] Pausing sending status updates
I0817 19:58:44.074520 20959 state.cpp:62] Recovering state from '/tmp/Endpoint_SlaveEndpointTest_NoAuthorizer_2_HCFzGr/meta'
I0817 19:58:44.074888 20964 status_update_manager.cpp:203] Recovering status update manager
I0817 19:58:44.075168 20950 containerizer.cpp:608] Recovering containerizer
I0817 19:58:44.076580 20962 provisioner.cpp:410] Provisioner recovery complete
I0817 19:58:44.076931 20970 slave.cpp:6075] Finished recovery
I0817 19:58:44.077376 20970 slave.cpp:6257] Querying resource estimator for oversubscribable
resources
I0817 19:58:44.077692 20953 slave.cpp:6271] Received oversubscribable resources {} from the
resource estimator
I0817 19:58:44.079834 20971 process.cpp:3741] Handling HTTP event for process 'slave(752)'
with path: '/slave(752)/containers'
I0817 19:58:44.081955 20972 http.cpp:1115] HTTP GET for /slave(752)/containers from 172.17.0.5:47710
I0817 19:58:44.082056 20972 http.cpp:936] Authorizing principal 'test-principal' to GET the
'/containers' endpoint
I0817 19:58:44.085723 20950 slave.cpp:796] Agent terminating
[       OK ] Endpoint/SlaveEndpointTest.NoAuthorizer/2 (32 ms)
[----------] 9 tests from Endpoint/SlaveEndpointTest (273 ms total)

[----------] Global test environment tear-down
[==========] 1578 tests from 177 test cases ran. (564836 ms total)
[  PASSED  ] 1575 tests.
[  FAILED  ] 3 tests, listed below:
[  FAILED  ] DefaultExecutorCheckTest.CommandCheckDeliveredAndReconciled
[  FAILED  ] DefaultExecutorCheckTest.CommandCheckStatusChange
[  FAILED  ] DefaultExecutorCheckTest.CommandCheckTimeout

 3 FAILED TESTS
  YOU HAVE 22 DISABLED TESTS

E0817 19:58:44.150549 20973 process.cpp:956] Failed to accept socket: future discarded
make[4]: *** [check-local] Error 1
make[4]: Leaving directory `/mesos/mesos-1.3.2/_build/src'
make[3]: *** [check-am] Error 2
make[3]: Leaving directory `/mesos/mesos-1.3.2/_build/src'
make[2]: *** [check] Error 2
make[2]: Leaving directory `/mesos/mesos-1.3.2/_build/src'
make[1]: *** [check-recursive] Error 1
make[1]: Leaving directory `/mesos/mesos-1.3.2/_build'
make: *** [distcheck] Error 1
+ docker rmi mesos-1502996901-12177
Untagged: mesos-1502996901-12177:latest
Deleted: sha256:e6b2293d9066e15f4c8d4e16ace943a7b2a2266a43d79b1dac5b6e078db05307
Deleted: sha256:5f0800db4081d75b0d5bc4a32d31fa8f3f87040cccb31a49f1085686f36dd135
Deleted: sha256:14f9613053922f1940ace7adaae8f4ab3dfd36a82bb6aea4a695ff7084e12b06
Deleted: sha256:c14f27b4c6c7e3411f20b4d6975dac5f9996ed45037d74214588adbf7c836fd0
Deleted: sha256:7f71235f2cb8cf8e25c4a2c6da71d58fb4ea3accb29876045e32d2a20c02b4aa
Deleted: sha256:ba7d183d7d90aed8cb7799f0cf57388bb142a5755dd9622d6d11cf401d01eb9a
Deleted: sha256:b0c7e7b70e936c1c38164a3dd758fff6f9f02eb639c3b548a9f22afb468b6c92
Deleted: sha256:be107544861587827dcdbf34a22e7033eab32427ccb4b5ae25c667320a345250
Deleted: sha256:501887b734b18ef78c65f2a9f4aaf00ec4e4ba439bc30187c74d4e8556f6ea00
Deleted: sha256:f9442efeed32c394b7baabdbda48138819570121bc4dc62dd1f6e2fbc5fe5ec0
Deleted: sha256:6a5943f8a45d85013813c68bcbe7b8c810f446fb1a52cc672562e9e2e8b70db6
Deleted: sha256:5ecfa69f265b63db580ac1598f90241d1c4254a84bae5bf95d59100c0519bab0
Deleted: sha256:6268e57cab1f0b5406d819fec32ffbfc5d60e9b0079834bb71fdd81a391f0bc1
Deleted: sha256:7c38538ff4edcc920cf4d84b632c2aabb939776fd412da4702d4aca25bd8beec
Deleted: sha256:51a8a9c75548f6db3f45d17988dda9994a22b80842d32b95268aae00c571fa24
Deleted: sha256:48489cf8ba33408b307ea36e7c9c1b0ef38dd7b3762dcedc90d55ff34b32d284
Deleted: sha256:becbcdfab5ad39b391fb1a00dddfff020445699a3ee922a71dc7a1cab18a7fc1
Deleted: sha256:cf2077efa3e0b7c6187a006191402bbe828d03cbb4db5f695b7c332dc29261d4
Deleted: sha256:93fdc15e58d024f2695a15032e1a03b9b2676524269474bad5e12f773f7a0f84
Deleted: sha256:1b34f9476fa5944fc6982bae1e47282c2ef6c00771802bb006eec8434cf6e0a4
Deleted: sha256:41ea88f37f508a380c47ed8826ca586089ff960c67147923cad5327e2dae16a8
Deleted: sha256:ce4295dd01276a4c6bb27497ba41e2c8ffcaf24413eb86e49d24c69081dc735e
Deleted: sha256:a9265717f0045761f38dbb55fbd663bbf825c417e3a081729fe5a07cc7acd340
Deleted: sha256:2919dce21ce6b7c27076c7d10204fcf84a57799a9a663994e4714ea5eaaf2f37
Build step 'Execute shell' marked build as failure
Not sending mail to unregistered user songzihao1990@gmail.com

Mime
View raw message