mesos-builds mailing list archives

Site index · List index
Message view « Date » · « Thread »
Top « Date » · « Thread »
From Apache Jenkins Server <jenk...@builds.apache.org>
Subject Build failed in Jenkins: Mesos-Buildbot » cmake,gcc,--verbose,GLOG_v=1 MESOS_VERBOSE=1,ubuntu:14.04,(ubuntu)&&(!ubuntu-us1)&&(!ubuntu-eu2) #4141
Date Wed, 23 Aug 2017 02:50:58 GMT
See <https://builds.apache.org/job/Mesos-Buildbot/BUILDTOOL=cmake,COMPILER=gcc,CONFIGURATION=--verbose,ENVIRONMENT=GLOG_v=1%20MESOS_VERBOSE=1,OS=ubuntu%3A14.04,label_exp=(ubuntu)&&(!ubuntu-us1)&&(!ubuntu-eu2)/4141/display/redirect?page=changes>

Changes:

[yujie.jay] Rewrited rules for generating Protobuf and gRPC code.

[yujie.jay] Style cleanup for grpc tests.

[yujie.jay] Bundled CSI v0.1.0 into 3rdparty libraries.

[yujie.jay] Added CSI client classes to talk to CSI plugins.

[yujie.jay] Added a mock CSI plugin and a unit test for CSI client classes.

[yujie.jay] Added Autotools rules to build the CSI client module in Mesos.

[xujyan] Moved GarbageCollectorProcess to a separate header file.

[xujyan] Added agent garbage collection metrics.

[xujyan] Documented agent garbage collection metrics.

------------------------------------------
[...truncated 28.85 MB...]
I0823 02:50:49.357422 32620 slave.cpp:859] Agent terminating
[       OK ] Endpoint/SlaveEndpointTest.AuthorizedRequest/1 (31 ms)
[ RUN      ] Endpoint/SlaveEndpointTest.AuthorizedRequest/2
I0823 02:50:49.371428 32620 containerizer.cpp:288] Using isolation { environment_secret, posix/cpu,
posix/mem, filesystem/posix, network/cni }
W0823 02:50:49.371917 32620 backend.cpp:76] Failed to create 'aufs' backend: AufsBackend requires
root privileges
W0823 02:50:49.372012 32620 backend.cpp:76] Failed to create 'bind' backend: BindBackend requires
root privileges
I0823 02:50:49.372038 32620 provisioner.cpp:255] Using default backend 'copy'
I0823 02:50:49.375819 32627 slave.cpp:252] Mesos agent started on (798)@172.17.0.2:33907
I0823 02:50:49.375879 32627 slave.cpp:253] Flags at startup: --acls="" --appc_simple_discovery_uri_prefix="http://"
--appc_store_dir="/tmp/Endpoint_SlaveEndpointTest_AuthorizedRequest_2_OjePDv/store/appc" --authenticate_http_readonly="true"
--authenticate_http_readwrite="true" --authenticatee="crammd5" --authentication_backoff_factor="1secs"
--authorizer="local" --cgroups_cpu_enable_pids_and_tids_count="false" --cgroups_enable_cfs="false"
--cgroups_hierarchy="/sys/fs/cgroup" --cgroups_limit_swap="false" --cgroups_root="mesos" --container_disk_watch_interval="15secs"
--containerizers="mesos" --credential="/tmp/Endpoint_SlaveEndpointTest_AuthorizedRequest_2_OjePDv/credential"
--default_role="*" --disallow_sharing_agent_pid_namespace="false" --disk_watch_interval="1mins"
--docker="docker" --docker_kill_orphans="true" --docker_registry="https://registry-1.docker.io"
--docker_remove_delay="6hrs" --docker_socket="/var/run/docker.sock" --docker_stop_timeout="0ns"
--docker_store_dir="/tmp/Endpoint_SlaveEndpointTest_AuthorizedRequest_2_OjePDv/store/docker"
--docker_volume_checkpoint_dir="/var/run/mesos/isolators/docker/volume" --enforce_container_disk_quota="false"
--executor_registration_timeout="1mins" --executor_reregistration_timeout="2secs" --executor_shutdown_grace_period="5secs"
--fetcher_cache_dir="/tmp/Endpoint_SlaveEndpointTest_AuthorizedRequest_2_OjePDv/fetch" --fetcher_cache_size="2GB"
--frameworks_home="" --gc_delay="1weeks" --gc_disk_headroom="0.1" --hadoop_home="" --help="false"
--hostname_lookup="true" --http_command_executor="false" --http_credentials="/tmp/Endpoint_SlaveEndpointTest_AuthorizedRequest_2_OjePDv/http_credentials"
--http_heartbeat_interval="30secs" --initialize_driver_logging="true" --isolation="posix/cpu,posix/mem"
--launcher="posix" --launcher_dir="/mesos/build/src" --logbufsecs="0" --logging_level="INFO"
--max_completed_executors_per_framework="150" --oversubscribed_resources_interval="15secs"
--perf_duration="10secs" --perf_interval="1mins" --port="5051" --qos_correction_interval_min="0ns"
--quiet="false" --recover="reconnect" --recovery_timeout="15mins" --registration_backoff_factor="10ms"
--resources="cpus:2;gpus:0;mem:1024;disk:1024;ports:[31000-32000]" --revocable_cpu_low_priority="true"
--runtime_dir="/tmp/Endpoint_SlaveEndpointTest_AuthorizedRequest_2_OjePDv" --sandbox_directory="/mnt/mesos/sandbox"
--strict="true" --switch_user="true" --systemd_enable_support="true" --systemd_runtime_directory="/run/systemd/system"
--version="false" --work_dir="/tmp/Endpoint_SlaveEndpointTest_AuthorizedRequest_2_0r67sr"
I0823 02:50:49.376454 32627 credentials.hpp:86] Loading credential for authentication from
'/tmp/Endpoint_SlaveEndpointTest_AuthorizedRequest_2_OjePDv/credential'
I0823 02:50:49.376636 32627 slave.cpp:285] Agent using credential for: test-principal
I0823 02:50:49.376653 32627 credentials.hpp:37] Loading credentials for authentication from
'/tmp/Endpoint_SlaveEndpointTest_AuthorizedRequest_2_OjePDv/http_credentials'
I0823 02:50:49.376925 32627 http.cpp:1026] Creating default 'basic' HTTP authenticator for
realm 'mesos-agent-readonly'
I0823 02:50:49.377123 32627 http.cpp:1026] Creating default 'basic' HTTP authenticator for
realm 'mesos-agent-readwrite'
I0823 02:50:49.378496 32627 slave.cpp:581] Agent resources: [{"name":"cpus","scalar":{"value":2.0},"type":"SCALAR"},{"name":"mem","scalar":{"value":1024.0},"type":"SCALAR"},{"name":"disk","scalar":{"value":1024.0},"type":"SCALAR"},{"name":"ports","ranges":{"range":[{"begin":31000,"end":32000}]},"type":"RANGES"}]
I0823 02:50:49.378700 32627 slave.cpp:589] Agent attributes: [  ]
I0823 02:50:49.378723 32627 slave.cpp:598] Agent hostname: ce48ba64ce17
I0823 02:50:49.378880 32641 status_update_manager.cpp:177] Pausing sending status updates
I0823 02:50:49.380435 32638 state.cpp:64] Recovering state from '/tmp/Endpoint_SlaveEndpointTest_AuthorizedRequest_2_0r67sr/meta'
I0823 02:50:49.380717 32639 status_update_manager.cpp:203] Recovering status update manager
I0823 02:50:49.380939 32639 containerizer.cpp:643] Recovering containerizer
I0823 02:50:49.382689 32634 provisioner.cpp:416] Provisioner recovery complete
I0823 02:50:49.383260 32627 slave.cpp:6226] Finished recovery
I0823 02:50:49.383713 32627 slave.cpp:6408] Querying resource estimator for oversubscribable
resources
I0823 02:50:49.383963 32631 slave.cpp:6422] Received oversubscribable resources {} from the
resource estimator
I0823 02:50:49.386905 32632 process.cpp:3933] Handling HTTP event for process 'slave(798)'
with path: '/slave(798)/containers'
I0823 02:50:49.388342 32625 http.cpp:1166] HTTP GET for /slave(798)/containers from 172.17.0.2:35896
I0823 02:50:49.388448 32625 http.cpp:957] Authorizing principal 'test-principal' to GET the
'/containers' endpoint
I0823 02:50:49.393559 32623 slave.cpp:859] Agent terminating
[       OK ] Endpoint/SlaveEndpointTest.AuthorizedRequest/2 (35 ms)
[ RUN      ] Endpoint/SlaveEndpointTest.UnauthorizedRequest/0
I0823 02:50:49.407505 32620 containerizer.cpp:288] Using isolation { environment_secret, posix/cpu,
posix/mem, filesystem/posix, network/cni }
W0823 02:50:49.408329 32620 backend.cpp:76] Failed to create 'aufs' backend: AufsBackend requires
root privileges
W0823 02:50:49.408485 32620 backend.cpp:76] Failed to create 'bind' backend: BindBackend requires
root privileges
I0823 02:50:49.408516 32620 provisioner.cpp:255] Using default backend 'copy'
I0823 02:50:49.412509 32632 slave.cpp:252] Mesos agent started on (799)@172.17.0.2:33907
I0823 02:50:49.412529 32632 slave.cpp:253] Flags at startup: --acls="" --appc_simple_discovery_uri_prefix="http://"
--appc_store_dir="/tmp/Endpoint_SlaveEndpointTest_UnauthorizedRequest_0_ABHxCM/store/appc"
--authenticate_http_readonly="true" --authenticate_http_readwrite="true" --authenticatee="crammd5"
--authentication_backoff_factor="1secs" --authorizer="local" --cgroups_cpu_enable_pids_and_tids_count="false"
--cgroups_enable_cfs="false" --cgroups_hierarchy="/sys/fs/cgroup" --cgroups_limit_swap="false"
--cgroups_root="mesos" --container_disk_watch_interval="15secs" --containerizers="mesos" --credential="/tmp/Endpoint_SlaveEndpointTest_UnauthorizedRequest_0_ABHxCM/credential"
--default_role="*" --disallow_sharing_agent_pid_namespace="false" --disk_watch_interval="1mins"
--docker="docker" --docker_kill_orphans="true" --docker_registry="https://registry-1.docker.io"
--docker_remove_delay="6hrs" --docker_socket="/var/run/docker.sock" --docker_stop_timeout="0ns"
--docker_store_dir="/tmp/Endpoint_SlaveEndpointTest_UnauthorizedRequest_0_ABHxCM/store/docker"
--docker_volume_checkpoint_dir="/var/run/mesos/isolators/docker/volume" --enforce_container_disk_quota="false"
--executor_registration_timeout="1mins" --executor_reregistration_timeout="2secs" --executor_shutdown_grace_period="5secs"
--fetcher_cache_dir="/tmp/Endpoint_SlaveEndpointTest_UnauthorizedRequest_0_ABHxCM/fetch" --fetcher_cache_size="2GB"
--frameworks_home="" --gc_delay="1weeks" --gc_disk_headroom="0.1" --hadoop_home="" --help="false"
--hostname_lookup="true" --http_command_executor="false" --http_credentials="/tmp/Endpoint_SlaveEndpointTest_UnauthorizedRequest_0_ABHxCM/http_credentials"
--http_heartbeat_interval="30secs" --initialize_driver_logging="true" --isolation="posix/cpu,posix/mem"
--launcher="posix" --launcher_dir="/mesos/build/src" --logbufsecs="0" --logging_level="INFO"
--max_completed_executors_per_framework="150" --oversubscribed_resources_interval="15secs"
--perf_duration="10secs" --perf_interval="1mins" --port="5051" --qos_correction_interval_min="0ns"
--quiet="false" --recover="reconnect" --recovery_timeout="15mins" --registration_backoff_factor="10ms"
--resources="cpus:2;gpus:0;mem:1024;disk:1024;ports:[31000-32000]" --revocable_cpu_low_priority="true"
--runtime_dir="/tmp/Endpoint_SlaveEndpointTest_UnauthorizedRequest_0_ABHxCM" --sandbox_directory="/mnt/mesos/sandbox"
--strict="true" --switch_user="true" --systemd_enable_support="true" --systemd_runtime_directory="/run/systemd/system"
--version="false" --work_dir="/tmp/Endpoint_SlaveEndpointTest_UnauthorizedRequest_0_n0IvmI"
I0823 02:50:49.412981 32632 credentials.hpp:86] Loading credential for authentication from
'/tmp/Endpoint_SlaveEndpointTest_UnauthorizedRequest_0_ABHxCM/credential'
I0823 02:50:49.413172 32632 slave.cpp:285] Agent using credential for: test-principal
I0823 02:50:49.413187 32632 credentials.hpp:37] Loading credentials for authentication from
'/tmp/Endpoint_SlaveEndpointTest_UnauthorizedRequest_0_ABHxCM/http_credentials'
I0823 02:50:49.413386 32632 http.cpp:1026] Creating default 'basic' HTTP authenticator for
realm 'mesos-agent-readonly'
I0823 02:50:49.413599 32632 http.cpp:1026] Creating default 'basic' HTTP authenticator for
realm 'mesos-agent-readwrite'
I0823 02:50:49.415622 32632 slave.cpp:581] Agent resources: [{"name":"cpus","scalar":{"value":2.0},"type":"SCALAR"},{"name":"mem","scalar":{"value":1024.0},"type":"SCALAR"},{"name":"disk","scalar":{"value":1024.0},"type":"SCALAR"},{"name":"ports","ranges":{"range":[{"begin":31000,"end":32000}]},"type":"RANGES"}]
I0823 02:50:49.415956 32632 slave.cpp:589] Agent attributes: [  ]
I0823 02:50:49.415971 32632 slave.cpp:598] Agent hostname: ce48ba64ce17
I0823 02:50:49.416147 32635 status_update_manager.cpp:177] Pausing sending status updates
I0823 02:50:49.418236 32627 state.cpp:64] Recovering state from '/tmp/Endpoint_SlaveEndpointTest_UnauthorizedRequest_0_n0IvmI/meta'
I0823 02:50:49.418495 32627 status_update_manager.cpp:203] Recovering status update manager
I0823 02:50:49.418725 32628 containerizer.cpp:643] Recovering containerizer
I0823 02:50:49.420446 32642 provisioner.cpp:416] Provisioner recovery complete
I0823 02:50:49.420871 32639 slave.cpp:6226] Finished recovery
I0823 02:50:49.421408 32639 slave.cpp:6408] Querying resource estimator for oversubscribable
resources
I0823 02:50:49.421661 32624 slave.cpp:6422] Received oversubscribable resources {} from the
resource estimator
I0823 02:50:49.424564 32634 process.cpp:3933] Handling HTTP event for process 'slave(799)'
with path: '/slave(799)/monitor/statistics'
I0823 02:50:49.425851 32622 http.cpp:1166] HTTP GET for /slave(799)/monitor/statistics from
172.17.0.2:35898
I0823 02:50:49.425920 32622 http.cpp:957] Authorizing principal 'test-principal' to GET the
'/monitor/statistics' endpoint
I0823 02:50:49.428879 32620 slave.cpp:859] Agent terminating
[       OK ] Endpoint/SlaveEndpointTest.UnauthorizedRequest/0 (35 ms)
[ RUN      ] Endpoint/SlaveEndpointTest.UnauthorizedRequest/1
I0823 02:50:49.442404 32620 containerizer.cpp:288] Using isolation { environment_secret, posix/cpu,
posix/mem, filesystem/posix, network/cni }
W0823 02:50:49.442899 32620 backend.cpp:76] Failed to create 'aufs' backend: AufsBackend requires
root privileges
W0823 02:50:49.443002 32620 backend.cpp:76] Failed to create 'bind' backend: BindBackend requires
root privileges
I0823 02:50:49.443032 32620 provisioner.cpp:255] Using default backend 'copy'
I0823 02:50:49.446543 32626 slave.cpp:252] Mesos agent started on (800)@172.17.0.2:33907
I0823 02:50:49.446561 32626 slave.cpp:253] Flags at startup: --acls="" --appc_simple_discovery_uri_prefix="http://"
--appc_store_dir="/tmp/Endpoint_SlaveEndpointTest_UnauthorizedRequest_1_QgPSW3/store/appc"
--authenticate_http_readonly="true" --authenticate_http_readwrite="true" --authenticatee="crammd5"
--authentication_backoff_factor="1secs" --authorizer="local" --cgroups_cpu_enable_pids_and_tids_count="false"
--cgroups_enable_cfs="false" --cgroups_hierarchy="/sys/fs/cgroup" --cgroups_limit_swap="false"
--cgroups_root="mesos" --container_disk_watch_interval="15secs" --containerizers="mesos" --credential="/tmp/Endpoint_SlaveEndpointTest_UnauthorizedRequest_1_QgPSW3/credential"
--default_role="*" --disallow_sharing_agent_pid_namespace="false" --disk_watch_interval="1mins"
--docker="docker" --docker_kill_orphans="true" --docker_registry="https://registry-1.docker.io"
--docker_remove_delay="6hrs" --docker_socket="/var/run/docker.sock" --docker_stop_timeout="0ns"
--docker_store_dir="/tmp/Endpoint_SlaveEndpointTest_UnauthorizedRequest_1_QgPSW3/store/docker"
--docker_volume_checkpoint_dir="/var/run/mesos/isolators/docker/volume" --enforce_container_disk_quota="false"
--executor_registration_timeout="1mins" --executor_reregistration_timeout="2secs" --executor_shutdown_grace_period="5secs"
--fetcher_cache_dir="/tmp/Endpoint_SlaveEndpointTest_UnauthorizedRequest_1_QgPSW3/fetch" --fetcher_cache_size="2GB"
--frameworks_home="" --gc_delay="1weeks" --gc_disk_headroom="0.1" --hadoop_home="" --help="false"
--hostname_lookup="true" --http_command_executor="false" --http_credentials="/tmp/Endpoint_SlaveEndpointTest_UnauthorizedRequest_1_QgPSW3/http_credentials"
--http_heartbeat_interval="30secs" --initialize_driver_logging="true" --isolation="posix/cpu,posix/mem"
--launcher="posix" --launcher_dir="/mesos/build/src" --logbufsecs="0" --logging_level="INFO"
--max_completed_executors_per_framework="150" --oversubscribed_resources_interval="15secs"
--perf_duration="10secs" --perf_interval="1mins" --port="5051" --qos_correction_interval_min="0ns"
--quiet="false" --recover="reconnect" --recovery_timeout="15mins" --registration_backoff_factor="10ms"
--resources="cpus:2;gpus:0;mem:1024;disk:1024;ports:[31000-32000]" --revocable_cpu_low_priority="true"
--runtime_dir="/tmp/Endpoint_SlaveEndpointTest_UnauthorizedRequest_1_QgPSW3" --sandbox_directory="/mnt/mesos/sandbox"
--strict="true" --switch_user="true" --systemd_enable_support="true" --systemd_runtime_directory="/run/systemd/system"
--version="false" --work_dir="/tmp/Endpoint_SlaveEndpointTest_UnauthorizedRequest_1_EJuxBZ"
I0823 02:50:49.447057 32626 credentials.hpp:86] Loading credential for authentication from
'/tmp/Endpoint_SlaveEndpointTest_UnauthorizedRequest_1_QgPSW3/credential'
I0823 02:50:49.447279 32626 slave.cpp:285] Agent using credential for: test-principal
I0823 02:50:49.447299 32626 credentials.hpp:37] Loading credentials for authentication from
'/tmp/Endpoint_SlaveEndpointTest_UnauthorizedRequest_1_QgPSW3/http_credentials'
I0823 02:50:49.447559 32626 http.cpp:1026] Creating default 'basic' HTTP authenticator for
realm 'mesos-agent-readonly'
I0823 02:50:49.447741 32626 http.cpp:1026] Creating default 'basic' HTTP authenticator for
realm 'mesos-agent-readwrite'
I0823 02:50:49.449165 32626 slave.cpp:581] Agent resources: [{"name":"cpus","scalar":{"value":2.0},"type":"SCALAR"},{"name":"mem","scalar":{"value":1024.0},"type":"SCALAR"},{"name":"disk","scalar":{"value":1024.0},"type":"SCALAR"},{"name":"ports","ranges":{"range":[{"begin":31000,"end":32000}]},"type":"RANGES"}]
I0823 02:50:49.449424 32626 slave.cpp:589] Agent attributes: [  ]
I0823 02:50:49.449432 32626 slave.cpp:598] Agent hostname: ce48ba64ce17
I0823 02:50:49.449599 32627 status_update_manager.cpp:177] Pausing sending status updates
I0823 02:50:49.450872 32637 state.cpp:64] Recovering state from '/tmp/Endpoint_SlaveEndpointTest_UnauthorizedRequest_1_EJuxBZ/meta'
I0823 02:50:49.451194 32621 status_update_manager.cpp:203] Recovering status update manager
I0823 02:50:49.451411 32624 containerizer.cpp:643] Recovering containerizer
I0823 02:50:49.452961 32633 provisioner.cpp:416] Provisioner recovery complete
I0823 02:50:49.453275 32639 slave.cpp:6226] Finished recovery
I0823 02:50:49.453837 32639 slave.cpp:6408] Querying resource estimator for oversubscribable
resources
I0823 02:50:49.454125 32640 slave.cpp:6422] Received oversubscribable resources {} from the
resource estimator
I0823 02:50:49.456401 32634 process.cpp:3933] Handling HTTP event for process 'slave(800)'
with path: '/slave(800)/monitor/statistics.json'
I0823 02:50:49.457675 32625 http.cpp:1166] HTTP GET for /slave(800)/monitor/statistics.json
from 172.17.0.2:35900
I0823 02:50:49.457747 32625 http.cpp:957] Authorizing principal 'test-principal' to GET the
'/monitor/statistics.json' endpoint
I0823 02:50:49.460525 32620 slave.cpp:859] Agent terminating
[       OK ] Endpoint/SlaveEndpointTest.UnauthorizedRequest/1 (30 ms)
[ RUN      ] Endpoint/SlaveEndpointTest.UnauthorizedRequest/2
I0823 02:50:49.471895 32620 containerizer.cpp:288] Using isolation { environment_secret, posix/cpu,
posix/mem, filesystem/posix, network/cni }
W0823 02:50:49.472347 32620 backend.cpp:76] Failed to create 'aufs' backend: AufsBackend requires
root privileges
W0823 02:50:49.472437 32620 backend.cpp:76] Failed to create 'bind' backend: BindBackend requires
root privileges
I0823 02:50:49.472462 32620 provisioner.cpp:255] Using default backend 'copy'
I0823 02:50:49.475693 32635 slave.cpp:252] Mesos agent started on (801)@172.17.0.2:33907
I0823 02:50:49.475713 32635 slave.cpp:253] Flags at startup: --acls="" --appc_simple_discovery_uri_prefix="http://"
--appc_store_dir="/tmp/Endpoint_SlaveEndpointTest_UnauthorizedRequest_2_A2vnzl/store/appc"
--authenticate_http_readonly="true" --authenticate_http_readwrite="true" --authenticatee="crammd5"
--authentication_backoff_factor="1secs" --authorizer="local" --cgroups_cpu_enable_pids_and_tids_count="false"
--cgroups_enable_cfs="false" --cgroups_hierarchy="/sys/fs/cgroup" --cgroups_limit_swap="false"
--cgroups_root="mesos" --container_disk_watch_interval="15secs" --containerizers="mesos" --credential="/tmp/Endpoint_SlaveEndpointTest_UnauthorizedRequest_2_A2vnzl/credential"
--default_role="*" --disallow_sharing_agent_pid_namespace="false" --disk_watch_interval="1mins"
--docker="docker" --docker_kill_orphans="true" --docker_registry="https://registry-1.docker.io"
--docker_remove_delay="6hrs" --docker_socket="/var/run/docker.sock" --docker_stop_timeout="0ns"
--docker_store_dir="/tmp/Endpoint_SlaveEndpointTest_UnauthorizedRequest_2_A2vnzl/store/docker"
--docker_volume_checkpoint_dir="/var/run/mesos/isolators/docker/volume" --enforce_container_disk_quota="false"
--executor_registration_timeout="1mins" --executor_reregistration_timeout="2secs" --executor_shutdown_grace_period="5secs"
--fetcher_cache_dir="/tmp/Endpoint_SlaveEndpointTest_UnauthorizedRequest_2_A2vnzl/fetch" --fetcher_cache_size="2GB"
--frameworks_home="" --gc_delay="1weeks" --gc_disk_headroom="0.1" --hadoop_home="" --help="false"
--hostname_lookup="true" --http_command_executor="false" --http_credentials="/tmp/Endpoint_SlaveEndpointTest_UnauthorizedRequest_2_A2vnzl/http_credentials"
--http_heartbeat_interval="30secs" --initialize_driver_logging="true" --isolation="posix/cpu,posix/mem"
--launcher="posix" --launcher_dir="/mesos/build/src" --logbufsecs="0" --logging_level="INFO"
--max_completed_executors_per_framework="150" --oversubscribed_resources_interval="15secs"
--perf_duration="10secs" --perf_interval="1mins" --port="5051" --qos_correction_interval_min="0ns"
--quiet="false" --recover="reconnect" --recovery_timeout="15mins" --registration_backoff_factor="10ms"
--resources="cpus:2;gpus:0;mem:1024;disk:1024;ports:[31000-32000]" --revocable_cpu_low_priority="true"
--runtime_dir="/tmp/Endpoint_SlaveEndpointTest_UnauthorizedRequest_2_A2vnzl" --sandbox_directory="/mnt/mesos/sandbox"
--strict="true" --switch_user="true" --systemd_enable_support="true" --systemd_runtime_directory="/run/systemd/system"
--version="false" --work_dir="/tmp/Endpoint_SlaveEndpointTest_UnauthorizedRequest_2_03VA9g"
I0823 02:50:49.476054 32635 credentials.hpp:86] Loading credential for authentication from
'/tmp/Endpoint_SlaveEndpointTest_UnauthorizedRequest_2_A2vnzl/credential'
I0823 02:50:49.476341 32635 slave.cpp:285] Agent using credential for: test-principal
I0823 02:50:49.476375 32635 credentials.hpp:37] Loading credentials for authentication from
'/tmp/Endpoint_SlaveEndpointTest_UnauthorizedRequest_2_A2vnzl/http_credentials'
I0823 02:50:49.476666 32635 http.cpp:1026] Creating default 'basic' HTTP authenticator for
realm 'mesos-agent-readonly'
I0823 02:50:49.476850 32635 http.cpp:1026] Creating default 'basic' HTTP authenticator for
realm 'mesos-agent-readwrite'
I0823 02:50:49.478309 32635 slave.cpp:581] Agent resources: [{"name":"cpus","scalar":{"value":2.0},"type":"SCALAR"},{"name":"mem","scalar":{"value":1024.0},"type":"SCALAR"},{"name":"disk","scalar":{"value":1024.0},"type":"SCALAR"},{"name":"ports","ranges":{"range":[{"begin":31000,"end":32000}]},"type":"RANGES"}]
I0823 02:50:49.478519 32635 slave.cpp:589] Agent attributes: [  ]
I0823 02:50:49.478528 32635 slave.cpp:598] Agent hostname: ce48ba64ce17
I0823 02:50:49.478672 32639 status_update_manager.cpp:177] Pausing sending status updates
I0823 02:50:49.479986 32644 state.cpp:64] Recovering state from '/tmp/Endpoint_SlaveEndpointTest_UnauthorizedRequest_2_03VA9g/meta'
I0823 02:50:49.480245 32644 status_update_manager.cpp:203] Recovering status update manager
I0823 02:50:49.480417 32627 containerizer.cpp:643] Recovering containerizer
I0823 02:50:49.482048 32640 provisioner.cpp:416] Provisioner recovery complete
I0823 02:50:49.482375 32635 slave.cpp:6226] Finished recovery
I0823 02:50:49.482836 32635 slave.cpp:6408] Querying resource estimator for oversubscribable
resources
I0823 02:50:49.483059 32624 slave.cpp:6422] Received oversubscribable resources {} from the
resource estimator
I0823 02:50:49.485283 32637 process.cpp:3933] Handling HTTP event for process 'slave(801)'
with path: '/slave(801)/containers'
I0823 02:50:49.486341 32621 http.cpp:1166] HTTP GET for /slave(801)/containers from 172.17.0.2:35902
I0823 02:50:49.486415 32621 http.cpp:957] Authorizing principal 'test-principal' to GET the
'/containers' endpoint
I0823 02:50:49.488824 32635 slave.cpp:859] Agent terminating
[       OK ] Endpoint/SlaveEndpointTest.UnauthorizedRequest/2 (28 ms)
[ RUN      ] Endpoint/SlaveEndpointTest.NoAuthorizer/0
I0823 02:50:49.501756 32620 containerizer.cpp:288] Using isolation { environment_secret, posix/cpu,
posix/mem, filesystem/posix, network/cni }
W0823 02:50:49.502303 32620 backend.cpp:76] Failed to create 'aufs' backend: AufsBackend requires
root privileges
W0823 02:50:49.502432 32620 backend.cpp:76] Failed to create 'bind' backend: BindBackend requires
root privileges
I0823 02:50:49.502462 32620 provisioner.cpp:255] Using default backend 'copy'
I0823 02:50:49.504106 32620 cluster.cpp:448] Creating default 'local' authorizer
I0823 02:50:49.506386 32629 slave.cpp:252] Mesos agent started on (802)@172.17.0.2:33907
I0823 02:50:49.506408 32629 slave.cpp:253] Flags at startup: --acls="" --appc_simple_discovery_uri_prefix="http://"
--appc_store_dir="/tmp/Endpoint_SlaveEndpointTest_NoAuthorizer_0_8fS8sD/store/appc" --authenticate_http_readonly="true"
--authenticate_http_readwrite="true" --authenticatee="crammd5" --authentication_backoff_factor="1secs"
--authorizer="local" --cgroups_cpu_enable_pids_and_tids_count="false" --cgroups_enable_cfs="false"
--cgroups_hierarchy="/sys/fs/cgroup" --cgroups_limit_swap="false" --cgroups_root="mesos" --container_disk_watch_interval="15secs"
--containerizers="mesos" --credential="/tmp/Endpoint_SlaveEndpointTest_NoAuthorizer_0_8fS8sD/credential"
--default_role="*" --disallow_sharing_agent_pid_namespace="false" --disk_watch_interval="1mins"
--docker="docker" --docker_kill_orphans="true" --docker_registry="https://registry-1.docker.io"
--docker_remove_delay="6hrs" --docker_socket="/var/run/docker.sock" --docker_stop_timeout="0ns"
--docker_store_dir="/tmp/Endpoint_SlaveEndpointTest_NoAuthorizer_0_8fS8sD/store/docker" --docker_volume_checkpoint_dir="/var/run/mesos/isolators/docker/volume"
--enforce_container_disk_quota="false" --executor_registration_timeout="1mins" --executor_reregistration_timeout="2secs"
--executor_shutdown_grace_period="5secs" --fetcher_cache_dir="/tmp/Endpoint_SlaveEndpointTest_NoAuthorizer_0_8fS8sD/fetch"
--fetcher_cache_size="2GB" --frameworks_home="" --gc_delay="1weeks" --gc_disk_headroom="0.1"
--hadoop_home="" --help="false" --hostname_lookup="true" --http_command_executor="false" --http_credentials="/tmp/Endpoint_SlaveEndpointTest_NoAuthorizer_0_8fS8sD/http_credentials"
--http_heartbeat_interval="30secs" --initialize_driver_logging="true" --isolation="posix/cpu,posix/mem"
--launcher="posix" --launcher_dir="/mesos/build/src" --logbufsecs="0" --logging_level="INFO"
--max_completed_executors_per_framework="150" --oversubscribed_resources_interval="15secs"
--perf_duration="10secs" --perf_interval="1mins" --port="5051" --qos_correction_interval_min="0ns"
--quiet="false" --recover="reconnect" --recovery_timeout="15mins" --registration_backoff_factor="10ms"
--resources="cpus:2;gpus:0;mem:1024;disk:1024;ports:[31000-32000]" --revocable_cpu_low_priority="true"
--runtime_dir="/tmp/Endpoint_SlaveEndpointTest_NoAuthorizer_0_8fS8sD" --sandbox_directory="/mnt/mesos/sandbox"
--strict="true" --switch_user="true" --systemd_enable_support="true" --systemd_runtime_directory="/run/systemd/system"
--version="false" --work_dir="/tmp/Endpoint_SlaveEndpointTest_NoAuthorizer_0_gGe1Yy"
I0823 02:50:49.506778 32629 credentials.hpp:86] Loading credential for authentication from
'/tmp/Endpoint_SlaveEndpointTest_NoAuthorizer_0_8fS8sD/credential'
I0823 02:50:49.506939 32629 slave.cpp:285] Agent using credential for: test-principal
I0823 02:50:49.506958 32629 credentials.hpp:37] Loading credentials for authentication from
'/tmp/Endpoint_SlaveEndpointTest_NoAuthorizer_0_8fS8sD/http_credentials'
I0823 02:50:49.507213 32629 http.cpp:1026] Creating default 'basic' HTTP authenticator for
realm 'mesos-agent-readonly'
I0823 02:50:49.507378 32629 http.cpp:1026] Creating default 'basic' HTTP authenticator for
realm 'mesos-agent-readwrite'
I0823 02:50:49.508693 32629 slave.cpp:581] Agent resources: [{"name":"cpus","scalar":{"value":2.0},"type":"SCALAR"},{"name":"mem","scalar":{"value":1024.0},"type":"SCALAR"},{"name":"disk","scalar":{"value":1024.0},"type":"SCALAR"},{"name":"ports","ranges":{"range":[{"begin":31000,"end":32000}]},"type":"RANGES"}]
I0823 02:50:49.508921 32629 slave.cpp:589] Agent attributes: [  ]
I0823 02:50:49.508932 32629 slave.cpp:598] Agent hostname: ce48ba64ce17
I0823 02:50:49.509049 32636 status_update_manager.cpp:177] Pausing sending status updates
I0823 02:50:49.510248 32624 state.cpp:64] Recovering state from '/tmp/Endpoint_SlaveEndpointTest_NoAuthorizer_0_gGe1Yy/meta'
I0823 02:50:49.510615 32627 status_update_manager.cpp:203] Recovering status update manager
I0823 02:50:49.510785 32637 containerizer.cpp:643] Recovering containerizer
I0823 02:50:49.512290 32636 provisioner.cpp:416] Provisioner recovery complete
I0823 02:50:49.512712 32635 slave.cpp:6226] Finished recovery
I0823 02:50:49.513097 32635 slave.cpp:6408] Querying resource estimator for oversubscribable
resources
I0823 02:50:49.513314 32640 slave.cpp:6422] Received oversubscribable resources {} from the
resource estimator
I0823 02:50:49.515573 32632 process.cpp:3933] Handling HTTP event for process 'slave(802)'
with path: '/slave(802)/monitor/statistics'
I0823 02:50:49.516664 32636 http.cpp:1166] HTTP GET for /slave(802)/monitor/statistics from
172.17.0.2:35904
I0823 02:50:49.516783 32636 http.cpp:957] Authorizing principal 'test-principal' to GET the
'/monitor/statistics' endpoint
I0823 02:50:49.520531 32624 slave.cpp:859] Agent terminating
[       OK ] Endpoint/SlaveEndpointTest.NoAuthorizer/0 (31 ms)
[ RUN      ] Endpoint/SlaveEndpointTest.NoAuthorizer/1
I0823 02:50:49.536864 32620 containerizer.cpp:288] Using isolation { environment_secret, posix/cpu,
posix/mem, filesystem/posix, network/cni }
W0823 02:50:49.537606 32620 backend.cpp:76] Failed to create 'aufs' backend: AufsBackend requires
root privileges
W0823 02:50:49.537750 32620 backend.cpp:76] Failed to create 'bind' backend: BindBackend requires
root privileges
I0823 02:50:49.537812 32620 provisioner.cpp:255] Using default backend 'copy'
I0823 02:50:49.540428 32620 cluster.cpp:448] Creating default 'local' authorizer
I0823 02:50:49.543401 32633 slave.cpp:252] Mesos agent started on (803)@172.17.0.2:33907
I0823 02:50:49.543421 32633 slave.cpp:253] Flags at startup: --acls="" --appc_simple_discovery_uri_prefix="http://"
--appc_store_dir="/tmp/Endpoint_SlaveEndpointTest_NoAuthorizer_1_hnpYFV/store/appc" --authenticate_http_readonly="true"
--authenticate_http_readwrite="true" --authenticatee="crammd5" --authentication_backoff_factor="1secs"
--authorizer="local" --cgroups_cpu_enable_pids_and_tids_count="false" --cgroups_enable_cfs="false"
--cgroups_hierarchy="/sys/fs/cgroup" --cgroups_limit_swap="false" --cgroups_root="mesos" --container_disk_watch_interval="15secs"
--containerizers="mesos" --credential="/tmp/Endpoint_SlaveEndpointTest_NoAuthorizer_1_hnpYFV/credential"
--default_role="*" --disallow_sharing_agent_pid_namespace="false" --disk_watch_interval="1mins"
--docker="docker" --docker_kill_orphans="true" --docker_registry="https://registry-1.docker.io"
--docker_remove_delay="6hrs" --docker_socket="/var/run/docker.sock" --docker_stop_timeout="0ns"
--docker_store_dir="/tmp/Endpoint_SlaveEndpointTest_NoAuthorizer_1_hnpYFV/store/docker" --docker_volume_checkpoint_dir="/var/run/mesos/isolators/docker/volume"
--enforce_container_disk_quota="false" --executor_registration_timeout="1mins" --executor_reregistration_timeout="2secs"
--executor_shutdown_grace_period="5secs" --fetcher_cache_dir="/tmp/Endpoint_SlaveEndpointTest_NoAuthorizer_1_hnpYFV/fetch"
--fetcher_cache_size="2GB" --frameworks_home="" --gc_delay="1weeks" --gc_disk_headroom="0.1"
--hadoop_home="" --help="false" --hostname_lookup="true" --http_command_executor="false" --http_credentials="/tmp/Endpoint_SlaveEndpointTest_NoAuthorizer_1_hnpYFV/http_credentials"
--http_heartbeat_interval="30secs" --initialize_driver_logging="true" --isolation="posix/cpu,posix/mem"
--launcher="posix" --launcher_dir="/mesos/build/src" --logbufsecs="0" --logging_level="INFO"
--max_completed_executors_per_framework="150" --oversubscribed_resources_interval="15secs"
--perf_duration="10secs" --perf_interval="1mins" --port="5051" --qos_correction_interval_min="0ns"
--quiet="false" --recover="reconnect" --recovery_timeout="15mins" --registration_backoff_factor="10ms"
--resources="cpus:2;gpus:0;mem:1024;disk:1024;ports:[31000-32000]" --revocable_cpu_low_priority="true"
--runtime_dir="/tmp/Endpoint_SlaveEndpointTest_NoAuthorizer_1_hnpYFV" --sandbox_directory="/mnt/mesos/sandbox"
--strict="true" --switch_user="true" --systemd_enable_support="true" --systemd_runtime_directory="/run/systemd/system"
--version="false" --work_dir="/tmp/Endpoint_SlaveEndpointTest_NoAuthorizer_1_hzNX6Q"
I0823 02:50:49.543727 32633 credentials.hpp:86] Loading credential for authentication from
'/tmp/Endpoint_SlaveEndpointTest_NoAuthorizer_1_hnpYFV/credential'
I0823 02:50:49.543853 32633 slave.cpp:285] Agent using credential for: test-principal
I0823 02:50:49.543869 32633 credentials.hpp:37] Loading credentials for authentication from
'/tmp/Endpoint_SlaveEndpointTest_NoAuthorizer_1_hnpYFV/http_credentials'
I0823 02:50:49.544049 32633 http.cpp:1026] Creating default 'basic' HTTP authenticator for
realm 'mesos-agent-readonly'
I0823 02:50:49.544191 32633 http.cpp:1026] Creating default 'basic' HTTP authenticator for
realm 'mesos-agent-readwrite'
I0823 02:50:49.546005 32633 slave.cpp:581] Agent resources: [{"name":"cpus","scalar":{"value":2.0},"type":"SCALAR"},{"name":"mem","scalar":{"value":1024.0},"type":"SCALAR"},{"name":"disk","scalar":{"value":1024.0},"type":"SCALAR"},{"name":"ports","ranges":{"range":[{"begin":31000,"end":32000}]},"type":"RANGES"}]
I0823 02:50:49.546337 32633 slave.cpp:589] Agent attributes: [  ]
I0823 02:50:49.546352 32633 slave.cpp:598] Agent hostname: ce48ba64ce17
I0823 02:50:49.546581 32624 status_update_manager.cpp:177] Pausing sending status updates
I0823 02:50:49.548938 32630 state.cpp:64] Recovering state from '/tmp/Endpoint_SlaveEndpointTest_NoAuthorizer_1_hzNX6Q/meta'
I0823 02:50:49.549386 32644 status_update_manager.cpp:203] Recovering status update manager
I0823 02:50:49.549643 32625 containerizer.cpp:643] Recovering containerizer
I0823 02:50:49.551218 32635 provisioner.cpp:416] Provisioner recovery complete
I0823 02:50:49.551810 32626 slave.cpp:6226] Finished recovery
I0823 02:50:49.552345 32626 slave.cpp:6408] Querying resource estimator for oversubscribable
resources
I0823 02:50:49.552546 32621 slave.cpp:6422] Received oversubscribable resources {} from the
resource estimator
I0823 02:50:49.554957 32643 process.cpp:3933] Handling HTTP event for process 'slave(803)'
with path: '/slave(803)/monitor/statistics.json'
I0823 02:50:49.556279 32629 http.cpp:1166] HTTP GET for /slave(803)/monitor/statistics.json
from 172.17.0.2:35906
I0823 02:50:49.556349 32629 http.cpp:957] Authorizing principal 'test-principal' to GET the
'/monitor/statistics.json' endpoint
I0823 02:50:49.560530 32644 slave.cpp:859] Agent terminating
[       OK ] Endpoint/SlaveEndpointTest.NoAuthorizer/1 (40 ms)
[ RUN      ] Endpoint/SlaveEndpointTest.NoAuthorizer/2
I0823 02:50:49.574672 32620 containerizer.cpp:288] Using isolation { environment_secret, posix/cpu,
posix/mem, filesystem/posix, network/cni }
W0823 02:50:49.575263 32620 backend.cpp:76] Failed to create 'aufs' backend: AufsBackend requires
root privileges
W0823 02:50:49.575388 32620 backend.cpp:76] Failed to create 'bind' backend: BindBackend requires
root privileges
I0823 02:50:49.575433 32620 provisioner.cpp:255] Using default backend 'copy'
I0823 02:50:49.577395 32620 cluster.cpp:448] Creating default 'local' authorizer
I0823 02:50:49.579557 32637 slave.cpp:252] Mesos agent started on (804)@172.17.0.2:33907
I0823 02:50:49.579589 32637 slave.cpp:253] Flags at startup: --acls="" --appc_simple_discovery_uri_prefix="http://"
--appc_store_dir="/tmp/Endpoint_SlaveEndpointTest_NoAuthorizer_2_ZYEyge/store/appc" --authenticate_http_readonly="true"
--authenticate_http_readwrite="true" --authenticatee="crammd5" --authentication_backoff_factor="1secs"
--authorizer="local" --cgroups_cpu_enable_pids_and_tids_count="false" --cgroups_enable_cfs="false"
--cgroups_hierarchy="/sys/fs/cgroup" --cgroups_limit_swap="false" --cgroups_root="mesos" --container_disk_watch_interval="15secs"
--containerizers="mesos" --credential="/tmp/Endpoint_SlaveEndpointTest_NoAuthorizer_2_ZYEyge/credential"
--default_role="*" --disallow_sharing_agent_pid_namespace="false" --disk_watch_interval="1mins"
--docker="docker" --docker_kill_orphans="true" --docker_registry="https://registry-1.docker.io"
--docker_remove_delay="6hrs" --docker_socket="/var/run/docker.sock" --docker_stop_timeout="0ns"
--docker_store_dir="/tmp/Endpoint_SlaveEndpointTest_NoAuthorizer_2_ZYEyge/store/docker" --docker_volume_checkpoint_dir="/var/run/mesos/isolators/docker/volume"
--enforce_container_disk_quota="false" --executor_registration_timeout="1mins" --executor_reregistration_timeout="2secs"
--executor_shutdown_grace_period="5secs" --fetcher_cache_dir="/tmp/Endpoint_SlaveEndpointTest_NoAuthorizer_2_ZYEyge/fetch"
--fetcher_cache_size="2GB" --frameworks_home="" --gc_delay="1weeks" --gc_disk_headroom="0.1"
--hadoop_home="" --help="false" --hostname_lookup="true" --http_command_executor="false" --http_credentials="/tmp/Endpoint_SlaveEndpointTest_NoAuthorizer_2_ZYEyge/http_credentials"
--http_heartbeat_interval="30secs" --initialize_driver_logging="true" --isolation="posix/cpu,posix/mem"
--launcher="posix" --launcher_dir="/mesos/build/src" --logbufsecs="0" --logging_level="INFO"
--max_completed_executors_per_framework="150" --oversubscribed_resources_interval="15secs"
--perf_duration="10secs" --perf_interval="1mins" --port="5051" --qos_correction_interval_min="0ns"
--quiet="false" --recover="reconnect" --recovery_timeout="15mins" --registration_backoff_factor="10ms"
--resources="cpus:2;gpus:0;mem:1024;disk:1024;ports:[31000-32000]" --revocable_cpu_low_priority="true"
--runtime_dir="/tmp/Endpoint_SlaveEndpointTest_NoAuthorizer_2_ZYEyge" --sandbox_directory="/mnt/mesos/sandbox"
--strict="true" --switch_user="true" --systemd_enable_support="true" --systemd_runtime_directory="/run/systemd/system"
--version="false" --work_dir="/tmp/Endpoint_SlaveEndpointTest_NoAuthorizer_2_XydCB9"
I0823 02:50:49.580075 32637 credentials.hpp:86] Loading credential for authentication from
'/tmp/Endpoint_SlaveEndpointTest_NoAuthorizer_2_ZYEyge/credential'
I0823 02:50:49.580225 32637 slave.cpp:285] Agent using credential for: test-principal
I0823 02:50:49.580243 32637 credentials.hpp:37] Loading credentials for authentication from
'/tmp/Endpoint_SlaveEndpointTest_NoAuthorizer_2_ZYEyge/http_credentials'
I0823 02:50:49.580453 32637 http.cpp:1026] Creating default 'basic' HTTP authenticator for
realm 'mesos-agent-readonly'
I0823 02:50:49.580611 32637 http.cpp:1026] Creating default 'basic' HTTP authenticator for
realm 'mesos-agent-readwrite'
I0823 02:50:49.582126 32637 slave.cpp:581] Agent resources: [{"name":"cpus","scalar":{"value":2.0},"type":"SCALAR"},{"name":"mem","scalar":{"value":1024.0},"type":"SCALAR"},{"name":"disk","scalar":{"value":1024.0},"type":"SCALAR"},{"name":"ports","ranges":{"range":[{"begin":31000,"end":32000}]},"type":"RANGES"}]
I0823 02:50:49.582358 32637 slave.cpp:589] Agent attributes: [  ]
I0823 02:50:49.582370 32637 slave.cpp:598] Agent hostname: ce48ba64ce17
I0823 02:50:49.582547 32638 status_update_manager.cpp:177] Pausing sending status updates
I0823 02:50:49.584190 32625 state.cpp:64] Recovering state from '/tmp/Endpoint_SlaveEndpointTest_NoAuthorizer_2_XydCB9/meta'
I0823 02:50:49.584445 32625 status_update_manager.cpp:203] Recovering status update manager
I0823 02:50:49.584619 32628 containerizer.cpp:643] Recovering containerizer
I0823 02:50:49.586417 32623 provisioner.cpp:416] Provisioner recovery complete
I0823 02:50:49.586786 32622 slave.cpp:6226] Finished recovery
I0823 02:50:49.587272 32622 slave.cpp:6408] Querying resource estimator for oversubscribable
resources
I0823 02:50:49.587517 32626 slave.cpp:6422] Received oversubscribable resources {} from the
resource estimator
I0823 02:50:49.589946 32644 process.cpp:3933] Handling HTTP event for process 'slave(804)'
with path: '/slave(804)/containers'
I0823 02:50:49.591224 32641 http.cpp:1166] HTTP GET for /slave(804)/containers from 172.17.0.2:35908
I0823 02:50:49.591287 32641 http.cpp:957] Authorizing principal 'test-principal' to GET the
'/containers' endpoint
I0823 02:50:49.595093 32620 slave.cpp:859] Agent terminating
[       OK ] Endpoint/SlaveEndpointTest.NoAuthorizer/2 (33 ms)
[----------] 9 tests from Endpoint/SlaveEndpointTest (301 ms total)

[----------] Global test environment tear-down
[==========] 1612 tests from 175 test cases ran. (319826 ms total)
[  PASSED  ] 1611 tests.
[  FAILED  ] 1 test, listed below:
[  FAILED  ] MasterTest.IgnoreOldAgentReregistration

 1 FAILED TEST
  YOU HAVE 20 DISABLED TESTS

I0823 02:50:49.661142 32645 process.cpp:1072] Failed to accept socket: future discarded
make[3]: *** [CMakeFiles/check] Error 1
make[3]: Leaving directory `/mesos/build'
make[2]: Leaving directory `/mesos/build'
make[2]: *** [CMakeFiles/check.dir/all] Error 2
make[1]: *** [CMakeFiles/check.dir/rule] Error 2
make[1]: Leaving directory `/mesos/build'
make: *** [check] Error 2
+ docker rmi mesos-1503453835-559
Untagged: mesos-1503453835-559:latest
Deleted: sha256:cdc5bf9693f51c8e48594394e260d16c407c989b3672dad982766ff142e51ade
Deleted: sha256:17107aad9c5829f880968c5ea727d5625a89eb0640cf69d314be9222f712fdb5
Deleted: sha256:dd84a6b21d45efdb65c0c1fb1e94afa3b8914121f7e148e98a3915baa8069297
Deleted: sha256:e30e8d7aa1aa436657a92ed3489f26fc33e5b6281beede2a9d4e4bf9cfa1570c
Deleted: sha256:af839a8dadb64f9a31a742ce7b2e46cb3ddb453821ee9f520d504f87d5f3c7fb
Deleted: sha256:046b6709634d0933a7a2764cfe5433d7eef33933ea905a47dc9fb25ab8bce9a7
Deleted: sha256:2ab70a574f21f34c72db4b1bb0b3d1c744eadf957239b35e6d36525cc6e52c17
Deleted: sha256:056953eb8f4fa9e8c3c4d0b868b33a118e26fa94ecaecec942e2aa545eb0782b
Deleted: sha256:abef4e6a48c6479171457257bedd8f701898be5d1f7e215e2f4bf760281c2006
Deleted: sha256:af241787bd177dd4ff7b6b3d53c91cdb5f0a57450b98d54dbd7b7832e329fefc
Deleted: sha256:28189a977dc7993324ca4b4f76e6a5456a9d176f1ed59d04568f3ad6bb047ec3
Deleted: sha256:a0092eb53895e4d1034982df8976979697d12ef594d8b044bf26cfeddb8b491a
Deleted: sha256:6ce106f54dae9e8cacdccd59808918bf89e6cf12130b4c5d04ffc75cd9277467
Deleted: sha256:dc6cfcae553e7f762929746d745cd63f5360c5da354ce0567821d4631b415a73
Deleted: sha256:2ba56bf50b4ed6fff65bdee84289d282877c27cdfe15ab84e151c6ea257aa78e
Deleted: sha256:3cedd2ee06971dbac6a4680b86b8df670d4e79870948b27c1c70bddd0f0ea906
Deleted: sha256:9d948b7001a8c0b9a42c9515919f92e00c3167ff7da698400aee57b22016e11f
Deleted: sha256:33f66ad83757173a20f14432c30542b011d7c90298d6bc2b46db62e504bab977
Deleted: sha256:1094099048818787461fbac0048a20fced5e966992547a131eb38bc992b430f0
Deleted: sha256:d85446342f75635275ee42997e8282e3e447b3fa391e30cea97e8beb0374e0fd
Deleted: sha256:1c31f98aceb74e4f131df3a3b2bd2b9b48066dd6202442083b9bba1c5584c93f
Deleted: sha256:6af85f19026e9faf8c5b42bd49403cd75c369d34d116d28362fea35e315f21d9
Deleted: sha256:5796d9c0a64f8d0cae4ca295100abc0978d10a961e3f2c64396de4df0b7ffa50
Deleted: sha256:c390a1dce8de7dce09c2df3cf48bafe848b5da56480a906037fe2b1edf5bfe6d
Build step 'Execute shell' marked build as failure
Not sending mail to unregistered user yujie.jay@gmail.com
Not sending mail to unregistered user xujyan@apple.com

Mime
View raw message