mesos-builds mailing list archives

Site index · List index
Message view « Date » · « Thread »
Top « Date » · « Thread »
From Apache Jenkins Server <jenk...@builds.apache.org>
Subject Build failed in Jenkins: Mesos-Buildbot » autotools,gcc,--verbose --enable-libevent --enable-ssl,GLOG_v=1 MESOS_VERBOSE=1,centos:7,(ubuntu)&&(!ubuntu-us1)&&(!ubuntu-eu2) #4035
Date Tue, 01 Aug 2017 19:11:20 GMT
See <https://builds.apache.org/job/Mesos-Buildbot/BUILDTOOL=autotools,COMPILER=gcc,CONFIGURATION=--verbose%20--enable-libevent%20--enable-ssl,ENVIRONMENT=GLOG_v=1%20MESOS_VERBOSE=1,OS=centos%3A7,label_exp=(ubuntu)&&(!ubuntu-us1)&&(!ubuntu-eu2)/4035/display/redirect>

------------------------------------------
[...truncated 31.71 MB...]
I0801 19:11:10.877393 30210 process.cpp:3836] Handling HTTP event for process 'slave(798)'
with path: '/slave(798)/containers'
I0801 19:11:10.879290 30194 http.cpp:1133] HTTP GET for /slave(798)/containers from 172.17.0.6:41748
I0801 19:11:10.879390 30194 http.cpp:957] Authorizing principal 'test-principal' to GET the
'/containers' endpoint
I0801 19:11:10.883218 30201 slave.cpp:843] Agent terminating
[       OK ] Endpoint/SlaveEndpointTest.AuthorizedRequest/2 (32 ms)
[ RUN      ] Endpoint/SlaveEndpointTest.UnauthorizedRequest/0
I0801 19:11:10.894603  9348 containerizer.cpp:230] Using isolation: posix/cpu,posix/mem,filesystem/posix,network/cni,environment_secret
W0801 19:11:10.895117  9348 backend.cpp:76] Failed to create 'aufs' backend: AufsBackend requires
root privileges
W0801 19:11:10.895231  9348 backend.cpp:76] Failed to create 'bind' backend: BindBackend requires
root privileges
I0801 19:11:10.895277  9348 provisioner.cpp:255] Using default backend 'copy'
I0801 19:11:10.898432 30204 slave.cpp:250] Mesos agent started on (799)@172.17.0.6:39757
I0801 19:11:10.898452 30204 slave.cpp:251] Flags at startup: --acls="" --appc_simple_discovery_uri_prefix="http://"
--appc_store_dir="/tmp/Endpoint_SlaveEndpointTest_UnauthorizedRequest_0_icoe0b/store/appc"
--authenticate_http_executors="true" --authenticate_http_readonly="true" --authenticate_http_readwrite="true"
--authenticatee="crammd5" --authentication_backoff_factor="1secs" --authorizer="local" --cgroups_cpu_enable_pids_and_tids_count="false"
--cgroups_enable_cfs="false" --cgroups_hierarchy="/sys/fs/cgroup" --cgroups_limit_swap="false"
--cgroups_root="mesos" --container_disk_watch_interval="15secs" --containerizers="mesos" --credential="/tmp/Endpoint_SlaveEndpointTest_UnauthorizedRequest_0_icoe0b/credential"
--default_role="*" --disk_watch_interval="1mins" --docker="docker" --docker_kill_orphans="true"
--docker_registry="https://registry-1.docker.io" --docker_remove_delay="6hrs" --docker_socket="/var/run/docker.sock"
--docker_stop_timeout="0ns" --docker_store_dir="/tmp/Endpoint_SlaveEndpointTest_UnauthorizedRequest_0_icoe0b/store/docker"
--docker_volume_checkpoint_dir="/var/run/mesos/isolators/docker/volume" --enforce_container_disk_quota="false"
--executor_registration_timeout="1mins" --executor_reregistration_timeout="2secs" --executor_secret_key="/tmp/Endpoint_SlaveEndpointTest_UnauthorizedRequest_0_icoe0b/executor_secret_key"
--executor_shutdown_grace_period="5secs" --fetcher_cache_dir="/tmp/Endpoint_SlaveEndpointTest_UnauthorizedRequest_0_icoe0b/fetch"
--fetcher_cache_size="2GB" --frameworks_home="" --gc_delay="1weeks" --gc_disk_headroom="0.1"
--hadoop_home="" --help="false" --hostname_lookup="true" --http_command_executor="false" --http_credentials="/tmp/Endpoint_SlaveEndpointTest_UnauthorizedRequest_0_icoe0b/http_credentials"
--http_heartbeat_interval="30secs" --initialize_driver_logging="true" --isolation="posix/cpu,posix/mem"
--launcher="posix" --launcher_dir="/mesos/mesos-1.4.0/_build/src" --logbufsecs="0" --logging_level="INFO"
--max_completed_executors_per_framework="150" --oversubscribed_resources_interval="15secs"
--perf_duration="10secs" --perf_interval="1mins" --port="5051" --qos_correction_interval_min="0ns"
--quiet="false" --recover="reconnect" --recovery_timeout="15mins" --registration_backoff_factor="10ms"
--resources="cpus:2;gpus:0;mem:1024;disk:1024;ports:[31000-32000]" --revocable_cpu_low_priority="true"
--runtime_dir="/tmp/Endpoint_SlaveEndpointTest_UnauthorizedRequest_0_icoe0b" --sandbox_directory="/mnt/mesos/sandbox"
--strict="true" --switch_user="true" --systemd_enable_support="true" --systemd_runtime_directory="/run/systemd/system"
--version="false" --work_dir="/tmp/Endpoint_SlaveEndpointTest_UnauthorizedRequest_0_NumgxJ"
I0801 19:11:10.898836 30204 credentials.hpp:86] Loading credential for authentication from
'/tmp/Endpoint_SlaveEndpointTest_UnauthorizedRequest_0_icoe0b/credential'
I0801 19:11:10.898998 30204 slave.cpp:283] Agent using credential for: test-principal
I0801 19:11:10.899019 30204 credentials.hpp:37] Loading credentials for authentication from
'/tmp/Endpoint_SlaveEndpointTest_UnauthorizedRequest_0_icoe0b/http_credentials'
I0801 19:11:10.899299 30204 http.cpp:993] Creating default 'basic' HTTP authenticator for
realm 'mesos-agent-executor'
I0801 19:11:10.899420 30204 http.cpp:1014] Creating default 'jwt' HTTP authenticator for realm
'mesos-agent-executor'
I0801 19:11:10.899585 30204 http.cpp:993] Creating default 'basic' HTTP authenticator for
realm 'mesos-agent-readonly'
I0801 19:11:10.899662 30204 http.cpp:1014] Creating default 'jwt' HTTP authenticator for realm
'mesos-agent-readonly'
I0801 19:11:10.899806 30204 http.cpp:993] Creating default 'basic' HTTP authenticator for
realm 'mesos-agent-readwrite'
I0801 19:11:10.899884 30204 http.cpp:1014] Creating default 'jwt' HTTP authenticator for realm
'mesos-agent-readwrite'
I0801 19:11:10.901227 30204 slave.cpp:565] Agent resources: [{"name":"cpus","scalar":{"value":2.0},"type":"SCALAR"},{"name":"mem","scalar":{"value":1024.0},"type":"SCALAR"},{"name":"disk","scalar":{"value":1024.0},"type":"SCALAR"},{"name":"ports","ranges":{"range":[{"begin":31000,"end":32000}]},"type":"RANGES"}]
I0801 19:11:10.901451 30204 slave.cpp:573] Agent attributes: [  ]
I0801 19:11:10.901466 30204 slave.cpp:582] Agent hostname: a60d01bc58b3
I0801 19:11:10.901623 30198 status_update_manager.cpp:177] Pausing sending status updates
I0801 19:11:10.903219 30191 state.cpp:64] Recovering state from '/tmp/Endpoint_SlaveEndpointTest_UnauthorizedRequest_0_NumgxJ/meta'
I0801 19:11:10.903553 30192 status_update_manager.cpp:203] Recovering status update manager
I0801 19:11:10.903753 30193 containerizer.cpp:582] Recovering containerizer
I0801 19:11:10.905283 30211 provisioner.cpp:416] Provisioner recovery complete
I0801 19:11:10.905670 30201 slave.cpp:6207] Finished recovery
I0801 19:11:10.906344 30201 slave.cpp:6389] Querying resource estimator for oversubscribable
resources
I0801 19:11:10.906626 30205 slave.cpp:6403] Received oversubscribable resources {} from the
resource estimator
I0801 19:11:10.909241 30210 process.cpp:3836] Handling HTTP event for process 'slave(799)'
with path: '/slave(799)/monitor/statistics'
I0801 19:11:10.911133 30209 http.cpp:1133] HTTP GET for /slave(799)/monitor/statistics from
172.17.0.6:41750
I0801 19:11:10.911211 30209 http.cpp:957] Authorizing principal 'test-principal' to GET the
'/monitor/statistics' endpoint
I0801 19:11:10.912737 30205 slave.cpp:843] Agent terminating
[       OK ] Endpoint/SlaveEndpointTest.UnauthorizedRequest/0 (29 ms)
[ RUN      ] Endpoint/SlaveEndpointTest.UnauthorizedRequest/1
I0801 19:11:10.924700  9348 containerizer.cpp:230] Using isolation: posix/cpu,posix/mem,filesystem/posix,network/cni,environment_secret
W0801 19:11:10.925211  9348 backend.cpp:76] Failed to create 'aufs' backend: AufsBackend requires
root privileges
W0801 19:11:10.925325  9348 backend.cpp:76] Failed to create 'bind' backend: BindBackend requires
root privileges
I0801 19:11:10.925359  9348 provisioner.cpp:255] Using default backend 'copy'
I0801 19:11:10.929150 30193 slave.cpp:250] Mesos agent started on (800)@172.17.0.6:39757
I0801 19:11:10.929170 30193 slave.cpp:251] Flags at startup: --acls="" --appc_simple_discovery_uri_prefix="http://"
--appc_store_dir="/tmp/Endpoint_SlaveEndpointTest_UnauthorizedRequest_1_sPk361/store/appc"
--authenticate_http_executors="true" --authenticate_http_readonly="true" --authenticate_http_readwrite="true"
--authenticatee="crammd5" --authentication_backoff_factor="1secs" --authorizer="local" --cgroups_cpu_enable_pids_and_tids_count="false"
--cgroups_enable_cfs="false" --cgroups_hierarchy="/sys/fs/cgroup" --cgroups_limit_swap="false"
--cgroups_root="mesos" --container_disk_watch_interval="15secs" --containerizers="mesos" --credential="/tmp/Endpoint_SlaveEndpointTest_UnauthorizedRequest_1_sPk361/credential"
--default_role="*" --disk_watch_interval="1mins" --docker="docker" --docker_kill_orphans="true"
--docker_registry="https://registry-1.docker.io" --docker_remove_delay="6hrs" --docker_socket="/var/run/docker.sock"
--docker_stop_timeout="0ns" --docker_store_dir="/tmp/Endpoint_SlaveEndpointTest_UnauthorizedRequest_1_sPk361/store/docker"
--docker_volume_checkpoint_dir="/var/run/mesos/isolators/docker/volume" --enforce_container_disk_quota="false"
--executor_registration_timeout="1mins" --executor_reregistration_timeout="2secs" --executor_secret_key="/tmp/Endpoint_SlaveEndpointTest_UnauthorizedRequest_1_sPk361/executor_secret_key"
--executor_shutdown_grace_period="5secs" --fetcher_cache_dir="/tmp/Endpoint_SlaveEndpointTest_UnauthorizedRequest_1_sPk361/fetch"
--fetcher_cache_size="2GB" --frameworks_home="" --gc_delay="1weeks" --gc_disk_headroom="0.1"
--hadoop_home="" --help="false" --hostname_lookup="true" --http_command_executor="false" --http_credentials="/tmp/Endpoint_SlaveEndpointTest_UnauthorizedRequest_1_sPk361/http_credentials"
--http_heartbeat_interval="30secs" --initialize_driver_logging="true" --isolation="posix/cpu,posix/mem"
--launcher="posix" --launcher_dir="/mesos/mesos-1.4.0/_build/src" --logbufsecs="0" --logging_level="INFO"
--max_completed_executors_per_framework="150" --oversubscribed_resources_interval="15secs"
--perf_duration="10secs" --perf_interval="1mins" --port="5051" --qos_correction_interval_min="0ns"
--quiet="false" --recover="reconnect" --recovery_timeout="15mins" --registration_backoff_factor="10ms"
--resources="cpus:2;gpus:0;mem:1024;disk:1024;ports:[31000-32000]" --revocable_cpu_low_priority="true"
--runtime_dir="/tmp/Endpoint_SlaveEndpointTest_UnauthorizedRequest_1_sPk361" --sandbox_directory="/mnt/mesos/sandbox"
--strict="true" --switch_user="true" --systemd_enable_support="true" --systemd_runtime_directory="/run/systemd/system"
--version="false" --work_dir="/tmp/Endpoint_SlaveEndpointTest_UnauthorizedRequest_1_TzQEzz"
I0801 19:11:10.929644 30193 credentials.hpp:86] Loading credential for authentication from
'/tmp/Endpoint_SlaveEndpointTest_UnauthorizedRequest_1_sPk361/credential'
I0801 19:11:10.929811 30193 slave.cpp:283] Agent using credential for: test-principal
I0801 19:11:10.929841 30193 credentials.hpp:37] Loading credentials for authentication from
'/tmp/Endpoint_SlaveEndpointTest_UnauthorizedRequest_1_sPk361/http_credentials'
I0801 19:11:10.930147 30193 http.cpp:993] Creating default 'basic' HTTP authenticator for
realm 'mesos-agent-executor'
I0801 19:11:10.930301 30193 http.cpp:1014] Creating default 'jwt' HTTP authenticator for realm
'mesos-agent-executor'
I0801 19:11:10.930491 30193 http.cpp:993] Creating default 'basic' HTTP authenticator for
realm 'mesos-agent-readonly'
I0801 19:11:10.930577 30193 http.cpp:1014] Creating default 'jwt' HTTP authenticator for realm
'mesos-agent-readonly'
I0801 19:11:10.930718 30193 http.cpp:993] Creating default 'basic' HTTP authenticator for
realm 'mesos-agent-readwrite'
I0801 19:11:10.930793 30193 http.cpp:1014] Creating default 'jwt' HTTP authenticator for realm
'mesos-agent-readwrite'
I0801 19:11:10.932134 30193 slave.cpp:565] Agent resources: [{"name":"cpus","scalar":{"value":2.0},"type":"SCALAR"},{"name":"mem","scalar":{"value":1024.0},"type":"SCALAR"},{"name":"disk","scalar":{"value":1024.0},"type":"SCALAR"},{"name":"ports","ranges":{"range":[{"begin":31000,"end":32000}]},"type":"RANGES"}]
I0801 19:11:10.932366 30193 slave.cpp:573] Agent attributes: [  ]
I0801 19:11:10.932381 30193 slave.cpp:582] Agent hostname: a60d01bc58b3
I0801 19:11:10.932507 30211 status_update_manager.cpp:177] Pausing sending status updates
I0801 19:11:10.934059 30205 state.cpp:64] Recovering state from '/tmp/Endpoint_SlaveEndpointTest_UnauthorizedRequest_1_TzQEzz/meta'
I0801 19:11:10.934391 30201 status_update_manager.cpp:203] Recovering status update manager
I0801 19:11:10.934576 30195 containerizer.cpp:582] Recovering containerizer
I0801 19:11:10.936007 30209 provisioner.cpp:416] Provisioner recovery complete
I0801 19:11:10.936338 30214 slave.cpp:6207] Finished recovery
I0801 19:11:10.936906 30214 slave.cpp:6389] Querying resource estimator for oversubscribable
resources
I0801 19:11:10.937170 30198 slave.cpp:6403] Received oversubscribable resources {} from the
resource estimator
I0801 19:11:10.939630 30211 process.cpp:3836] Handling HTTP event for process 'slave(800)'
with path: '/slave(800)/monitor/statistics.json'
I0801 19:11:10.941679 30196 http.cpp:1133] HTTP GET for /slave(800)/monitor/statistics.json
from 172.17.0.6:41752
I0801 19:11:10.941756 30196 http.cpp:957] Authorizing principal 'test-principal' to GET the
'/monitor/statistics.json' endpoint
I0801 19:11:10.943464  9348 slave.cpp:843] Agent terminating
[       OK ] Endpoint/SlaveEndpointTest.UnauthorizedRequest/1 (30 ms)
[ RUN      ] Endpoint/SlaveEndpointTest.UnauthorizedRequest/2
I0801 19:11:10.954196  9348 containerizer.cpp:230] Using isolation: posix/cpu,posix/mem,filesystem/posix,network/cni,environment_secret
W0801 19:11:10.954747  9348 backend.cpp:76] Failed to create 'aufs' backend: AufsBackend requires
root privileges
W0801 19:11:10.954852  9348 backend.cpp:76] Failed to create 'bind' backend: BindBackend requires
root privileges
I0801 19:11:10.954893  9348 provisioner.cpp:255] Using default backend 'copy'
I0801 19:11:10.957898 30205 slave.cpp:250] Mesos agent started on (801)@172.17.0.6:39757
I0801 19:11:10.957921 30205 slave.cpp:251] Flags at startup: --acls="" --appc_simple_discovery_uri_prefix="http://"
--appc_store_dir="/tmp/Endpoint_SlaveEndpointTest_UnauthorizedRequest_2_0FBKvS/store/appc"
--authenticate_http_executors="true" --authenticate_http_readonly="true" --authenticate_http_readwrite="true"
--authenticatee="crammd5" --authentication_backoff_factor="1secs" --authorizer="local" --cgroups_cpu_enable_pids_and_tids_count="false"
--cgroups_enable_cfs="false" --cgroups_hierarchy="/sys/fs/cgroup" --cgroups_limit_swap="false"
--cgroups_root="mesos" --container_disk_watch_interval="15secs" --containerizers="mesos" --credential="/tmp/Endpoint_SlaveEndpointTest_UnauthorizedRequest_2_0FBKvS/credential"
--default_role="*" --disk_watch_interval="1mins" --docker="docker" --docker_kill_orphans="true"
--docker_registry="https://registry-1.docker.io" --docker_remove_delay="6hrs" --docker_socket="/var/run/docker.sock"
--docker_stop_timeout="0ns" --docker_store_dir="/tmp/Endpoint_SlaveEndpointTest_UnauthorizedRequest_2_0FBKvS/store/docker"
--docker_volume_checkpoint_dir="/var/run/mesos/isolators/docker/volume" --enforce_container_disk_quota="false"
--executor_registration_timeout="1mins" --executor_reregistration_timeout="2secs" --executor_secret_key="/tmp/Endpoint_SlaveEndpointTest_UnauthorizedRequest_2_0FBKvS/executor_secret_key"
--executor_shutdown_grace_period="5secs" --fetcher_cache_dir="/tmp/Endpoint_SlaveEndpointTest_UnauthorizedRequest_2_0FBKvS/fetch"
--fetcher_cache_size="2GB" --frameworks_home="" --gc_delay="1weeks" --gc_disk_headroom="0.1"
--hadoop_home="" --help="false" --hostname_lookup="true" --http_command_executor="false" --http_credentials="/tmp/Endpoint_SlaveEndpointTest_UnauthorizedRequest_2_0FBKvS/http_credentials"
--http_heartbeat_interval="30secs" --initialize_driver_logging="true" --isolation="posix/cpu,posix/mem"
--launcher="posix" --launcher_dir="/mesos/mesos-1.4.0/_build/src" --logbufsecs="0" --logging_level="INFO"
--max_completed_executors_per_framework="150" --oversubscribed_resources_interval="15secs"
--perf_duration="10secs" --perf_interval="1mins" --port="5051" --qos_correction_interval_min="0ns"
--quiet="false" --recover="reconnect" --recovery_timeout="15mins" --registration_backoff_factor="10ms"
--resources="cpus:2;gpus:0;mem:1024;disk:1024;ports:[31000-32000]" --revocable_cpu_low_priority="true"
--runtime_dir="/tmp/Endpoint_SlaveEndpointTest_UnauthorizedRequest_2_0FBKvS" --sandbox_directory="/mnt/mesos/sandbox"
--strict="true" --switch_user="true" --systemd_enable_support="true" --systemd_runtime_directory="/run/systemd/system"
--version="false" --work_dir="/tmp/Endpoint_SlaveEndpointTest_UnauthorizedRequest_2_BlhWTp"
I0801 19:11:10.958531 30205 credentials.hpp:86] Loading credential for authentication from
'/tmp/Endpoint_SlaveEndpointTest_UnauthorizedRequest_2_0FBKvS/credential'
I0801 19:11:10.958751 30205 slave.cpp:283] Agent using credential for: test-principal
I0801 19:11:10.958789 30205 credentials.hpp:37] Loading credentials for authentication from
'/tmp/Endpoint_SlaveEndpointTest_UnauthorizedRequest_2_0FBKvS/http_credentials'
I0801 19:11:10.959174 30205 http.cpp:993] Creating default 'basic' HTTP authenticator for
realm 'mesos-agent-executor'
I0801 19:11:10.959337 30205 http.cpp:1014] Creating default 'jwt' HTTP authenticator for realm
'mesos-agent-executor'
I0801 19:11:10.959566 30205 http.cpp:993] Creating default 'basic' HTTP authenticator for
realm 'mesos-agent-readonly'
I0801 19:11:10.959666 30205 http.cpp:1014] Creating default 'jwt' HTTP authenticator for realm
'mesos-agent-readonly'
I0801 19:11:10.959867 30205 http.cpp:993] Creating default 'basic' HTTP authenticator for
realm 'mesos-agent-readwrite'
I0801 19:11:10.959969 30205 http.cpp:1014] Creating default 'jwt' HTTP authenticator for realm
'mesos-agent-readwrite'
I0801 19:11:10.961819 30205 slave.cpp:565] Agent resources: [{"name":"cpus","scalar":{"value":2.0},"type":"SCALAR"},{"name":"mem","scalar":{"value":1024.0},"type":"SCALAR"},{"name":"disk","scalar":{"value":1024.0},"type":"SCALAR"},{"name":"ports","ranges":{"range":[{"begin":31000,"end":32000}]},"type":"RANGES"}]
I0801 19:11:10.962045 30205 slave.cpp:573] Agent attributes: [  ]
I0801 19:11:10.962064 30205 slave.cpp:582] Agent hostname: a60d01bc58b3
I0801 19:11:10.962244 30193 status_update_manager.cpp:177] Pausing sending status updates
I0801 19:11:10.964304 30199 state.cpp:64] Recovering state from '/tmp/Endpoint_SlaveEndpointTest_UnauthorizedRequest_2_BlhWTp/meta'
I0801 19:11:10.964596 30212 status_update_manager.cpp:203] Recovering status update manager
I0801 19:11:10.964767 30198 containerizer.cpp:582] Recovering containerizer
I0801 19:11:10.966106 30214 provisioner.cpp:416] Provisioner recovery complete
I0801 19:11:10.966514 30209 slave.cpp:6207] Finished recovery
I0801 19:11:10.967074 30209 slave.cpp:6389] Querying resource estimator for oversubscribable
resources
I0801 19:11:10.967340 30213 slave.cpp:6403] Received oversubscribable resources {} from the
resource estimator
I0801 19:11:10.970000 30208 process.cpp:3836] Handling HTTP event for process 'slave(801)'
with path: '/slave(801)/containers'
I0801 19:11:10.971918 30212 http.cpp:1133] HTTP GET for /slave(801)/containers from 172.17.0.6:41754
I0801 19:11:10.972007 30212 http.cpp:957] Authorizing principal 'test-principal' to GET the
'/containers' endpoint
I0801 19:11:10.973755 30196 slave.cpp:843] Agent terminating
[       OK ] Endpoint/SlaveEndpointTest.UnauthorizedRequest/2 (30 ms)
[ RUN      ] Endpoint/SlaveEndpointTest.NoAuthorizer/0
I0801 19:11:10.984583  9348 containerizer.cpp:230] Using isolation: posix/cpu,posix/mem,filesystem/posix,network/cni,environment_secret
W0801 19:11:10.985100  9348 backend.cpp:76] Failed to create 'aufs' backend: AufsBackend requires
root privileges
W0801 19:11:10.985208  9348 backend.cpp:76] Failed to create 'bind' backend: BindBackend requires
root privileges
I0801 19:11:10.985250  9348 provisioner.cpp:255] Using default backend 'copy'
I0801 19:11:10.986776  9348 cluster.cpp:448] Creating default 'local' authorizer
I0801 19:11:10.988422 30212 slave.cpp:250] Mesos agent started on (802)@172.17.0.6:39757
I0801 19:11:10.988445 30212 slave.cpp:251] Flags at startup: --acls="" --appc_simple_discovery_uri_prefix="http://"
--appc_store_dir="/tmp/Endpoint_SlaveEndpointTest_NoAuthorizer_0_QpxxcJ/store/appc" --authenticate_http_executors="true"
--authenticate_http_readonly="true" --authenticate_http_readwrite="true" --authenticatee="crammd5"
--authentication_backoff_factor="1secs" --authorizer="local" --cgroups_cpu_enable_pids_and_tids_count="false"
--cgroups_enable_cfs="false" --cgroups_hierarchy="/sys/fs/cgroup" --cgroups_limit_swap="false"
--cgroups_root="mesos" --container_disk_watch_interval="15secs" --containerizers="mesos" --credential="/tmp/Endpoint_SlaveEndpointTest_NoAuthorizer_0_QpxxcJ/credential"
--default_role="*" --disk_watch_interval="1mins" --docker="docker" --docker_kill_orphans="true"
--docker_registry="https://registry-1.docker.io" --docker_remove_delay="6hrs" --docker_socket="/var/run/docker.sock"
--docker_stop_timeout="0ns" --docker_store_dir="/tmp/Endpoint_SlaveEndpointTest_NoAuthorizer_0_QpxxcJ/store/docker"
--docker_volume_checkpoint_dir="/var/run/mesos/isolators/docker/volume" --enforce_container_disk_quota="false"
--executor_registration_timeout="1mins" --executor_reregistration_timeout="2secs" --executor_secret_key="/tmp/Endpoint_SlaveEndpointTest_NoAuthorizer_0_QpxxcJ/executor_secret_key"
--executor_shutdown_grace_period="5secs" --fetcher_cache_dir="/tmp/Endpoint_SlaveEndpointTest_NoAuthorizer_0_QpxxcJ/fetch"
--fetcher_cache_size="2GB" --frameworks_home="" --gc_delay="1weeks" --gc_disk_headroom="0.1"
--hadoop_home="" --help="false" --hostname_lookup="true" --http_command_executor="false" --http_credentials="/tmp/Endpoint_SlaveEndpointTest_NoAuthorizer_0_QpxxcJ/http_credentials"
--http_heartbeat_interval="30secs" --initialize_driver_logging="true" --isolation="posix/cpu,posix/mem"
--launcher="posix" --launcher_dir="/mesos/mesos-1.4.0/_build/src" --logbufsecs="0" --logging_level="INFO"
--max_completed_executors_per_framework="150" --oversubscribed_resources_interval="15secs"
--perf_duration="10secs" --perf_interval="1mins" --port="5051" --qos_correction_interval_min="0ns"
--quiet="false" --recover="reconnect" --recovery_timeout="15mins" --registration_backoff_factor="10ms"
--resources="cpus:2;gpus:0;mem:1024;disk:1024;ports:[31000-32000]" --revocable_cpu_low_priority="true"
--runtime_dir="/tmp/Endpoint_SlaveEndpointTest_NoAuthorizer_0_QpxxcJ" --sandbox_directory="/mnt/mesos/sandbox"
--strict="true" --switch_user="true" --systemd_enable_support="true" --systemd_runtime_directory="/run/systemd/system"
--version="false" --work_dir="/tmp/Endpoint_SlaveEndpointTest_NoAuthorizer_0_fWAcwg"
I0801 19:11:10.988894 30212 credentials.hpp:86] Loading credential for authentication from
'/tmp/Endpoint_SlaveEndpointTest_NoAuthorizer_0_QpxxcJ/credential'
I0801 19:11:10.989065 30212 slave.cpp:283] Agent using credential for: test-principal
I0801 19:11:10.989090 30212 credentials.hpp:37] Loading credentials for authentication from
'/tmp/Endpoint_SlaveEndpointTest_NoAuthorizer_0_QpxxcJ/http_credentials'
I0801 19:11:10.989403 30212 http.cpp:993] Creating default 'basic' HTTP authenticator for
realm 'mesos-agent-executor'
I0801 19:11:10.989539 30212 http.cpp:1014] Creating default 'jwt' HTTP authenticator for realm
'mesos-agent-executor'
I0801 19:11:10.989713 30212 http.cpp:993] Creating default 'basic' HTTP authenticator for
realm 'mesos-agent-readonly'
I0801 19:11:10.989799 30212 http.cpp:1014] Creating default 'jwt' HTTP authenticator for realm
'mesos-agent-readonly'
I0801 19:11:10.989949 30212 http.cpp:993] Creating default 'basic' HTTP authenticator for
realm 'mesos-agent-readwrite'
I0801 19:11:10.990041 30212 http.cpp:1014] Creating default 'jwt' HTTP authenticator for realm
'mesos-agent-readwrite'
I0801 19:11:10.991376 30212 slave.cpp:565] Agent resources: [{"name":"cpus","scalar":{"value":2.0},"type":"SCALAR"},{"name":"mem","scalar":{"value":1024.0},"type":"SCALAR"},{"name":"disk","scalar":{"value":1024.0},"type":"SCALAR"},{"name":"ports","ranges":{"range":[{"begin":31000,"end":32000}]},"type":"RANGES"}]
I0801 19:11:10.991596 30212 slave.cpp:573] Agent attributes: [  ]
I0801 19:11:10.991612 30212 slave.cpp:582] Agent hostname: a60d01bc58b3
I0801 19:11:10.991742 30214 status_update_manager.cpp:177] Pausing sending status updates
I0801 19:11:10.993316 30207 state.cpp:64] Recovering state from '/tmp/Endpoint_SlaveEndpointTest_NoAuthorizer_0_fWAcwg/meta'
I0801 19:11:10.993612 30213 status_update_manager.cpp:203] Recovering status update manager
I0801 19:11:10.993815 30204 containerizer.cpp:582] Recovering containerizer
I0801 19:11:10.995187 30202 provisioner.cpp:416] Provisioner recovery complete
I0801 19:11:10.995543 30201 slave.cpp:6207] Finished recovery
I0801 19:11:10.996060 30201 slave.cpp:6389] Querying resource estimator for oversubscribable
resources
I0801 19:11:10.996386 30194 slave.cpp:6403] Received oversubscribable resources {} from the
resource estimator
I0801 19:11:10.998924 30197 process.cpp:3836] Handling HTTP event for process 'slave(802)'
with path: '/slave(802)/monitor/statistics'
I0801 19:11:11.000828 30206 http.cpp:1133] HTTP GET for /slave(802)/monitor/statistics from
172.17.0.6:41756
I0801 19:11:11.000912 30206 http.cpp:957] Authorizing principal 'test-principal' to GET the
'/monitor/statistics' endpoint
I0801 19:11:11.003738 30204 slave.cpp:843] Agent terminating
[       OK ] Endpoint/SlaveEndpointTest.NoAuthorizer/0 (30 ms)
[ RUN      ] Endpoint/SlaveEndpointTest.NoAuthorizer/1
I0801 19:11:11.015745  9348 containerizer.cpp:230] Using isolation: posix/cpu,posix/mem,filesystem/posix,network/cni,environment_secret
W0801 19:11:11.016340  9348 backend.cpp:76] Failed to create 'aufs' backend: AufsBackend requires
root privileges
W0801 19:11:11.016474  9348 backend.cpp:76] Failed to create 'bind' backend: BindBackend requires
root privileges
I0801 19:11:11.016516  9348 provisioner.cpp:255] Using default backend 'copy'
I0801 19:11:11.018134  9348 cluster.cpp:448] Creating default 'local' authorizer
I0801 19:11:11.019721 30211 slave.cpp:250] Mesos agent started on (803)@172.17.0.6:39757
I0801 19:11:11.019749 30211 slave.cpp:251] Flags at startup: --acls="" --appc_simple_discovery_uri_prefix="http://"
--appc_store_dir="/tmp/Endpoint_SlaveEndpointTest_NoAuthorizer_1_mTHtbA/store/appc" --authenticate_http_executors="true"
--authenticate_http_readonly="true" --authenticate_http_readwrite="true" --authenticatee="crammd5"
--authentication_backoff_factor="1secs" --authorizer="local" --cgroups_cpu_enable_pids_and_tids_count="false"
--cgroups_enable_cfs="false" --cgroups_hierarchy="/sys/fs/cgroup" --cgroups_limit_swap="false"
--cgroups_root="mesos" --container_disk_watch_interval="15secs" --containerizers="mesos" --credential="/tmp/Endpoint_SlaveEndpointTest_NoAuthorizer_1_mTHtbA/credential"
--default_role="*" --disk_watch_interval="1mins" --docker="docker" --docker_kill_orphans="true"
--docker_registry="https://registry-1.docker.io" --docker_remove_delay="6hrs" --docker_socket="/var/run/docker.sock"
--docker_stop_timeout="0ns" --docker_store_dir="/tmp/Endpoint_SlaveEndpointTest_NoAuthorizer_1_mTHtbA/store/docker"
--docker_volume_checkpoint_dir="/var/run/mesos/isolators/docker/volume" --enforce_container_disk_quota="false"
--executor_registration_timeout="1mins" --executor_reregistration_timeout="2secs" --executor_secret_key="/tmp/Endpoint_SlaveEndpointTest_NoAuthorizer_1_mTHtbA/executor_secret_key"
--executor_shutdown_grace_period="5secs" --fetcher_cache_dir="/tmp/Endpoint_SlaveEndpointTest_NoAuthorizer_1_mTHtbA/fetch"
--fetcher_cache_size="2GB" --frameworks_home="" --gc_delay="1weeks" --gc_disk_headroom="0.1"
--hadoop_home="" --help="false" --hostname_lookup="true" --http_command_executor="false" --http_credentials="/tmp/Endpoint_SlaveEndpointTest_NoAuthorizer_1_mTHtbA/http_credentials"
--http_heartbeat_interval="30secs" --initialize_driver_logging="true" --isolation="posix/cpu,posix/mem"
--launcher="posix" --launcher_dir="/mesos/mesos-1.4.0/_build/src" --logbufsecs="0" --logging_level="INFO"
--max_completed_executors_per_framework="150" --oversubscribed_resources_interval="15secs"
--perf_duration="10secs" --perf_interval="1mins" --port="5051" --qos_correction_interval_min="0ns"
--quiet="false" --recover="reconnect" --recovery_timeout="15mins" --registration_backoff_factor="10ms"
--resources="cpus:2;gpus:0;mem:1024;disk:1024;ports:[31000-32000]" --revocable_cpu_low_priority="true"
--runtime_dir="/tmp/Endpoint_SlaveEndpointTest_NoAuthorizer_1_mTHtbA" --sandbox_directory="/mnt/mesos/sandbox"
--strict="true" --switch_user="true" --systemd_enable_support="true" --systemd_runtime_directory="/run/systemd/system"
--version="false" --work_dir="/tmp/Endpoint_SlaveEndpointTest_NoAuthorizer_1_x1Bwq7"
I0801 19:11:11.020169 30211 credentials.hpp:86] Loading credential for authentication from
'/tmp/Endpoint_SlaveEndpointTest_NoAuthorizer_1_mTHtbA/credential'
I0801 19:11:11.020354 30211 slave.cpp:283] Agent using credential for: test-principal
I0801 19:11:11.020382 30211 credentials.hpp:37] Loading credentials for authentication from
'/tmp/Endpoint_SlaveEndpointTest_NoAuthorizer_1_mTHtbA/http_credentials'
I0801 19:11:11.020658 30211 http.cpp:993] Creating default 'basic' HTTP authenticator for
realm 'mesos-agent-executor'
I0801 19:11:11.020784 30211 http.cpp:1014] Creating default 'jwt' HTTP authenticator for realm
'mesos-agent-executor'
I0801 19:11:11.020956 30211 http.cpp:993] Creating default 'basic' HTTP authenticator for
realm 'mesos-agent-readonly'
I0801 19:11:11.021030 30211 http.cpp:1014] Creating default 'jwt' HTTP authenticator for realm
'mesos-agent-readonly'
I0801 19:11:11.021158 30211 http.cpp:993] Creating default 'basic' HTTP authenticator for
realm 'mesos-agent-readwrite'
I0801 19:11:11.021232 30211 http.cpp:1014] Creating default 'jwt' HTTP authenticator for realm
'mesos-agent-readwrite'
I0801 19:11:11.023195 30211 slave.cpp:565] Agent resources: [{"name":"cpus","scalar":{"value":2.0},"type":"SCALAR"},{"name":"mem","scalar":{"value":1024.0},"type":"SCALAR"},{"name":"disk","scalar":{"value":1024.0},"type":"SCALAR"},{"name":"ports","ranges":{"range":[{"begin":31000,"end":32000}]},"type":"RANGES"}]
I0801 19:11:11.023537 30211 slave.cpp:573] Agent attributes: [  ]
I0801 19:11:11.023558 30211 slave.cpp:582] Agent hostname: a60d01bc58b3
I0801 19:11:11.023725 30212 status_update_manager.cpp:177] Pausing sending status updates
I0801 19:11:11.025723 30210 state.cpp:64] Recovering state from '/tmp/Endpoint_SlaveEndpointTest_NoAuthorizer_1_x1Bwq7/meta'
I0801 19:11:11.026031 30195 status_update_manager.cpp:203] Recovering status update manager
I0801 19:11:11.026234 30197 containerizer.cpp:582] Recovering containerizer
I0801 19:11:11.027609 30194 provisioner.cpp:416] Provisioner recovery complete
I0801 19:11:11.027964 30198 slave.cpp:6207] Finished recovery
I0801 19:11:11.028568 30198 slave.cpp:6389] Querying resource estimator for oversubscribable
resources
I0801 19:11:11.028861 30202 slave.cpp:6403] Received oversubscribable resources {} from the
resource estimator
I0801 19:11:11.031401 30209 process.cpp:3836] Handling HTTP event for process 'slave(803)'
with path: '/slave(803)/monitor/statistics.json'
I0801 19:11:11.033161 30196 http.cpp:1133] HTTP GET for /slave(803)/monitor/statistics.json
from 172.17.0.6:41758
I0801 19:11:11.033257 30196 http.cpp:957] Authorizing principal 'test-principal' to GET the
'/monitor/statistics.json' endpoint
I0801 19:11:11.035981 30207 slave.cpp:843] Agent terminating
[       OK ] Endpoint/SlaveEndpointTest.NoAuthorizer/1 (34 ms)
[ RUN      ] Endpoint/SlaveEndpointTest.NoAuthorizer/2
I0801 19:11:11.052661  9348 containerizer.cpp:230] Using isolation: posix/cpu,posix/mem,filesystem/posix,network/cni,environment_secret
W0801 19:11:11.053385  9348 backend.cpp:76] Failed to create 'aufs' backend: AufsBackend requires
root privileges
W0801 19:11:11.053526  9348 backend.cpp:76] Failed to create 'bind' backend: BindBackend requires
root privileges
I0801 19:11:11.053575  9348 provisioner.cpp:255] Using default backend 'copy'
I0801 19:11:11.055806  9348 cluster.cpp:448] Creating default 'local' authorizer
I0801 19:11:11.057984 30211 slave.cpp:250] Mesos agent started on (804)@172.17.0.6:39757
I0801 19:11:11.058017 30211 slave.cpp:251] Flags at startup: --acls="" --appc_simple_discovery_uri_prefix="http://"
--appc_store_dir="/tmp/Endpoint_SlaveEndpointTest_NoAuthorizer_2_AeEZur/store/appc" --authenticate_http_executors="true"
--authenticate_http_readonly="true" --authenticate_http_readwrite="true" --authenticatee="crammd5"
--authentication_backoff_factor="1secs" --authorizer="local" --cgroups_cpu_enable_pids_and_tids_count="false"
--cgroups_enable_cfs="false" --cgroups_hierarchy="/sys/fs/cgroup" --cgroups_limit_swap="false"
--cgroups_root="mesos" --container_disk_watch_interval="15secs" --containerizers="mesos" --credential="/tmp/Endpoint_SlaveEndpointTest_NoAuthorizer_2_AeEZur/credential"
--default_role="*" --disk_watch_interval="1mins" --docker="docker" --docker_kill_orphans="true"
--docker_registry="https://registry-1.docker.io" --docker_remove_delay="6hrs" --docker_socket="/var/run/docker.sock"
--docker_stop_timeout="0ns" --docker_store_dir="/tmp/Endpoint_SlaveEndpointTest_NoAuthorizer_2_AeEZur/store/docker"
--docker_volume_checkpoint_dir="/var/run/mesos/isolators/docker/volume" --enforce_container_disk_quota="false"
--executor_registration_timeout="1mins" --executor_reregistration_timeout="2secs" --executor_secret_key="/tmp/Endpoint_SlaveEndpointTest_NoAuthorizer_2_AeEZur/executor_secret_key"
--executor_shutdown_grace_period="5secs" --fetcher_cache_dir="/tmp/Endpoint_SlaveEndpointTest_NoAuthorizer_2_AeEZur/fetch"
--fetcher_cache_size="2GB" --frameworks_home="" --gc_delay="1weeks" --gc_disk_headroom="0.1"
--hadoop_home="" --help="false" --hostname_lookup="true" --http_command_executor="false" --http_credentials="/tmp/Endpoint_SlaveEndpointTest_NoAuthorizer_2_AeEZur/http_credentials"
--http_heartbeat_interval="30secs" --initialize_driver_logging="true" --isolation="posix/cpu,posix/mem"
--launcher="posix" --launcher_dir="/mesos/mesos-1.4.0/_build/src" --logbufsecs="0" --logging_level="INFO"
--max_completed_executors_per_framework="150" --oversubscribed_resources_interval="15secs"
--perf_duration="10secs" --perf_interval="1mins" --port="5051" --qos_correction_interval_min="0ns"
--quiet="false" --recover="reconnect" --recovery_timeout="15mins" --registration_backoff_factor="10ms"
--resources="cpus:2;gpus:0;mem:1024;disk:1024;ports:[31000-32000]" --revocable_cpu_low_priority="true"
--runtime_dir="/tmp/Endpoint_SlaveEndpointTest_NoAuthorizer_2_AeEZur" --sandbox_directory="/mnt/mesos/sandbox"
--strict="true" --switch_user="true" --systemd_enable_support="true" --systemd_runtime_directory="/run/systemd/system"
--version="false" --work_dir="/tmp/Endpoint_SlaveEndpointTest_NoAuthorizer_2_FSwKEY"
I0801 19:11:11.058591 30211 credentials.hpp:86] Loading credential for authentication from
'/tmp/Endpoint_SlaveEndpointTest_NoAuthorizer_2_AeEZur/credential'
I0801 19:11:11.058835 30211 slave.cpp:283] Agent using credential for: test-principal
I0801 19:11:11.058878 30211 credentials.hpp:37] Loading credentials for authentication from
'/tmp/Endpoint_SlaveEndpointTest_NoAuthorizer_2_AeEZur/http_credentials'
I0801 19:11:11.059222 30211 http.cpp:993] Creating default 'basic' HTTP authenticator for
realm 'mesos-agent-executor'
I0801 19:11:11.059365 30211 http.cpp:1014] Creating default 'jwt' HTTP authenticator for realm
'mesos-agent-executor'
I0801 19:11:11.059597 30211 http.cpp:993] Creating default 'basic' HTTP authenticator for
realm 'mesos-agent-readonly'
I0801 19:11:11.059731 30211 http.cpp:1014] Creating default 'jwt' HTTP authenticator for realm
'mesos-agent-readonly'
I0801 19:11:11.059991 30211 http.cpp:993] Creating default 'basic' HTTP authenticator for
realm 'mesos-agent-readwrite'
I0801 19:11:11.060128 30211 http.cpp:1014] Creating default 'jwt' HTTP authenticator for realm
'mesos-agent-readwrite'
I0801 19:11:11.062512 30211 slave.cpp:565] Agent resources: [{"name":"cpus","scalar":{"value":2.0},"type":"SCALAR"},{"name":"mem","scalar":{"value":1024.0},"type":"SCALAR"},{"name":"disk","scalar":{"value":1024.0},"type":"SCALAR"},{"name":"ports","ranges":{"range":[{"begin":31000,"end":32000}]},"type":"RANGES"}]
I0801 19:11:11.062805 30211 slave.cpp:573] Agent attributes: [  ]
I0801 19:11:11.062824 30211 slave.cpp:582] Agent hostname: a60d01bc58b3
I0801 19:11:11.063007 30194 status_update_manager.cpp:177] Pausing sending status updates
I0801 19:11:11.064652 30193 state.cpp:64] Recovering state from '/tmp/Endpoint_SlaveEndpointTest_NoAuthorizer_2_FSwKEY/meta'
I0801 19:11:11.065057 30192 status_update_manager.cpp:203] Recovering status update manager
I0801 19:11:11.065273 30214 containerizer.cpp:582] Recovering containerizer
I0801 19:11:11.066817 30212 provisioner.cpp:416] Provisioner recovery complete
I0801 19:11:11.067340 30202 slave.cpp:6207] Finished recovery
I0801 19:11:11.067996 30202 slave.cpp:6389] Querying resource estimator for oversubscribable
resources
I0801 19:11:11.068370 30205 slave.cpp:6403] Received oversubscribable resources {} from the
resource estimator
I0801 19:11:11.071136 30206 process.cpp:3836] Handling HTTP event for process 'slave(804)'
with path: '/slave(804)/containers'
I0801 19:11:11.073349 30193 http.cpp:1133] HTTP GET for /slave(804)/containers from 172.17.0.6:41760
I0801 19:11:11.073454 30193 http.cpp:957] Authorizing principal 'test-principal' to GET the
'/containers' endpoint
I0801 19:11:11.077622 30206 slave.cpp:843] Agent terminating
[       OK ] Endpoint/SlaveEndpointTest.NoAuthorizer/2 (39 ms)
[----------] 9 tests from Endpoint/SlaveEndpointTest (400 ms total)

[----------] Global test environment tear-down
[==========] 1654 tests from 183 test cases ran. (588088 ms total)
[  PASSED  ] 1653 tests.
[  FAILED  ] 1 test, listed below:
[  FAILED  ] CommandExecutorCheckTest.CommandCheckDeliveredAndReconciled

 1 FAILED TEST
  YOU HAVE 20 DISABLED TESTS

I0801 19:11:11.152386 30215 process.cpp:1006] Failed to accept socket: future discarded
make[4]: *** [check-local] Error 1
make[4]: Leaving directory `/mesos/mesos-1.4.0/_build/src'
make[3]: *** [check-am] Error 2
make[3]: Leaving directory `/mesos/mesos-1.4.0/_build/src'
make[2]: *** [check] Error 2
make[2]: Leaving directory `/mesos/mesos-1.4.0/_build/src'
make[1]: *** [check-recursive] Error 1
make[1]: Leaving directory `/mesos/mesos-1.4.0/_build'
make: *** [distcheck] Error 1
+ docker rmi mesos-1501612012-25505
Untagged: mesos-1501612012-25505:latest
Deleted: sha256:f695df16c88aa37814902abecf156de75c5de12bc86d584df94abb3461c62d86
Deleted: sha256:e87eed6f536a4810c4dc996da848a8a25de3c06228d183b5610b2a863f5eee46
Deleted: sha256:6fd3996d67d81781d9621634393dc4a99f0614d33944024b62e6a96270e5267c
Deleted: sha256:f043b07945eff8b8f19cbb7cf142884c9b1f75ab80421f671529604bda7e26fd
Deleted: sha256:f0885329188f49f34a0d78de86b95a6c5ce036a5f75283cb699d2b6ea087b52a
Deleted: sha256:96f751429a75e014fd56174bc51ae02de54b16290a8b06b13ea2e1ce494a2daa
Deleted: sha256:6a41f544037ddf51187e59b246901779f99de5b09a05e9f452381403f94aed03
Deleted: sha256:86efc5f1a6d2ec2190931acacb121a4a18e89f6f3706487660933786825a3c43
Deleted: sha256:b6f20338ee37af1d6c1078a4d67f09dcd65d0b6db4648fb95a956a8f43b84f48
Deleted: sha256:dc02247a530923eecb67cf3f0ef844c91a29d2cdffcd9be3547ec05c518b787c
Deleted: sha256:b14a9da428643220906b207673fa3514358a23220341d8e2589c486e6526d750
Deleted: sha256:7cedeed7a399ecadbaaaaacaebb39c1b42b087e790b2c720c9785101f151307a
Deleted: sha256:4ff3cb9a2c92c4c31daa1ea19b92528459be1c91ecebd86f6af9bb85bd746819
Deleted: sha256:28c3b920e15ae0d1087aceadca215af0adb2e4341eaa1ca4171bb4a2099b8122
Deleted: sha256:f2a30c1a9ccbbeb6a6c0271fc08c743672dd8b6a4ad4a94bced1629cee148bff
Deleted: sha256:cc204f424371dde6e72931593eab8faae4910b233a9f601bfc12bc48da176489
Deleted: sha256:6a4dc99261ad23007dad0ffa693b070b8bf3973a95b7abad470675c2fd9c790a
Deleted: sha256:4e8ad4de1dc81d0aa1416eeb033535fdeaa8a3c21030ca59606f13da024c676a
Deleted: sha256:a14541a53c9685a5ff7cfe4e8926d1dca00d3bf9390507354a0e14944424db15
Deleted: sha256:6970eb48d02b06d3c977367cb8eb111d8f5df09723d82b986d4998ad9b352c71
Deleted: sha256:8fb939f4da35597a4ca309db2412266680530f9fed166bf279022ccd08f88f6e
Deleted: sha256:9b79969bdeef63c2e341165e0a6c1138b1a38c0b55f6e26c5fa24ad516573b3d
Deleted: sha256:f2efcae54376333ae08580b0e4ec23fe37074a785d8ca8b64ca66899648df6e7
Deleted: sha256:7bc01ccfb8a3f990ae3c2bbbe62bfe61da9a168f6469e021c5bca5f173efd0be
Deleted: sha256:8855ba034dd0d63e0084f31c8ba3025441e251447e177e9129b9926e6d831fe6
Build step 'Execute shell' marked build as failure

Mime
View raw message