mesos-builds mailing list archives

Site index · List index
Message view « Date » · « Thread »
Top « Date » · « Thread »
From Apache Jenkins Server <jenk...@builds.apache.org>
Subject Build failed in Jenkins: Mesos-Reviewbot #18899
Date Thu, 17 Aug 2017 11:07:16 GMT
See <https://builds.apache.org/job/Mesos-Reviewbot/18899/display/redirect>

------------------------------------------
[...truncated 31.01 MB...]
I0817 11:07:08.877212  5274 slave.cpp:283] Agent using credential for: test-principal
I0817 11:07:08.877254  5274 credentials.hpp:37] Loading credentials for authentication from
'/tmp/Endpoint_SlaveEndpointTest_AuthorizedRequest_2_jH4xMg/http_credentials'
I0817 11:07:08.877804  5274 http.cpp:1026] Creating default 'basic' HTTP authenticator for
realm 'mesos-agent-readonly'
I0817 11:07:08.878211  5274 http.cpp:1026] Creating default 'basic' HTTP authenticator for
realm 'mesos-agent-readwrite'
I0817 11:07:08.880576  5274 slave.cpp:565] Agent resources: [{"name":"cpus","scalar":{"value":2.0},"type":"SCALAR"},{"name":"mem","scalar":{"value":1024.0},"type":"SCALAR"},{"name":"disk","scalar":{"value":1024.0},"type":"SCALAR"},{"name":"ports","ranges":{"range":[{"begin":31000,"end":32000}]},"type":"RANGES"}]
I0817 11:07:08.881016  5274 slave.cpp:573] Agent attributes: [  ]
I0817 11:07:08.881037  5274 slave.cpp:582] Agent hostname: 9e1a521e7f33
I0817 11:07:08.881359  5270 status_update_manager.cpp:177] Pausing sending status updates
I0817 11:07:08.883659  5271 state.cpp:64] Recovering state from '/tmp/Endpoint_SlaveEndpointTest_AuthorizedRequest_2_gphbM6/meta'
I0817 11:07:08.884521  5273 status_update_manager.cpp:203] Recovering status update manager
I0817 11:07:08.884824  5276 containerizer.cpp:609] Recovering containerizer
I0817 11:07:08.886891  5276 provisioner.cpp:416] Provisioner recovery complete
I0817 11:07:08.887481  5271 slave.cpp:6210] Finished recovery
I0817 11:07:08.888413  5271 slave.cpp:6392] Querying resource estimator for oversubscribable
resources
I0817 11:07:08.889166  5277 slave.cpp:6406] Received oversubscribable resources {} from the
resource estimator
I0817 11:07:08.894681  5277 process.cpp:3933] Handling HTTP event for process 'slave(799)'
with path: '/slave(799)/containers'
I0817 11:07:08.896859  5270 http.cpp:1166] HTTP GET for /slave(799)/containers from 172.17.0.2:36202
I0817 11:07:08.897066  5270 http.cpp:957] Authorizing principal 'test-principal' to GET the
'/containers' endpoint
I0817 11:07:08.928930  5251 slave.cpp:843] Agent terminating
[       OK ] Endpoint/SlaveEndpointTest.AuthorizedRequest/2 (92 ms)
[ RUN      ] Endpoint/SlaveEndpointTest.UnauthorizedRequest/0
I0817 11:07:08.958958  5251 containerizer.cpp:246] Using isolation: posix/cpu,posix/mem,filesystem/posix,network/cni,environment_secret
W0817 11:07:08.959942  5251 backend.cpp:76] Failed to create 'overlay' backend: OverlayBackend
requires root privileges
W0817 11:07:08.960280  5251 backend.cpp:76] Failed to create 'bind' backend: BindBackend requires
root privileges
I0817 11:07:08.960332  5251 provisioner.cpp:255] Using default backend 'copy'
I0817 11:07:08.967170  5277 slave.cpp:250] Mesos agent started on (800)@172.17.0.2:43547
I0817 11:07:08.967213  5277 slave.cpp:251] Flags at startup: --acls="" --appc_simple_discovery_uri_prefix="http://"
--appc_store_dir="/tmp/Endpoint_SlaveEndpointTest_UnauthorizedRequest_0_RsVLAV/store/appc"
--authenticate_http_readonly="true" --authenticate_http_readwrite="true" --authenticatee="crammd5"
--authentication_backoff_factor="1secs" --authorizer="local" --cgroups_cpu_enable_pids_and_tids_count="false"
--cgroups_enable_cfs="false" --cgroups_hierarchy="/sys/fs/cgroup" --cgroups_limit_swap="false"
--cgroups_root="mesos" --container_disk_watch_interval="15secs" --containerizers="mesos" --credential="/tmp/Endpoint_SlaveEndpointTest_UnauthorizedRequest_0_RsVLAV/credential"
--default_role="*" --disallow_sharing_agent_pid_namespace="false" --disk_watch_interval="1mins"
--docker="docker" --docker_kill_orphans="true" --docker_registry="https://registry-1.docker.io"
--docker_remove_delay="6hrs" --docker_socket="/var/run/docker.sock" --docker_stop_timeout="0ns"
--docker_store_dir="/tmp/Endpoint_SlaveEndpointTest_UnauthorizedRequest_0_RsVLAV/store/docker"
--docker_volume_checkpoint_dir="/var/run/mesos/isolators/docker/volume" --enforce_container_disk_quota="false"
--executor_registration_timeout="1mins" --executor_reregistration_timeout="2secs" --executor_shutdown_grace_period="5secs"
--fetcher_cache_dir="/tmp/Endpoint_SlaveEndpointTest_UnauthorizedRequest_0_RsVLAV/fetch" --fetcher_cache_size="2GB"
--frameworks_home="" --gc_delay="1weeks" --gc_disk_headroom="0.1" --hadoop_home="" --help="false"
--hostname_lookup="true" --http_command_executor="false" --http_credentials="/tmp/Endpoint_SlaveEndpointTest_UnauthorizedRequest_0_RsVLAV/http_credentials"
--http_heartbeat_interval="30secs" --initialize_driver_logging="true" --isolation="posix/cpu,posix/mem"
--launcher="posix" --launcher_dir="/mesos/mesos-1.4.0/_build/src" --logbufsecs="0" --logging_level="INFO"
--max_completed_executors_per_framework="150" --oversubscribed_resources_interval="15secs"
--perf_duration="10secs" --perf_interval="1mins" --port="5051" --qos_correction_interval_min="0ns"
--quiet="false" --recover="reconnect" --recovery_timeout="15mins" --registration_backoff_factor="10ms"
--resources="cpus:2;gpus:0;mem:1024;disk:1024;ports:[31000-32000]" --revocable_cpu_low_priority="true"
--runtime_dir="/tmp/Endpoint_SlaveEndpointTest_UnauthorizedRequest_0_RsVLAV" --sandbox_directory="/mnt/mesos/sandbox"
--strict="true" --switch_user="true" --systemd_enable_support="true" --systemd_runtime_directory="/run/systemd/system"
--version="false" --work_dir="/tmp/Endpoint_SlaveEndpointTest_UnauthorizedRequest_0_oJMolL"
I0817 11:07:08.967964  5277 credentials.hpp:86] Loading credential for authentication from
'/tmp/Endpoint_SlaveEndpointTest_UnauthorizedRequest_0_RsVLAV/credential'
I0817 11:07:08.968240  5277 slave.cpp:283] Agent using credential for: test-principal
I0817 11:07:08.968274  5277 credentials.hpp:37] Loading credentials for authentication from
'/tmp/Endpoint_SlaveEndpointTest_UnauthorizedRequest_0_RsVLAV/http_credentials'
I0817 11:07:08.968689  5277 http.cpp:1026] Creating default 'basic' HTTP authenticator for
realm 'mesos-agent-readonly'
I0817 11:07:08.969003  5277 http.cpp:1026] Creating default 'basic' HTTP authenticator for
realm 'mesos-agent-readwrite'
I0817 11:07:08.971245  5277 slave.cpp:565] Agent resources: [{"name":"cpus","scalar":{"value":2.0},"type":"SCALAR"},{"name":"mem","scalar":{"value":1024.0},"type":"SCALAR"},{"name":"disk","scalar":{"value":1024.0},"type":"SCALAR"},{"name":"ports","ranges":{"range":[{"begin":31000,"end":32000}]},"type":"RANGES"}]
I0817 11:07:08.971678  5277 slave.cpp:573] Agent attributes: [  ]
I0817 11:07:08.971698  5277 slave.cpp:582] Agent hostname: 9e1a521e7f33
I0817 11:07:08.971916  5276 status_update_manager.cpp:177] Pausing sending status updates
I0817 11:07:08.974102  5273 state.cpp:64] Recovering state from '/tmp/Endpoint_SlaveEndpointTest_UnauthorizedRequest_0_oJMolL/meta'
I0817 11:07:08.974472  5276 status_update_manager.cpp:203] Recovering status update manager
I0817 11:07:08.974833  5272 containerizer.cpp:609] Recovering containerizer
I0817 11:07:08.977152  5272 provisioner.cpp:416] Provisioner recovery complete
I0817 11:07:08.977697  5271 slave.cpp:6210] Finished recovery
I0817 11:07:08.978652  5271 slave.cpp:6392] Querying resource estimator for oversubscribable
resources
I0817 11:07:08.979301  5273 slave.cpp:6406] Received oversubscribable resources {} from the
resource estimator
I0817 11:07:08.983355  5273 process.cpp:3933] Handling HTTP event for process 'slave(800)'
with path: '/slave(800)/monitor/statistics'
I0817 11:07:08.985532  5276 http.cpp:1166] HTTP GET for /slave(800)/monitor/statistics from
172.17.0.2:36204
I0817 11:07:08.985648  5276 http.cpp:957] Authorizing principal 'test-principal' to GET the
'/monitor/statistics' endpoint
I0817 11:07:08.989158  5274 slave.cpp:843] Agent terminating
[       OK ] Endpoint/SlaveEndpointTest.UnauthorizedRequest/0 (65 ms)
[ RUN      ] Endpoint/SlaveEndpointTest.UnauthorizedRequest/1
I0817 11:07:09.024992  5251 containerizer.cpp:246] Using isolation: posix/cpu,posix/mem,filesystem/posix,network/cni,environment_secret
W0817 11:07:09.025910  5251 backend.cpp:76] Failed to create 'overlay' backend: OverlayBackend
requires root privileges
W0817 11:07:09.026170  5251 backend.cpp:76] Failed to create 'bind' backend: BindBackend requires
root privileges
I0817 11:07:09.026231  5251 provisioner.cpp:255] Using default backend 'copy'
I0817 11:07:09.032990  5270 slave.cpp:250] Mesos agent started on (801)@172.17.0.2:43547
I0817 11:07:09.033031  5270 slave.cpp:251] Flags at startup: --acls="" --appc_simple_discovery_uri_prefix="http://"
--appc_store_dir="/tmp/Endpoint_SlaveEndpointTest_UnauthorizedRequest_1_ZM8w9A/store/appc"
--authenticate_http_readonly="true" --authenticate_http_readwrite="true" --authenticatee="crammd5"
--authentication_backoff_factor="1secs" --authorizer="local" --cgroups_cpu_enable_pids_and_tids_count="false"
--cgroups_enable_cfs="false" --cgroups_hierarchy="/sys/fs/cgroup" --cgroups_limit_swap="false"
--cgroups_root="mesos" --container_disk_watch_interval="15secs" --containerizers="mesos" --credential="/tmp/Endpoint_SlaveEndpointTest_UnauthorizedRequest_1_ZM8w9A/credential"
--default_role="*" --disallow_sharing_agent_pid_namespace="false" --disk_watch_interval="1mins"
--docker="docker" --docker_kill_orphans="true" --docker_registry="https://registry-1.docker.io"
--docker_remove_delay="6hrs" --docker_socket="/var/run/docker.sock" --docker_stop_timeout="0ns"
--docker_store_dir="/tmp/Endpoint_SlaveEndpointTest_UnauthorizedRequest_1_ZM8w9A/store/docker"
--docker_volume_checkpoint_dir="/var/run/mesos/isolators/docker/volume" --enforce_container_disk_quota="false"
--executor_registration_timeout="1mins" --executor_reregistration_timeout="2secs" --executor_shutdown_grace_period="5secs"
--fetcher_cache_dir="/tmp/Endpoint_SlaveEndpointTest_UnauthorizedRequest_1_ZM8w9A/fetch" --fetcher_cache_size="2GB"
--frameworks_home="" --gc_delay="1weeks" --gc_disk_headroom="0.1" --hadoop_home="" --help="false"
--hostname_lookup="true" --http_command_executor="false" --http_credentials="/tmp/Endpoint_SlaveEndpointTest_UnauthorizedRequest_1_ZM8w9A/http_credentials"
--http_heartbeat_interval="30secs" --initialize_driver_logging="true" --isolation="posix/cpu,posix/mem"
--launcher="posix" --launcher_dir="/mesos/mesos-1.4.0/_build/src" --logbufsecs="0" --logging_level="INFO"
--max_completed_executors_per_framework="150" --oversubscribed_resources_interval="15secs"
--perf_duration="10secs" --perf_interval="1mins" --port="5051" --qos_correction_interval_min="0ns"
--quiet="false" --recover="reconnect" --recovery_timeout="15mins" --registration_backoff_factor="10ms"
--resources="cpus:2;gpus:0;mem:1024;disk:1024;ports:[31000-32000]" --revocable_cpu_low_priority="true"
--runtime_dir="/tmp/Endpoint_SlaveEndpointTest_UnauthorizedRequest_1_ZM8w9A" --sandbox_directory="/mnt/mesos/sandbox"
--strict="true" --switch_user="true" --systemd_enable_support="true" --systemd_runtime_directory="/run/systemd/system"
--version="false" --work_dir="/tmp/Endpoint_SlaveEndpointTest_UnauthorizedRequest_1_SYnwJq"
I0817 11:07:09.033735  5270 credentials.hpp:86] Loading credential for authentication from
'/tmp/Endpoint_SlaveEndpointTest_UnauthorizedRequest_1_ZM8w9A/credential'
I0817 11:07:09.034011  5270 slave.cpp:283] Agent using credential for: test-principal
I0817 11:07:09.034041  5270 credentials.hpp:37] Loading credentials for authentication from
'/tmp/Endpoint_SlaveEndpointTest_UnauthorizedRequest_1_ZM8w9A/http_credentials'
I0817 11:07:09.034430  5270 http.cpp:1026] Creating default 'basic' HTTP authenticator for
realm 'mesos-agent-readonly'
I0817 11:07:09.034714  5270 http.cpp:1026] Creating default 'basic' HTTP authenticator for
realm 'mesos-agent-readwrite'
I0817 11:07:09.045482  5270 slave.cpp:565] Agent resources: [{"name":"cpus","scalar":{"value":2.0},"type":"SCALAR"},{"name":"mem","scalar":{"value":1024.0},"type":"SCALAR"},{"name":"disk","scalar":{"value":1024.0},"type":"SCALAR"},{"name":"ports","ranges":{"range":[{"begin":31000,"end":32000}]},"type":"RANGES"}]
I0817 11:07:09.045927  5270 slave.cpp:573] Agent attributes: [  ]
I0817 11:07:09.045948  5270 slave.cpp:582] Agent hostname: 9e1a521e7f33
I0817 11:07:09.046241  5273 status_update_manager.cpp:177] Pausing sending status updates
I0817 11:07:09.048234  5276 state.cpp:64] Recovering state from '/tmp/Endpoint_SlaveEndpointTest_UnauthorizedRequest_1_SYnwJq/meta'
I0817 11:07:09.048781  5277 status_update_manager.cpp:203] Recovering status update manager
I0817 11:07:09.049046  5271 containerizer.cpp:609] Recovering containerizer
I0817 11:07:09.051386  5271 provisioner.cpp:416] Provisioner recovery complete
I0817 11:07:09.051913  5273 slave.cpp:6210] Finished recovery
I0817 11:07:09.052635  5273 slave.cpp:6392] Querying resource estimator for oversubscribable
resources
I0817 11:07:09.052954  5276 slave.cpp:6406] Received oversubscribable resources {} from the
resource estimator
I0817 11:07:09.057819  5273 process.cpp:3933] Handling HTTP event for process 'slave(801)'
with path: '/slave(801)/monitor/statistics.json'
I0817 11:07:09.060163  5276 http.cpp:1166] HTTP GET for /slave(801)/monitor/statistics.json
from 172.17.0.2:36206
I0817 11:07:09.060284  5276 http.cpp:957] Authorizing principal 'test-principal' to GET the
'/monitor/statistics.json' endpoint
I0817 11:07:09.063313  5275 slave.cpp:843] Agent terminating
[       OK ] Endpoint/SlaveEndpointTest.UnauthorizedRequest/1 (91 ms)
[ RUN      ] Endpoint/SlaveEndpointTest.UnauthorizedRequest/2
I0817 11:07:09.116164  5251 containerizer.cpp:246] Using isolation: posix/cpu,posix/mem,filesystem/posix,network/cni,environment_secret
W0817 11:07:09.116964  5251 backend.cpp:76] Failed to create 'overlay' backend: OverlayBackend
requires root privileges
W0817 11:07:09.117178  5251 backend.cpp:76] Failed to create 'bind' backend: BindBackend requires
root privileges
I0817 11:07:09.117229  5251 provisioner.cpp:255] Using default backend 'copy'
I0817 11:07:09.123018  5271 slave.cpp:250] Mesos agent started on (802)@172.17.0.2:43547
I0817 11:07:09.123065  5271 slave.cpp:251] Flags at startup: --acls="" --appc_simple_discovery_uri_prefix="http://"
--appc_store_dir="/tmp/Endpoint_SlaveEndpointTest_UnauthorizedRequest_2_FM0ECh/store/appc"
--authenticate_http_readonly="true" --authenticate_http_readwrite="true" --authenticatee="crammd5"
--authentication_backoff_factor="1secs" --authorizer="local" --cgroups_cpu_enable_pids_and_tids_count="false"
--cgroups_enable_cfs="false" --cgroups_hierarchy="/sys/fs/cgroup" --cgroups_limit_swap="false"
--cgroups_root="mesos" --container_disk_watch_interval="15secs" --containerizers="mesos" --credential="/tmp/Endpoint_SlaveEndpointTest_UnauthorizedRequest_2_FM0ECh/credential"
--default_role="*" --disallow_sharing_agent_pid_namespace="false" --disk_watch_interval="1mins"
--docker="docker" --docker_kill_orphans="true" --docker_registry="https://registry-1.docker.io"
--docker_remove_delay="6hrs" --docker_socket="/var/run/docker.sock" --docker_stop_timeout="0ns"
--docker_store_dir="/tmp/Endpoint_SlaveEndpointTest_UnauthorizedRequest_2_FM0ECh/store/docker"
--docker_volume_checkpoint_dir="/var/run/mesos/isolators/docker/volume" --enforce_container_disk_quota="false"
--executor_registration_timeout="1mins" --executor_reregistration_timeout="2secs" --executor_shutdown_grace_period="5secs"
--fetcher_cache_dir="/tmp/Endpoint_SlaveEndpointTest_UnauthorizedRequest_2_FM0ECh/fetch" --fetcher_cache_size="2GB"
--frameworks_home="" --gc_delay="1weeks" --gc_disk_headroom="0.1" --hadoop_home="" --help="false"
--hostname_lookup="true" --http_command_executor="false" --http_credentials="/tmp/Endpoint_SlaveEndpointTest_UnauthorizedRequest_2_FM0ECh/http_credentials"
--http_heartbeat_interval="30secs" --initialize_driver_logging="true" --isolation="posix/cpu,posix/mem"
--launcher="posix" --launcher_dir="/mesos/mesos-1.4.0/_build/src" --logbufsecs="0" --logging_level="INFO"
--max_completed_executors_per_framework="150" --oversubscribed_resources_interval="15secs"
--perf_duration="10secs" --perf_interval="1mins" --port="5051" --qos_correction_interval_min="0ns"
--quiet="false" --recover="reconnect" --recovery_timeout="15mins" --registration_backoff_factor="10ms"
--resources="cpus:2;gpus:0;mem:1024;disk:1024;ports:[31000-32000]" --revocable_cpu_low_priority="true"
--runtime_dir="/tmp/Endpoint_SlaveEndpointTest_UnauthorizedRequest_2_FM0ECh" --sandbox_directory="/mnt/mesos/sandbox"
--strict="true" --switch_user="true" --systemd_enable_support="true" --systemd_runtime_directory="/run/systemd/system"
--version="false" --work_dir="/tmp/Endpoint_SlaveEndpointTest_UnauthorizedRequest_2_iE7PX6"
I0817 11:07:09.123790  5271 credentials.hpp:86] Loading credential for authentication from
'/tmp/Endpoint_SlaveEndpointTest_UnauthorizedRequest_2_FM0ECh/credential'
I0817 11:07:09.124079  5271 slave.cpp:283] Agent using credential for: test-principal
I0817 11:07:09.124110  5271 credentials.hpp:37] Loading credentials for authentication from
'/tmp/Endpoint_SlaveEndpointTest_UnauthorizedRequest_2_FM0ECh/http_credentials'
I0817 11:07:09.124486  5271 http.cpp:1026] Creating default 'basic' HTTP authenticator for
realm 'mesos-agent-readonly'
I0817 11:07:09.124748  5271 http.cpp:1026] Creating default 'basic' HTTP authenticator for
realm 'mesos-agent-readwrite'
I0817 11:07:09.126893  5271 slave.cpp:565] Agent resources: [{"name":"cpus","scalar":{"value":2.0},"type":"SCALAR"},{"name":"mem","scalar":{"value":1024.0},"type":"SCALAR"},{"name":"disk","scalar":{"value":1024.0},"type":"SCALAR"},{"name":"ports","ranges":{"range":[{"begin":31000,"end":32000}]},"type":"RANGES"}]
I0817 11:07:09.127324  5271 slave.cpp:573] Agent attributes: [  ]
I0817 11:07:09.127344  5271 slave.cpp:582] Agent hostname: 9e1a521e7f33
I0817 11:07:09.127586  5270 status_update_manager.cpp:177] Pausing sending status updates
I0817 11:07:09.129545  5272 state.cpp:64] Recovering state from '/tmp/Endpoint_SlaveEndpointTest_UnauthorizedRequest_2_iE7PX6/meta'
I0817 11:07:09.130475  5270 status_update_manager.cpp:203] Recovering status update manager
I0817 11:07:09.130772  5271 containerizer.cpp:609] Recovering containerizer
I0817 11:07:09.133244  5274 provisioner.cpp:416] Provisioner recovery complete
I0817 11:07:09.134006  5272 slave.cpp:6210] Finished recovery
I0817 11:07:09.135054  5272 slave.cpp:6392] Querying resource estimator for oversubscribable
resources
I0817 11:07:09.135447  5274 slave.cpp:6406] Received oversubscribable resources {} from the
resource estimator
I0817 11:07:09.139742  5271 process.cpp:3933] Handling HTTP event for process 'slave(802)'
with path: '/slave(802)/containers'
I0817 11:07:09.141532  5276 http.cpp:1166] HTTP GET for /slave(802)/containers from 172.17.0.2:36208
I0817 11:07:09.141650  5276 http.cpp:957] Authorizing principal 'test-principal' to GET the
'/containers' endpoint
I0817 11:07:09.145436  5251 slave.cpp:843] Agent terminating
[       OK ] Endpoint/SlaveEndpointTest.UnauthorizedRequest/2 (47 ms)
[ RUN      ] Endpoint/SlaveEndpointTest.NoAuthorizer/0
I0817 11:07:09.163388  5251 containerizer.cpp:246] Using isolation: posix/cpu,posix/mem,filesystem/posix,network/cni,environment_secret
W0817 11:07:09.164206  5251 backend.cpp:76] Failed to create 'overlay' backend: OverlayBackend
requires root privileges
W0817 11:07:09.164424  5251 backend.cpp:76] Failed to create 'bind' backend: BindBackend requires
root privileges
I0817 11:07:09.164475  5251 provisioner.cpp:255] Using default backend 'copy'
I0817 11:07:09.167264  5251 cluster.cpp:448] Creating default 'local' authorizer
I0817 11:07:09.170375  5276 slave.cpp:250] Mesos agent started on (803)@172.17.0.2:43547
I0817 11:07:09.170532  5276 slave.cpp:251] Flags at startup: --acls="" --appc_simple_discovery_uri_prefix="http://"
--appc_store_dir="/tmp/Endpoint_SlaveEndpointTest_NoAuthorizer_0_1TzRFY/store/appc" --authenticate_http_readonly="true"
--authenticate_http_readwrite="true" --authenticatee="crammd5" --authentication_backoff_factor="1secs"
--authorizer="local" --cgroups_cpu_enable_pids_and_tids_count="false" --cgroups_enable_cfs="false"
--cgroups_hierarchy="/sys/fs/cgroup" --cgroups_limit_swap="false" --cgroups_root="mesos" --container_disk_watch_interval="15secs"
--containerizers="mesos" --credential="/tmp/Endpoint_SlaveEndpointTest_NoAuthorizer_0_1TzRFY/credential"
--default_role="*" --disallow_sharing_agent_pid_namespace="false" --disk_watch_interval="1mins"
--docker="docker" --docker_kill_orphans="true" --docker_registry="https://registry-1.docker.io"
--docker_remove_delay="6hrs" --docker_socket="/var/run/docker.sock" --docker_stop_timeout="0ns"
--docker_store_dir="/tmp/Endpoint_SlaveEndpointTest_NoAuthorizer_0_1TzRFY/store/docker" --docker_volume_checkpoint_dir="/var/run/mesos/isolators/docker/volume"
--enforce_container_disk_quota="false" --executor_registration_timeout="1mins" --executor_reregistration_timeout="2secs"
--executor_shutdown_grace_period="5secs" --fetcher_cache_dir="/tmp/Endpoint_SlaveEndpointTest_NoAuthorizer_0_1TzRFY/fetch"
--fetcher_cache_size="2GB" --frameworks_home="" --gc_delay="1weeks" --gc_disk_headroom="0.1"
--hadoop_home="" --help="false" --hostname_lookup="true" --http_command_executor="false" --http_credentials="/tmp/Endpoint_SlaveEndpointTest_NoAuthorizer_0_1TzRFY/http_credentials"
--http_heartbeat_interval="30secs" --initialize_driver_logging="true" --isolation="posix/cpu,posix/mem"
--launcher="posix" --launcher_dir="/mesos/mesos-1.4.0/_build/src" --logbufsecs="0" --logging_level="INFO"
--max_completed_executors_per_framework="150" --oversubscribed_resources_interval="15secs"
--perf_duration="10secs" --perf_interval="1mins" --port="5051" --qos_correction_interval_min="0ns"
--quiet="false" --recover="reconnect" --recovery_timeout="15mins" --registration_backoff_factor="10ms"
--resources="cpus:2;gpus:0;mem:1024;disk:1024;ports:[31000-32000]" --revocable_cpu_low_priority="true"
--runtime_dir="/tmp/Endpoint_SlaveEndpointTest_NoAuthorizer_0_1TzRFY" --sandbox_directory="/mnt/mesos/sandbox"
--strict="true" --switch_user="true" --systemd_enable_support="true" --systemd_runtime_directory="/run/systemd/system"
--version="false" --work_dir="/tmp/Endpoint_SlaveEndpointTest_NoAuthorizer_0_kdstTN"
I0817 11:07:09.171710  5276 credentials.hpp:86] Loading credential for authentication from
'/tmp/Endpoint_SlaveEndpointTest_NoAuthorizer_0_1TzRFY/credential'
I0817 11:07:09.172112  5276 slave.cpp:283] Agent using credential for: test-principal
I0817 11:07:09.172188  5276 credentials.hpp:37] Loading credentials for authentication from
'/tmp/Endpoint_SlaveEndpointTest_NoAuthorizer_0_1TzRFY/http_credentials'
I0817 11:07:09.172982  5276 http.cpp:1026] Creating default 'basic' HTTP authenticator for
realm 'mesos-agent-readonly'
I0817 11:07:09.173456  5276 http.cpp:1026] Creating default 'basic' HTTP authenticator for
realm 'mesos-agent-readwrite'
I0817 11:07:09.176267  5276 slave.cpp:565] Agent resources: [{"name":"cpus","scalar":{"value":2.0},"type":"SCALAR"},{"name":"mem","scalar":{"value":1024.0},"type":"SCALAR"},{"name":"disk","scalar":{"value":1024.0},"type":"SCALAR"},{"name":"ports","ranges":{"range":[{"begin":31000,"end":32000}]},"type":"RANGES"}]
I0817 11:07:09.176710  5276 slave.cpp:573] Agent attributes: [  ]
I0817 11:07:09.177000  5276 slave.cpp:582] Agent hostname: 9e1a521e7f33
I0817 11:07:09.177333  5274 status_update_manager.cpp:177] Pausing sending status updates
I0817 11:07:09.179647  5276 state.cpp:64] Recovering state from '/tmp/Endpoint_SlaveEndpointTest_NoAuthorizer_0_kdstTN/meta'
I0817 11:07:09.180305  5271 status_update_manager.cpp:203] Recovering status update manager
I0817 11:07:09.180764  5272 containerizer.cpp:609] Recovering containerizer
I0817 11:07:09.183197  5274 provisioner.cpp:416] Provisioner recovery complete
I0817 11:07:09.183908  5270 slave.cpp:6210] Finished recovery
I0817 11:07:09.184535  5270 slave.cpp:6392] Querying resource estimator for oversubscribable
resources
I0817 11:07:09.185082  5274 slave.cpp:6406] Received oversubscribable resources {} from the
resource estimator
I0817 11:07:09.189457  5271 process.cpp:3933] Handling HTTP event for process 'slave(803)'
with path: '/slave(803)/monitor/statistics'
I0817 11:07:09.191813  5277 http.cpp:1166] HTTP GET for /slave(803)/monitor/statistics from
172.17.0.2:36210
I0817 11:07:09.191934  5277 http.cpp:957] Authorizing principal 'test-principal' to GET the
'/monitor/statistics' endpoint
I0817 11:07:09.197140  5251 slave.cpp:843] Agent terminating
[       OK ] Endpoint/SlaveEndpointTest.NoAuthorizer/0 (51 ms)
[ RUN      ] Endpoint/SlaveEndpointTest.NoAuthorizer/1
I0817 11:07:09.214828  5251 containerizer.cpp:246] Using isolation: posix/cpu,posix/mem,filesystem/posix,network/cni,environment_secret
W0817 11:07:09.215620  5251 backend.cpp:76] Failed to create 'overlay' backend: OverlayBackend
requires root privileges
W0817 11:07:09.215839  5251 backend.cpp:76] Failed to create 'bind' backend: BindBackend requires
root privileges
I0817 11:07:09.215890  5251 provisioner.cpp:255] Using default backend 'copy'
I0817 11:07:09.218720  5251 cluster.cpp:448] Creating default 'local' authorizer
I0817 11:07:09.221825  5272 slave.cpp:250] Mesos agent started on (804)@172.17.0.2:43547
I0817 11:07:09.222120  5272 slave.cpp:251] Flags at startup: --acls="" --appc_simple_discovery_uri_prefix="http://"
--appc_store_dir="/tmp/Endpoint_SlaveEndpointTest_NoAuthorizer_1_vBzbgG/store/appc" --authenticate_http_readonly="true"
--authenticate_http_readwrite="true" --authenticatee="crammd5" --authentication_backoff_factor="1secs"
--authorizer="local" --cgroups_cpu_enable_pids_and_tids_count="false" --cgroups_enable_cfs="false"
--cgroups_hierarchy="/sys/fs/cgroup" --cgroups_limit_swap="false" --cgroups_root="mesos" --container_disk_watch_interval="15secs"
--containerizers="mesos" --credential="/tmp/Endpoint_SlaveEndpointTest_NoAuthorizer_1_vBzbgG/credential"
--default_role="*" --disallow_sharing_agent_pid_namespace="false" --disk_watch_interval="1mins"
--docker="docker" --docker_kill_orphans="true" --docker_registry="https://registry-1.docker.io"
--docker_remove_delay="6hrs" --docker_socket="/var/run/docker.sock" --docker_stop_timeout="0ns"
--docker_store_dir="/tmp/Endpoint_SlaveEndpointTest_NoAuthorizer_1_vBzbgG/store/docker" --docker_volume_checkpoint_dir="/var/run/mesos/isolators/docker/volume"
--enforce_container_disk_quota="false" --executor_registration_timeout="1mins" --executor_reregistration_timeout="2secs"
--executor_shutdown_grace_period="5secs" --fetcher_cache_dir="/tmp/Endpoint_SlaveEndpointTest_NoAuthorizer_1_vBzbgG/fetch"
--fetcher_cache_size="2GB" --frameworks_home="" --gc_delay="1weeks" --gc_disk_headroom="0.1"
--hadoop_home="" --help="false" --hostname_lookup="true" --http_command_executor="false" --http_credentials="/tmp/Endpoint_SlaveEndpointTest_NoAuthorizer_1_vBzbgG/http_credentials"
--http_heartbeat_interval="30secs" --initialize_driver_logging="true" --isolation="posix/cpu,posix/mem"
--launcher="posix" --launcher_dir="/mesos/mesos-1.4.0/_build/src" --logbufsecs="0" --logging_level="INFO"
--max_completed_executors_per_framework="150" --oversubscribed_resources_interval="15secs"
--perf_duration="10secs" --perf_interval="1mins" --port="5051" --qos_correction_interval_min="0ns"
--quiet="false" --recover="reconnect" --recovery_timeout="15mins" --registration_backoff_factor="10ms"
--resources="cpus:2;gpus:0;mem:1024;disk:1024;ports:[31000-32000]" --revocable_cpu_low_priority="true"
--runtime_dir="/tmp/Endpoint_SlaveEndpointTest_NoAuthorizer_1_vBzbgG" --sandbox_directory="/mnt/mesos/sandbox"
--strict="true" --switch_user="true" --systemd_enable_support="true" --systemd_runtime_directory="/run/systemd/system"
--version="false" --work_dir="/tmp/Endpoint_SlaveEndpointTest_NoAuthorizer_1_6L8rlv"
I0817 11:07:09.222869  5272 credentials.hpp:86] Loading credential for authentication from
'/tmp/Endpoint_SlaveEndpointTest_NoAuthorizer_1_vBzbgG/credential'
I0817 11:07:09.223547  5272 slave.cpp:283] Agent using credential for: test-principal
I0817 11:07:09.223625  5272 credentials.hpp:37] Loading credentials for authentication from
'/tmp/Endpoint_SlaveEndpointTest_NoAuthorizer_1_vBzbgG/http_credentials'
I0817 11:07:09.224320  5272 http.cpp:1026] Creating default 'basic' HTTP authenticator for
realm 'mesos-agent-readonly'
I0817 11:07:09.224747  5272 http.cpp:1026] Creating default 'basic' HTTP authenticator for
realm 'mesos-agent-readwrite'
I0817 11:07:09.227058  5272 slave.cpp:565] Agent resources: [{"name":"cpus","scalar":{"value":2.0},"type":"SCALAR"},{"name":"mem","scalar":{"value":1024.0},"type":"SCALAR"},{"name":"disk","scalar":{"value":1024.0},"type":"SCALAR"},{"name":"ports","ranges":{"range":[{"begin":31000,"end":32000}]},"type":"RANGES"}]
I0817 11:07:09.227491  5272 slave.cpp:573] Agent attributes: [  ]
I0817 11:07:09.227761  5272 slave.cpp:582] Agent hostname: 9e1a521e7f33
I0817 11:07:09.230396  5277 status_update_manager.cpp:177] Pausing sending status updates
I0817 11:07:09.231268  5276 state.cpp:64] Recovering state from '/tmp/Endpoint_SlaveEndpointTest_NoAuthorizer_1_6L8rlv/meta'
I0817 11:07:09.232237  5273 status_update_manager.cpp:203] Recovering status update manager
I0817 11:07:09.232684  5273 containerizer.cpp:609] Recovering containerizer
I0817 11:07:09.235828  5275 provisioner.cpp:416] Provisioner recovery complete
I0817 11:07:09.236378  5271 slave.cpp:6210] Finished recovery
I0817 11:07:09.237151  5271 slave.cpp:6392] Querying resource estimator for oversubscribable
resources
I0817 11:07:09.237712  5276 slave.cpp:6406] Received oversubscribable resources {} from the
resource estimator
I0817 11:07:09.242336  5271 process.cpp:3933] Handling HTTP event for process 'slave(804)'
with path: '/slave(804)/monitor/statistics.json'
I0817 11:07:09.244596  5276 http.cpp:1166] HTTP GET for /slave(804)/monitor/statistics.json
from 172.17.0.2:36212
I0817 11:07:09.244782  5276 http.cpp:957] Authorizing principal 'test-principal' to GET the
'/monitor/statistics.json' endpoint
I0817 11:07:09.249922  5251 slave.cpp:843] Agent terminating
[       OK ] Endpoint/SlaveEndpointTest.NoAuthorizer/1 (56 ms)
[ RUN      ] Endpoint/SlaveEndpointTest.NoAuthorizer/2
I0817 11:07:09.271320  5251 containerizer.cpp:246] Using isolation: posix/cpu,posix/mem,filesystem/posix,network/cni,environment_secret
W0817 11:07:09.272106  5251 backend.cpp:76] Failed to create 'overlay' backend: OverlayBackend
requires root privileges
W0817 11:07:09.272321  5251 backend.cpp:76] Failed to create 'bind' backend: BindBackend requires
root privileges
I0817 11:07:09.272372  5251 provisioner.cpp:255] Using default backend 'copy'
I0817 11:07:09.275189  5251 cluster.cpp:448] Creating default 'local' authorizer
I0817 11:07:09.278276  5271 slave.cpp:250] Mesos agent started on (805)@172.17.0.2:43547
I0817 11:07:09.278353  5271 slave.cpp:251] Flags at startup: --acls="" --appc_simple_discovery_uri_prefix="http://"
--appc_store_dir="/tmp/Endpoint_SlaveEndpointTest_NoAuthorizer_2_7Grvqo/store/appc" --authenticate_http_readonly="true"
--authenticate_http_readwrite="true" --authenticatee="crammd5" --authentication_backoff_factor="1secs"
--authorizer="local" --cgroups_cpu_enable_pids_and_tids_count="false" --cgroups_enable_cfs="false"
--cgroups_hierarchy="/sys/fs/cgroup" --cgroups_limit_swap="false" --cgroups_root="mesos" --container_disk_watch_interval="15secs"
--containerizers="mesos" --credential="/tmp/Endpoint_SlaveEndpointTest_NoAuthorizer_2_7Grvqo/credential"
--default_role="*" --disallow_sharing_agent_pid_namespace="false" --disk_watch_interval="1mins"
--docker="docker" --docker_kill_orphans="true" --docker_registry="https://registry-1.docker.io"
--docker_remove_delay="6hrs" --docker_socket="/var/run/docker.sock" --docker_stop_timeout="0ns"
--docker_store_dir="/tmp/Endpoint_SlaveEndpointTest_NoAuthorizer_2_7Grvqo/store/docker" --docker_volume_checkpoint_dir="/var/run/mesos/isolators/docker/volume"
--enforce_container_disk_quota="false" --executor_registration_timeout="1mins" --executor_reregistration_timeout="2secs"
--executor_shutdown_grace_period="5secs" --fetcher_cache_dir="/tmp/Endpoint_SlaveEndpointTest_NoAuthorizer_2_7Grvqo/fetch"
--fetcher_cache_size="2GB" --frameworks_home="" --gc_delay="1weeks" --gc_disk_headroom="0.1"
--hadoop_home="" --help="false" --hostname_lookup="true" --http_command_executor="false" --http_credentials="/tmp/Endpoint_SlaveEndpointTest_NoAuthorizer_2_7Grvqo/http_credentials"
--http_heartbeat_interval="30secs" --initialize_driver_logging="true" --isolation="posix/cpu,posix/mem"
--launcher="posix" --launcher_dir="/mesos/mesos-1.4.0/_build/src" --logbufsecs="0" --logging_level="INFO"
--max_completed_executors_per_framework="150" --oversubscribed_resources_interval="15secs"
--perf_duration="10secs" --perf_interval="1mins" --port="5051" --qos_correction_interval_min="0ns"
--quiet="false" --recover="reconnect" --recovery_timeout="15mins" --registration_backoff_factor="10ms"
--resources="cpus:2;gpus:0;mem:1024;disk:1024;ports:[31000-32000]" --revocable_cpu_low_priority="true"
--runtime_dir="/tmp/Endpoint_SlaveEndpointTest_NoAuthorizer_2_7Grvqo" --sandbox_directory="/mnt/mesos/sandbox"
--strict="true" --switch_user="true" --systemd_enable_support="true" --systemd_runtime_directory="/run/systemd/system"
--version="false" --work_dir="/tmp/Endpoint_SlaveEndpointTest_NoAuthorizer_2_6r5Bmd"
I0817 11:07:09.279247  5271 credentials.hpp:86] Loading credential for authentication from
'/tmp/Endpoint_SlaveEndpointTest_NoAuthorizer_2_7Grvqo/credential'
I0817 11:07:09.279768  5271 slave.cpp:283] Agent using credential for: test-principal
I0817 11:07:09.279947  5271 credentials.hpp:37] Loading credentials for authentication from
'/tmp/Endpoint_SlaveEndpointTest_NoAuthorizer_2_7Grvqo/http_credentials'
I0817 11:07:09.280485  5271 http.cpp:1026] Creating default 'basic' HTTP authenticator for
realm 'mesos-agent-readonly'
I0817 11:07:09.280920  5271 http.cpp:1026] Creating default 'basic' HTTP authenticator for
realm 'mesos-agent-readwrite'
I0817 11:07:09.283304  5271 slave.cpp:565] Agent resources: [{"name":"cpus","scalar":{"value":2.0},"type":"SCALAR"},{"name":"mem","scalar":{"value":1024.0},"type":"SCALAR"},{"name":"disk","scalar":{"value":1024.0},"type":"SCALAR"},{"name":"ports","ranges":{"range":[{"begin":31000,"end":32000}]},"type":"RANGES"}]
I0817 11:07:09.283962  5271 slave.cpp:573] Agent attributes: [  ]
I0817 11:07:09.284021  5271 slave.cpp:582] Agent hostname: 9e1a521e7f33
I0817 11:07:09.284342  5270 status_update_manager.cpp:177] Pausing sending status updates
I0817 11:07:09.286484  5276 state.cpp:64] Recovering state from '/tmp/Endpoint_SlaveEndpointTest_NoAuthorizer_2_6r5Bmd/meta'
I0817 11:07:09.287225  5276 status_update_manager.cpp:203] Recovering status update manager
I0817 11:07:09.287794  5271 containerizer.cpp:609] Recovering containerizer
I0817 11:07:09.290156  5271 provisioner.cpp:416] Provisioner recovery complete
I0817 11:07:09.290854  5277 slave.cpp:6210] Finished recovery
I0817 11:07:09.291461  5277 slave.cpp:6392] Querying resource estimator for oversubscribable
resources
I0817 11:07:09.292186  5277 slave.cpp:6406] Received oversubscribable resources {} from the
resource estimator
I0817 11:07:09.296716  5277 process.cpp:3933] Handling HTTP event for process 'slave(805)'
with path: '/slave(805)/containers'
I0817 11:07:09.298830  5276 http.cpp:1166] HTTP GET for /slave(805)/containers from 172.17.0.2:36214
I0817 11:07:09.299207  5276 http.cpp:957] Authorizing principal 'test-principal' to GET the
'/containers' endpoint
I0817 11:07:09.305970  5251 slave.cpp:843] Agent terminating
[       OK ] Endpoint/SlaveEndpointTest.NoAuthorizer/2 (52 ms)
[----------] 9 tests from Endpoint/SlaveEndpointTest (596 ms total)

[----------] 2 tests from ContainerizerType/DefaultContainerDNSFlagTest
[ RUN      ] ContainerizerType/DefaultContainerDNSFlagTest.ValidateFlag/0
[       OK ] ContainerizerType/DefaultContainerDNSFlagTest.ValidateFlag/0 (19 ms)
[ RUN      ] ContainerizerType/DefaultContainerDNSFlagTest.ValidateFlag/1
[       OK ] ContainerizerType/DefaultContainerDNSFlagTest.ValidateFlag/1 (18 ms)
[----------] 2 tests from ContainerizerType/DefaultContainerDNSFlagTest (38 ms total)

[----------] Global test environment tear-down
[==========] 1655 tests from 182 test cases ran. (770322 ms total)
[  PASSED  ] 1651 tests.
[  FAILED  ] 4 tests, listed below:
[  FAILED  ] DefaultExecutorCheckTest.CommandCheckDeliveredAndReconciled
[  FAILED  ] DefaultExecutorCheckTest.CommandCheckStatusChange
[  FAILED  ] DefaultExecutorCheckTest.CommandCheckSeesParentsEnv
[  FAILED  ] DefaultExecutorCheckTest.CommandCheckSharesWorkDirWithTask

 4 FAILED TESTS
  YOU HAVE 20 DISABLED TESTS

I0817 11:07:09.490447  5278 process.cpp:1072] Failed to accept socket: future discarded
make[4]: *** [check-local] Error 1
make[4]: Leaving directory `/mesos/mesos-1.4.0/_build/src'
make[3]: *** [check-am] Error 2
make[3]: Leaving directory `/mesos/mesos-1.4.0/_build/src'
make[2]: *** [check] Error 2
make[2]: Leaving directory `/mesos/mesos-1.4.0/_build/src'
make[1]: *** [check-recursive] Error 1
make[1]: Leaving directory `/mesos/mesos-1.4.0/_build'
make: *** [distcheck] Error 1
+ docker rmi mesos-1502959486-12177
Untagged: mesos-1502959486-12177:latest
Deleted: sha256:4f117e58d50d199fe9c685ad96e559215832b64f66b623b6aa37a150f3c5ea8c
Deleted: sha256:f21f753bc6f6e4502e9efd3667bc779aa2f2ab9f9c74f932879a711343edef38
Deleted: sha256:d2a2d717690d989b34e586786be291d4adfef1dc5bced9198230591331630c56
Deleted: sha256:e136f43af18a769db3c38bd55baf48d377a095efe286256210d8b7b3e8d10e52
Deleted: sha256:4be1135f643da389842d7ef1d4d38304ff3291dd083dbdbd60482b0af32af9cb
Deleted: sha256:82e80980266674d41315dd3dfb6b4a119561d942e47f07e52d3fe595cf983b9e
Deleted: sha256:f49378229252ca38c79746fa0bbb509a1c8270656a2e19c78b6d63adbedcdc96
Deleted: sha256:ad052032c0f9bd45cf05246f8e15b696ff179a5423b7fa47dbf2a1c009c3ad43
Deleted: sha256:5aab2143fe060d8aa52fcd322167af01e43b188f99ac9e4189118cf125a13d66
Deleted: sha256:540d649eb032f8f2470d263c7da1a4ab1fce09b1d50d14b560a26a4c1dda3699
Deleted: sha256:588c0342712af632f546c2b0c0e23c711db3d0174d48e279998490691ada2825
Deleted: sha256:3a903f1f6b15c7338c09264fd2c5dbeeb7346de38814c79f0f67f5cd78475470
Deleted: sha256:b808254b8f86366210f2d1e983deff8dfba2ae41b98a135da1c5b3e7ed69a177
Deleted: sha256:b99d8d1e331acefe6dad9963a4e8b1a72e864d86e1876a60f42cd7eb55daebce
Deleted: sha256:9cfb6846782cbe3f6064233fef89dec0e0b2daecc8ee99ab57c3c7a50a8b3eec
Deleted: sha256:08cf3e820f7e1a389f1e43d738fda881e6d2b45eedb10c4662edc8ba67fce003
Deleted: sha256:ecb2003f6ad3fa4019a6735d2325ba939d45c91af9554129bda2b75f0b8e01bd
Deleted: sha256:b7479c97d25ed74264c4f2a55524e76a96a801f7ba0840a33537cd43c68414ad
Deleted: sha256:8942a943b210119a7e8ee2a5bac40a64c2a2a341cca5b926e7eeb89fac3d5b16
Deleted: sha256:3c13aa5f09bbbb4058b502283eaaef202bc132a6bebaa268248869a42c7518ad
Deleted: sha256:3d7fba7c569c40e2caa7081e016475d9ada96968b8827b8922ad273681f4802d
Deleted: sha256:fda56d13c72cd21d415595fc36182f152093ead6a1fae9761324f072e7eb118e
Deleted: sha256:f346b600e4748d68e04843e14e82b8a27aecb0976009cfa4d6519e5838a3c7d0
Deleted: sha256:ae1372c2b70778345d21c1f3ae2dba86062a569d68eb7381514f5fedaed70c1a
Build step 'Execute shell' marked build as failure

Mime
View raw message