mesos-builds mailing list archives

Site index · List index
Message view « Date » · « Thread »
Top « Date » · « Thread »
From Apache Jenkins Server <jenk...@builds.apache.org>
Subject Build failed in Jenkins: Mesos-Reviewbot #19027
Date Thu, 24 Aug 2017 09:33:36 GMT
See <https://builds.apache.org/job/Mesos-Reviewbot/19027/display/redirect>

------------------------------------------
[...truncated 306.02 KB...]
configure: running /bin/bash ./configure --disable-option-checking '--prefix=/'  '--disable-python-dependency-install'
'--verbose' 'CXX=g++' 'CC=gcc' 'CXXFLAGS=-g1 -O0 -Wno-unused-local-typedefs -std=c++11' '--enable-shared=no'
'--with-pic' 'CPPFLAGS=' 'LDFLAGS=' 'CFLAGS=' --cache-file=/dev/null --srcdir=.
libtool: link: (cd .libs/libzookeeper_st.lax/libhashtable.a && ar x "/mesos/mesos-1.5.0/_build/3rdparty/zookeeper-3.4.8/src/c/./.libs/libhashtable.a")
g++ -I. -I./include -std=c++0x -fno-builtin-memcmp -pthread -DOS_LINUX -DLEVELDB_PLATFORM_POSIX
-DLEVELDB_ATOMIC_PRESENT -g1 -O0 -Wno-unused-local-typedefs -std=c++11 -fPIC -c util/logging.cc
-o out-static/util/logging.o
libtool: link: ar cru .libs/libzookeeper_st.a   .libs/libzookeeper_st.lax/libzkst.a/recordio.o
.libs/libzookeeper_st.lax/libzkst.a/st_adaptor.o .libs/libzookeeper_st.lax/libzkst.a/zk_hashtable.o
.libs/libzookeeper_st.lax/libzkst.a/zk_log.o .libs/libzookeeper_st.lax/libzkst.a/zookeeper.jute.o
.libs/libzookeeper_st.lax/libzkst.a/zookeeper.o  .libs/libzookeeper_st.lax/libhashtable.a/hashtable.o
.libs/libzookeeper_st.lax/libhashtable.a/hashtable_itr.o 
libtool: link: ranlib .libs/libzookeeper_st.a
libtool: link: rm -fr .libs/libzookeeper_st.lax
yes
checking syscall.h presence... yes
checking for syscall.h... yes
checking sys/syscall.h usability... libtool: link: ( cd ".libs" && rm -f "libzookeeper_st.la"
&& ln -s "../libzookeeper_st.la" "libzookeeper_st.la" )
/bin/bash ./libtool  --tag=CC   --mode=link gcc -Wall -Werror  -g -O2 -D_GNU_SOURCE -no-undefined
-version-info 2  -export-symbols-regex '(zoo_|zookeeper_|zhandle|Z|format_log_message|log_message|logLevel|deallocate_|allocate_|zerror|is_unrecoverable)'
 -o libzookeeper_mt.la -rpath //lib  libzkmt.la libhashtable.la -lpthread 
yes
checking sys/syscall.h presence... yes
checking for sys/syscall.h... yes
checking execinfo.h usability... checking for a BSD-compatible install... /usr/bin/install
-c
checking whether build environment is sane... yes
checking for a thread-safe mkdir -p... /bin/mkdir -p
checking for gawk... no
checking for mawk... mawk
checking whether make sets $(MAKE)... yes
checking execinfo.h presence... yes
checking whether make supports nested variables... yes
checking for execinfo.h... yes
yes
checking libunwind.h usability... checking for gcc... gcc
checking whether the C compiler works... libtool: link: (cd .libs/libzookeeper_mt.lax/libzkmt.a
&& ar x "/mesos/mesos-1.5.0/_build/3rdparty/zookeeper-3.4.8/src/c/./.libs/libzkmt.a")
/bin/bash ./libtool  --tag=CC   --mode=link gcc -Wall -Werror  -g -O2 -D_GNU_SOURCE   -o cli_st
cli.o libzookeeper_st.la 
yes
checking for C compiler default output file name... a.out
checking for suffix of executables... libtool: link: (cd .libs/libzookeeper_mt.lax/libhashtable.a
&& ar x "/mesos/mesos-1.5.0/_build/3rdparty/zookeeper-3.4.8/src/c/./.libs/libhashtable.a")
no
checking libunwind.h presence... libtool: link: ar cru .libs/libzookeeper_mt.a   .libs/libzookeeper_mt.lax/libzkmt.a/libzkmt_la-mt_adaptor.o
.libs/libzookeeper_mt.lax/libzkmt.a/libzkmt_la-recordio.o .libs/libzookeeper_mt.lax/libzkmt.a/libzkmt_la-zk_hashtable.o
.libs/libzookeeper_mt.lax/libzkmt.a/libzkmt_la-zk_log.o .libs/libzookeeper_mt.lax/libzkmt.a/libzkmt_la-zookeeper.jute.o
.libs/libzookeeper_mt.lax/libzkmt.a/libzkmt_la-zookeeper.o  .libs/libzookeeper_mt.lax/libhashtable.a/hashtable.o
.libs/libzookeeper_mt.lax/libhashtable.a/hashtable_itr.o 
libtool: link: ranlib .libs/libzookeeper_mt.a

checking whether we are cross compiling... libtool: link: rm -fr .libs/libzookeeper_mt.lax
no
checking for libunwind.h... no
checking ucontext.h usability... libtool: link: ( cd ".libs" && rm -f "libzookeeper_mt.la"
&& ln -s "../libzookeeper_mt.la" "libzookeeper_mt.la" )
g++ -I. -I./include -std=c++0x -fno-builtin-memcmp -pthread -DOS_LINUX -DLEVELDB_PLATFORM_POSIX
-DLEVELDB_ATOMIC_PRESENT -g1 -O0 -Wno-unused-local-typedefs -std=c++11 -fPIC -c util/options.cc
-o out-static/util/options.o
no
g++ -I. -I./include -std=c++0x -fno-builtin-memcmp -pthread -DOS_LINUX -DLEVELDB_PLATFORM_POSIX
-DLEVELDB_ATOMIC_PRESENT -g1 -O0 -Wno-unused-local-typedefs -std=c++11 -fPIC -c util/status.cc
-o out-static/util/status.o
checking for suffix of object files... yes
checking ucontext.h presence... libtool: link: gcc -Wall -Werror -g -O2 -D_GNU_SOURCE -o cli_st
cli.o  ./.libs/libzookeeper_st.a -lm
yes
checking for ucontext.h... yes
o
checking whether we are using the GNU C compiler... checking sys/utsname.h usability... yes
checking whether gcc accepts -g... /bin/bash ./libtool  --tag=CC   --mode=link gcc -DTHREADED
-g -O2 -D_GNU_SOURCE   -o cli_mt cli_mt-cli.o libzookeeper_mt.la 
yes
checking for gcc option to accept ISO C89... yes
checking sys/utsname.h presence... yes
checking for sys/utsname.h... yes
checking pwd.h usability... none needed
checking whether gcc understands -c and -o together... yes
checking for style of include used by make... yes
checking pwd.h presence... GNU
checking dependency style of gcc... yes
checking for pwd.h... yes
checking syslog.h usability... gcc3
libtool: link: gcc -DTHREADED -g -O2 -D_GNU_SOURCE -o cli_mt cli_mt-cli.o  ./.libs/libzookeeper_mt.a
-lm -lpthread
yes
checking syslog.h presence... yes
checking for syslog.h... yes
checking sys/time.h usability... /bin/bash ./libtool  --tag=CC   --mode=link gcc -DTHREADED
-g -O2 -D_GNU_SOURCE   -o load_gen load_gen-load_gen.o libzookeeper_mt.la 
checking whether we are using the GNU C++ compiler... g++ -I. -I./include -std=c++0x -fno-builtin-memcmp
-pthread -DOS_LINUX -DLEVELDB_PLATFORM_POSIX -DLEVELDB_ATOMIC_PRESENT -g1 -O0 -Wno-unused-local-typedefs
-std=c++11 -fPIC -c port/port_posix.cc -o out-static/port/port_posix.o
yes
checking whether g++ accepts -g... yes
checking sys/time.h presence... yes
checking dependency style of g++... yes
checking for sys/time.h... yes
checking glob.h usability... yes
checking glob.h presence... gcc3
yes
checking for glob.h... yes
checking unwind.h usability... checking build system type... libtool: link: gcc -DTHREADED
-g -O2 -D_GNU_SOURCE -o load_gen load_gen-load_gen.o  ./.libs/libzookeeper_mt.a -lm -lpthread
make[6]: Leaving directory `/mesos/mesos-1.5.0/_build/3rdparty/zookeeper-3.4.8/src/c'
make[5]: Leaving directory `/mesos/mesos-1.5.0/_build/3rdparty/zookeeper-3.4.8/src/c'
x86_64-unknown-linux-gnu
checking host system type... x86_64-unknown-linux-gnu
checking how to print strings... yes
checking unwind.h presence... yes
checking for unwind.h... yes
checking size of void *... printf
checking for a sed that does not truncate output... /bin/sed
checking for grep that handles long lines and -e... /bin/grep
checking for egrep... /bin/grep -E
checking for fgrep... /bin/grep -F
checking for ld used by gcc... /usr/bin/ld
checking if the linker (/usr/bin/ld) is GNU ld... yes
checking for BSD- or MS-compatible name lister (nm)... /usr/bin/nm -B
checking the name lister (/usr/bin/nm -B) interface... BSD nm
checking whether ln -s works... yes
checking the maximum length of command line arguments... 3458764513820540925
checking how to convert x86_64-unknown-linux-gnu file names to x86_64-unknown-linux-gnu format...
func_convert_file_noop
checking how to convert x86_64-unknown-linux-gnu file names to toolchain format... func_convert_file_noop
checking for /usr/bin/ld option to reload object files... -r
checking for objdump... objdump
checking how to recognize dependent libraries... pass_all
checking for dlltool... no
checking how to associate runtime and link libraries... printf %s\n
checking for ar... ar
checking for archiver @FILE support... 8
checking for uint16_t... @
checking for strip... strip
checking for ranlib... ranlib
checking command to parse /usr/bin/nm -B output from gcc object... rm -f out-static/libleveldb.a
ar -rs out-static/libleveldb.a out-static/db/builder.o out-static/db/c.o out-static/db/db_impl.o
out-static/db/db_iter.o out-static/db/dbformat.o out-static/db/dumpfile.o out-static/db/filename.o
out-static/db/log_reader.o out-static/db/log_writer.o out-static/db/memtable.o out-static/db/repair.o
out-static/db/table_cache.o out-static/db/version_edit.o out-static/db/version_set.o out-static/db/write_batch.o
out-static/table/block.o out-static/table/block_builder.o out-static/table/filter_block.o
out-static/table/format.o out-static/table/iterator.o out-static/table/merger.o out-static/table/table.o
out-static/table/table_builder.o out-static/table/two_level_iterator.o out-static/util/arena.o
out-static/util/bloom.o out-static/util/cache.o out-static/util/coding.o out-static/util/comparator.o
out-static/util/crc32c.o out-static/util/env.o out-static/util/env_posix.o out-static/util/filter_policy.o
out-static/util/hash.o out-static/util/histogram.o out-static/util/logging.o out-static/util/options.o
out-static/util/status.o out-static/port/port_posix.o
ar: creating out-static/libleveldb.a
make[5]: Leaving directory `/mesos/mesos-1.5.0/_build/3rdparty/leveldb-1.19'
ok
checking for sysroot... no
checking for a working dd... /bin/dd
checking how to truncate binary pipes... /bin/dd bs=4096 count=1
yes
checking for u_int16_t... checking for mt... mt
checking if mt is a manifest tool... no
checking how to run the C preprocessor... gcc -E
checking for ANSI C header files... yes
checking for __uint16... no
checking for sigaltstack... yes
checking for sys/types.h... yes
checking for sys/stat.h... yes
checking for dladdr... yes
checking for stdlib.h... no
checking for fcntl... yes
checking for string.h... yes
yes
checking for __attribute__... checking for memory.h... yes
yes
checking for __builtin_expect... checking for strings.h... yes
checking for __sync_val_compare_and_swap... yes
checking for inttypes.h... yes
yes
checking for stdint.h... checking for the pthreads library -lpthreads... yes
checking for unistd.h... no
checking whether pthreads work without any flags... yes
checking for dlfcn.h... no
checking whether pthreads work with -Kthread... yes
checking for objdir... .libs
no
checking whether pthreads work with -kthread... no
checking for the pthreads library -llthread... no
checking whether pthreads work with -pthread... checking if gcc supports -fno-rtti -fno-exceptions...
yes
no
checking for joinable pthread attribute... checking for gcc option to produce PIC... -fPIC
-DPIC
checking if gcc PIC flag -fPIC -DPIC works... yes
checking if gcc static flag -static works... PTHREAD_CREATE_JOINABLE
checking if more special flags are required for pthreads... no
checking whether to check for GCC pthread/shared inconsistencies... no
checking if gcc supports -c -o file.o... yes
checking whether -pthread is sufficient with -shared... yes
checking if gcc supports -c -o file.o... (cached) yes
checking whether the gcc linker (/usr/bin/ld -m elf_x86_64) supports shared libraries... yes
checking dynamic linker characteristics... yes
checking for pthread_self in -lpthread... GNU/Linux ld.so
checking how to hardcode library paths into programs... immediate
checking whether stripping libraries is possible... yes
checking if libtool supports shared libraries... yes
checking whether to build shared libraries... no
checking whether to build static libraries... yes
checking how to run the C++ preprocessor... yes
checking for gtest-config... no
checking support for pthread_rwlock_* functions... g++ -E
yes
checking whether the compiler implements namespaces... yes
checking what namespace STL code is in... checking for ld used by g++... /usr/bin/ld -m elf_x86_64
checking if the linker (/usr/bin/ld -m elf_x86_64) is GNU ld... yes
checking whether the g++ linker (/usr/bin/ld -m elf_x86_64) supports shared libraries... yes
checking for g++ option to produce PIC... -fPIC -DPIC
checking if g++ PIC flag -fPIC -DPIC works... yes
checking if g++ static flag -static works... no
checking if g++ supports -c -o file.o... yes
checking if g++ supports -c -o file.o... (cached) yes
checking whether the g++ linker (/usr/bin/ld -m elf_x86_64) supports shared libraries... yes
checking dynamic linker characteristics... (cached) GNU/Linux ld.so
checking how to hardcode library paths into programs... immediate
checking for python... /usr/bin/python
std
checking whether compiler supports using ::operator<<... checking for the pthreads library
-lpthreads... no
checking whether pthreads work without any flags... no
checking whether pthreads work with -Kthread... no
checking whether pthreads work with -kthread... no
checking for the pthreads library -llthread... no
checking whether pthreads work with -pthread... yes
checking for joinable pthread attribute... PTHREAD_CREATE_JOINABLE
checking if more special flags are required for pthreads... no
checking whether to check for GCC pthread/shared inconsistencies... 1
checking for ucontext.h... (cached) yes
checking sys/ucontext.h usability... yes
checking whether -pthread is sufficient with -shared... yes
checking sys/ucontext.h presence... yes
checking for sys/ucontext.h... yes
checking how to access the program counter from a struct ucontext... yes
checking that generated files are newer than configure... done
configure: creating ./config.status
uc_mcontext.gregs[REG_RIP]
configure: creating ./config.status
configure: WARNING: unrecognized options: --disable-python-dependency-install
 /bin/bash ./config.status
config.status: creating Makefile
mawk: write failure (No space left on device)
mawk: close failed on file /dev/stdout (No space left on device)
config.status: error: could not create Makefile
configure: error: ./configure failed for gtest
configure: error: ./configure failed for gmock
make[4]: *** [protobuf-3.3.0-build-stamp] Error 1
make[4]: *** Waiting for unfinished jobs....
config.status: creating Makefile
mawk: write failure (No space left on device)
mawk: close failed on file /dev/stdout (No space left on device)
config.status: error: could not create Makefile
make[5]: *** [Makefile] Error 2
make[5]: Leaving directory `/mesos/mesos-1.5.0/_build/3rdparty/glog-0.3.3'
make[4]: *** [glog-0.3.3-build-stamp] Error 2
make[4]: Leaving directory `/mesos/mesos-1.5.0/_build/3rdparty'
make[3]: *** [all-recursive] Error 1
make[3]: Leaving directory `/mesos/mesos-1.5.0/_build/3rdparty'
make[2]: *** [all] Error 2
make[2]: Leaving directory `/mesos/mesos-1.5.0/_build/3rdparty'
make[1]: *** [all-recursive] Error 1
make[1]: Leaving directory `/mesos/mesos-1.5.0/_build'
make: *** [distcheck] Error 1
+ docker rmi mesos-1503566787-18522
Untagged: mesos-1503566787-18522:latest
Deleted: sha256:29c26dc27a2d95fe9af5e5a542bbc4e48e68300a445a319d4650563b5caf12be
Deleted: sha256:50bcafbf5a224f23ff2fd4ba913a715306bb7b99d655ca6a839b01ae88d94598
Deleted: sha256:2c6471cf665c96a9d2f920e6dc316ca1300880f5f7383263a038512921d424a0
Deleted: sha256:cf24965ecf4abfe663e113fc6fee527d3d3a7e6ffed802ad0304bfa2905522c6
Deleted: sha256:b448053096c1d9d63f4213db97d817c5f81f3352ebf6c742b1ed666b0a275960
Deleted: sha256:ff3e7f6d3b2dfe6dad18d5c0f64854da10c39fd28e9b03cbdad6bf0de41641f1
Deleted: sha256:037908c9f96cf8d29c53ceada4549353c37c83647de70a8d7bfb70cf7ad8052a
Deleted: sha256:96b51b8686b9046ba7252cc864fd75f08776da1a0bd209b3039ebd88f3d813fc
Deleted: sha256:d5a0c2b945add623bb758f4b6ad086ae23a6266d0e490c973e51143d6266b5d1
Deleted: sha256:5acb4abb155222c104072f2d5da3832f005dbd58cd4dd88dd0853a4cb51c3e79
Deleted: sha256:d7768e31ebafcfee25850ad85c89663184e0aa3fea4438488c9301ef5d3a0f78
Deleted: sha256:f9bf116e7bff1fd530a3d2d77c3d2ef41aced1474c5d2076d88ee405f6ce749f
Deleted: sha256:bc779135a22801aff053e097d6d7778ef62e308a4e2f454d2c2f836759136dd2
Deleted: sha256:ed8d8cfee4f7582b3cbc9d85fd5be433ab1bfa0c18f65219537e288477894dc1
Deleted: sha256:fe153cd845682436f11a93b7599d8c13fcc72b20483f4a3a1724a1f377fd0789
Deleted: sha256:732a7c82adc06f7ed1113fec4337b088525c3c5d7203e3a69af6f5c536969f81
Deleted: sha256:6e3fc8a16b7f0f4db2321ad01da5b3820a4d5555411d5be245054fcf01f5815c
Deleted: sha256:c6b4ac1f844563fa038c10c41a458698ae798afd4e40356b24dd6eb5d4e577f2
Deleted: sha256:29843cc6c2473454cc08322d986ca26495a61c98faddd0360674aa58458dde6a
Deleted: sha256:ad8f64170f5fb709f0ed0ed51fe69d797390e09acf224e01799b082bd736401d
Deleted: sha256:1e79c29154ae9cb5cd777c5879076980c736b5e91c5ffda5b53adec231dddf0e
Deleted: sha256:bf439fd332c4ebd99e070719987fb7e6680c526c439b001f7f6246a3f7a72050
Deleted: sha256:baecf5bb657b6f15fa41ff1ce53465a42f78d0419c7bb333609d6a4edc88e5dc
Deleted: sha256:954b18c582b90a73bbb4efde77372858e64ea7fe96907f6ecf7bfec8883ad9f0
Build step 'Execute shell' marked build as failure

Mime
View raw message