mesos-builds mailing list archives

Site index · List index
Message view « Date » · « Thread »
Top « Date » · « Thread »
From Apache Jenkins Server <jenk...@builds.apache.org>
Subject Build failed in Jenkins: Mesos-Buildbot » autotools,gcc,--verbose,GLOG_v=1 MESOS_VERBOSE=1,centos:7,(ubuntu)&&(!ubuntu-us1)&&(!ubuntu-eu2) #4150
Date Fri, 25 Aug 2017 04:46:14 GMT
See <https://builds.apache.org/job/Mesos-Buildbot/BUILDTOOL=autotools,COMPILER=gcc,CONFIGURATION=--verbose,ENVIRONMENT=GLOG_v=1%20MESOS_VERBOSE=1,OS=centos%3A7,label_exp=(ubuntu)&&(!ubuntu-us1)&&(!ubuntu-eu2)/4150/display/redirect?page=changes>

Changes:

[bmahler] Added MESOS-7863 to the 1.2.3 CHANGELOG.

[bmahler] Added MESOS-7863 to the 1.1.3 CHANGELOG.

[xujyan] Propagate the error from os::rmdir.

[xujyan] Fix garbage collection metrics test failures.

[mpark] Fixed agent downgrades for reservation refinement.

------------------------------------------
[...truncated 30.86 MB...]
I0825 04:45:58.461222  6729 slave.cpp:285] Agent using credential for: test-principal
I0825 04:45:58.461253  6729 credentials.hpp:37] Loading credentials for authentication from
'/tmp/Endpoint_SlaveEndpointTest_AuthorizedRequest_2_cs21bT/http_credentials'
I0825 04:45:58.461539  6729 http.cpp:1026] Creating default 'basic' HTTP authenticator for
realm 'mesos-agent-readonly'
I0825 04:45:58.461863  6729 http.cpp:1026] Creating default 'basic' HTTP authenticator for
realm 'mesos-agent-readwrite'
I0825 04:45:58.463454  6729 slave.cpp:581] Agent resources: [{"name":"cpus","scalar":{"value":2.0},"type":"SCALAR"},{"name":"mem","scalar":{"value":1024.0},"type":"SCALAR"},{"name":"disk","scalar":{"value":1024.0},"type":"SCALAR"},{"name":"ports","ranges":{"range":[{"begin":31000,"end":32000}]},"type":"RANGES"}]
I0825 04:45:58.463713  6729 slave.cpp:589] Agent attributes: [  ]
I0825 04:45:58.463728  6729 slave.cpp:598] Agent hostname: 94d03570fded
I0825 04:45:58.463951  6724 status_update_manager.cpp:177] Pausing sending status updates
I0825 04:45:58.465807  6713 state.cpp:64] Recovering state from '/tmp/Endpoint_SlaveEndpointTest_AuthorizedRequest_2_OTUtPp/meta'
I0825 04:45:58.466274  6732 status_update_manager.cpp:203] Recovering status update manager
I0825 04:45:58.466498  6714 containerizer.cpp:643] Recovering containerizer
I0825 04:45:58.468111  6731 provisioner.cpp:416] Provisioner recovery complete
I0825 04:45:58.468585  6729 slave.cpp:6264] Finished recovery
I0825 04:45:58.469225  6729 slave.cpp:6446] Querying resource estimator for oversubscribable
resources
I0825 04:45:58.469503  6720 slave.cpp:6460] Received oversubscribable resources {} from the
resource estimator
I0825 04:45:58.473078  6726 process.cpp:3933] Handling HTTP event for process 'slave(799)'
with path: '/slave(799)/containers'
I0825 04:45:58.474545  6709 http.cpp:1166] HTTP GET for /slave(799)/containers from 172.17.0.11:46874
I0825 04:45:58.474663  6709 http.cpp:957] Authorizing principal 'test-principal' to GET the
'/containers' endpoint
I0825 04:45:58.479465  6715 slave.cpp:859] Agent terminating
[       OK ] Endpoint/SlaveEndpointTest.AuthorizedRequest/2 (35 ms)
[ RUN      ] Endpoint/SlaveEndpointTest.UnauthorizedRequest/0
I0825 04:45:58.492939  6690 containerizer.cpp:288] Using isolation { environment_secret, posix/cpu,
posix/mem, filesystem/posix, network/cni }
W0825 04:45:58.493573  6690 backend.cpp:76] Failed to create 'aufs' backend: AufsBackend requires
root privileges
W0825 04:45:58.493716  6690 backend.cpp:76] Failed to create 'bind' backend: BindBackend requires
root privileges
I0825 04:45:58.493755  6690 provisioner.cpp:255] Using default backend 'copy'
I0825 04:45:58.498235  6730 slave.cpp:252] Mesos agent started on (800)@172.17.0.11:39727
I0825 04:45:58.498260  6730 slave.cpp:253] Flags at startup: --acls="" --appc_simple_discovery_uri_prefix="http://"
--appc_store_dir="/tmp/Endpoint_SlaveEndpointTest_UnauthorizedRequest_0_gG7oWM/store/appc"
--authenticate_http_readonly="true" --authenticate_http_readwrite="true" --authenticatee="crammd5"
--authentication_backoff_factor="1secs" --authorizer="local" --cgroups_cpu_enable_pids_and_tids_count="false"
--cgroups_enable_cfs="false" --cgroups_hierarchy="/sys/fs/cgroup" --cgroups_limit_swap="false"
--cgroups_root="mesos" --container_disk_watch_interval="15secs" --containerizers="mesos" --credential="/tmp/Endpoint_SlaveEndpointTest_UnauthorizedRequest_0_gG7oWM/credential"
--default_role="*" --disallow_sharing_agent_pid_namespace="false" --disk_watch_interval="1mins"
--docker="docker" --docker_kill_orphans="true" --docker_registry="https://registry-1.docker.io"
--docker_remove_delay="6hrs" --docker_socket="/var/run/docker.sock" --docker_stop_timeout="0ns"
--docker_store_dir="/tmp/Endpoint_SlaveEndpointTest_UnauthorizedRequest_0_gG7oWM/store/docker"
--docker_volume_checkpoint_dir="/var/run/mesos/isolators/docker/volume" --enforce_container_disk_quota="false"
--executor_registration_timeout="1mins" --executor_reregistration_timeout="2secs" --executor_shutdown_grace_period="5secs"
--fetcher_cache_dir="/tmp/Endpoint_SlaveEndpointTest_UnauthorizedRequest_0_gG7oWM/fetch" --fetcher_cache_size="2GB"
--frameworks_home="" --gc_delay="1weeks" --gc_disk_headroom="0.1" --hadoop_home="" --help="false"
--hostname_lookup="true" --http_command_executor="false" --http_credentials="/tmp/Endpoint_SlaveEndpointTest_UnauthorizedRequest_0_gG7oWM/http_credentials"
--http_heartbeat_interval="30secs" --initialize_driver_logging="true" --isolation="posix/cpu,posix/mem"
--launcher="posix" --launcher_dir="/mesos/mesos-1.5.0/_build/src" --logbufsecs="0" --logging_level="INFO"
--max_completed_executors_per_framework="150" --oversubscribed_resources_interval="15secs"
--perf_duration="10secs" --perf_interval="1mins" --port="5051" --qos_correction_interval_min="0ns"
--quiet="false" --recover="reconnect" --recovery_timeout="15mins" --registration_backoff_factor="10ms"
--resources="cpus:2;gpus:0;mem:1024;disk:1024;ports:[31000-32000]" --revocable_cpu_low_priority="true"
--runtime_dir="/tmp/Endpoint_SlaveEndpointTest_UnauthorizedRequest_0_gG7oWM" --sandbox_directory="/mnt/mesos/sandbox"
--strict="true" --switch_user="true" --systemd_enable_support="true" --systemd_runtime_directory="/run/systemd/system"
--version="false" --work_dir="/tmp/Endpoint_SlaveEndpointTest_UnauthorizedRequest_0_2nVquj"
I0825 04:45:58.498723  6730 credentials.hpp:86] Loading credential for authentication from
'/tmp/Endpoint_SlaveEndpointTest_UnauthorizedRequest_0_gG7oWM/credential'
I0825 04:45:58.498883  6730 slave.cpp:285] Agent using credential for: test-principal
I0825 04:45:58.498905  6730 credentials.hpp:37] Loading credentials for authentication from
'/tmp/Endpoint_SlaveEndpointTest_UnauthorizedRequest_0_gG7oWM/http_credentials'
I0825 04:45:58.499179  6730 http.cpp:1026] Creating default 'basic' HTTP authenticator for
realm 'mesos-agent-readonly'
I0825 04:45:58.499382  6730 http.cpp:1026] Creating default 'basic' HTTP authenticator for
realm 'mesos-agent-readwrite'
I0825 04:45:58.500869  6730 slave.cpp:581] Agent resources: [{"name":"cpus","scalar":{"value":2.0},"type":"SCALAR"},{"name":"mem","scalar":{"value":1024.0},"type":"SCALAR"},{"name":"disk","scalar":{"value":1024.0},"type":"SCALAR"},{"name":"ports","ranges":{"range":[{"begin":31000,"end":32000}]},"type":"RANGES"}]
I0825 04:45:58.501143  6730 slave.cpp:589] Agent attributes: [  ]
I0825 04:45:58.501174  6730 slave.cpp:598] Agent hostname: 94d03570fded
I0825 04:45:58.501340  6718 status_update_manager.cpp:177] Pausing sending status updates
I0825 04:45:58.502956  6732 state.cpp:64] Recovering state from '/tmp/Endpoint_SlaveEndpointTest_UnauthorizedRequest_0_2nVquj/meta'
I0825 04:45:58.503478  6727 status_update_manager.cpp:203] Recovering status update manager
I0825 04:45:58.503708  6717 containerizer.cpp:643] Recovering containerizer
I0825 04:45:58.505424  6720 provisioner.cpp:416] Provisioner recovery complete
I0825 04:45:58.505818  6711 slave.cpp:6264] Finished recovery
I0825 04:45:58.506520  6711 slave.cpp:6446] Querying resource estimator for oversubscribable
resources
I0825 04:45:58.506929  6711 slave.cpp:6460] Received oversubscribable resources {} from the
resource estimator
I0825 04:45:58.510962  6726 process.cpp:3933] Handling HTTP event for process 'slave(800)'
with path: '/slave(800)/monitor/statistics'
I0825 04:45:58.512640  6723 http.cpp:1166] HTTP GET for /slave(800)/monitor/statistics from
172.17.0.11:46876
I0825 04:45:58.512835  6723 http.cpp:957] Authorizing principal 'test-principal' to GET the
'/monitor/statistics' endpoint
I0825 04:45:58.515645  6690 slave.cpp:859] Agent terminating
[       OK ] Endpoint/SlaveEndpointTest.UnauthorizedRequest/0 (41 ms)
[ RUN      ] Endpoint/SlaveEndpointTest.UnauthorizedRequest/1
I0825 04:45:58.535630  6690 containerizer.cpp:288] Using isolation { environment_secret, posix/cpu,
posix/mem, filesystem/posix, network/cni }
W0825 04:45:58.536352  6690 backend.cpp:76] Failed to create 'aufs' backend: AufsBackend requires
root privileges
W0825 04:45:58.536481  6690 backend.cpp:76] Failed to create 'bind' backend: BindBackend requires
root privileges
I0825 04:45:58.536522  6690 provisioner.cpp:255] Using default backend 'copy'
I0825 04:45:58.541018  6712 slave.cpp:252] Mesos agent started on (801)@172.17.0.11:39727
I0825 04:45:58.541132  6712 slave.cpp:253] Flags at startup: --acls="" --appc_simple_discovery_uri_prefix="http://"
--appc_store_dir="/tmp/Endpoint_SlaveEndpointTest_UnauthorizedRequest_1_e0Sa5G/store/appc"
--authenticate_http_readonly="true" --authenticate_http_readwrite="true" --authenticatee="crammd5"
--authentication_backoff_factor="1secs" --authorizer="local" --cgroups_cpu_enable_pids_and_tids_count="false"
--cgroups_enable_cfs="false" --cgroups_hierarchy="/sys/fs/cgroup" --cgroups_limit_swap="false"
--cgroups_root="mesos" --container_disk_watch_interval="15secs" --containerizers="mesos" --credential="/tmp/Endpoint_SlaveEndpointTest_UnauthorizedRequest_1_e0Sa5G/credential"
--default_role="*" --disallow_sharing_agent_pid_namespace="false" --disk_watch_interval="1mins"
--docker="docker" --docker_kill_orphans="true" --docker_registry="https://registry-1.docker.io"
--docker_remove_delay="6hrs" --docker_socket="/var/run/docker.sock" --docker_stop_timeout="0ns"
--docker_store_dir="/tmp/Endpoint_SlaveEndpointTest_UnauthorizedRequest_1_e0Sa5G/store/docker"
--docker_volume_checkpoint_dir="/var/run/mesos/isolators/docker/volume" --enforce_container_disk_quota="false"
--executor_registration_timeout="1mins" --executor_reregistration_timeout="2secs" --executor_shutdown_grace_period="5secs"
--fetcher_cache_dir="/tmp/Endpoint_SlaveEndpointTest_UnauthorizedRequest_1_e0Sa5G/fetch" --fetcher_cache_size="2GB"
--frameworks_home="" --gc_delay="1weeks" --gc_disk_headroom="0.1" --hadoop_home="" --help="false"
--hostname_lookup="true" --http_command_executor="false" --http_credentials="/tmp/Endpoint_SlaveEndpointTest_UnauthorizedRequest_1_e0Sa5G/http_credentials"
--http_heartbeat_interval="30secs" --initialize_driver_logging="true" --isolation="posix/cpu,posix/mem"
--launcher="posix" --launcher_dir="/mesos/mesos-1.5.0/_build/src" --logbufsecs="0" --logging_level="INFO"
--max_completed_executors_per_framework="150" --oversubscribed_resources_interval="15secs"
--perf_duration="10secs" --perf_interval="1mins" --port="5051" --qos_correction_interval_min="0ns"
--quiet="false" --recover="reconnect" --recovery_timeout="15mins" --registration_backoff_factor="10ms"
--resources="cpus:2;gpus:0;mem:1024;disk:1024;ports:[31000-32000]" --revocable_cpu_low_priority="true"
--runtime_dir="/tmp/Endpoint_SlaveEndpointTest_UnauthorizedRequest_1_e0Sa5G" --sandbox_directory="/mnt/mesos/sandbox"
--strict="true" --switch_user="true" --systemd_enable_support="true" --systemd_runtime_directory="/run/systemd/system"
--version="false" --work_dir="/tmp/Endpoint_SlaveEndpointTest_UnauthorizedRequest_1_wZlUwd"
I0825 04:45:58.541877  6712 credentials.hpp:86] Loading credential for authentication from
'/tmp/Endpoint_SlaveEndpointTest_UnauthorizedRequest_1_e0Sa5G/credential'
I0825 04:45:58.542201  6712 slave.cpp:285] Agent using credential for: test-principal
I0825 04:45:58.542256  6712 credentials.hpp:37] Loading credentials for authentication from
'/tmp/Endpoint_SlaveEndpointTest_UnauthorizedRequest_1_e0Sa5G/http_credentials'
I0825 04:45:58.542649  6712 http.cpp:1026] Creating default 'basic' HTTP authenticator for
realm 'mesos-agent-readonly'
I0825 04:45:58.542860  6712 http.cpp:1026] Creating default 'basic' HTTP authenticator for
realm 'mesos-agent-readwrite'
I0825 04:45:58.544353  6712 slave.cpp:581] Agent resources: [{"name":"cpus","scalar":{"value":2.0},"type":"SCALAR"},{"name":"mem","scalar":{"value":1024.0},"type":"SCALAR"},{"name":"disk","scalar":{"value":1024.0},"type":"SCALAR"},{"name":"ports","ranges":{"range":[{"begin":31000,"end":32000}]},"type":"RANGES"}]
I0825 04:45:58.544592  6712 slave.cpp:589] Agent attributes: [  ]
I0825 04:45:58.544608  6712 slave.cpp:598] Agent hostname: 94d03570fded
I0825 04:45:58.544761  6716 status_update_manager.cpp:177] Pausing sending status updates
I0825 04:45:58.546327  6725 state.cpp:64] Recovering state from '/tmp/Endpoint_SlaveEndpointTest_UnauthorizedRequest_1_wZlUwd/meta'
I0825 04:45:58.546850  6718 status_update_manager.cpp:203] Recovering status update manager
I0825 04:45:58.547178  6720 containerizer.cpp:643] Recovering containerizer
I0825 04:45:58.549088  6709 provisioner.cpp:416] Provisioner recovery complete
I0825 04:45:58.549471  6712 slave.cpp:6264] Finished recovery
I0825 04:45:58.549978  6712 slave.cpp:6446] Querying resource estimator for oversubscribable
resources
I0825 04:45:58.550266  6732 slave.cpp:6460] Received oversubscribable resources {} from the
resource estimator
I0825 04:45:58.553869  6716 process.cpp:3933] Handling HTTP event for process 'slave(801)'
with path: '/slave(801)/monitor/statistics.json'
I0825 04:45:58.555357  6731 http.cpp:1166] HTTP GET for /slave(801)/monitor/statistics.json
from 172.17.0.11:46880
I0825 04:45:58.555434  6731 http.cpp:957] Authorizing principal 'test-principal' to GET the
'/monitor/statistics.json' endpoint
I0825 04:45:58.557808  6690 slave.cpp:859] Agent terminating
[       OK ] Endpoint/SlaveEndpointTest.UnauthorizedRequest/1 (35 ms)
[ RUN      ] Endpoint/SlaveEndpointTest.UnauthorizedRequest/2
I0825 04:45:58.569820  6690 containerizer.cpp:288] Using isolation { environment_secret, posix/cpu,
posix/mem, filesystem/posix, network/cni }
W0825 04:45:58.570305  6690 backend.cpp:76] Failed to create 'aufs' backend: AufsBackend requires
root privileges
W0825 04:45:58.570408  6690 backend.cpp:76] Failed to create 'bind' backend: BindBackend requires
root privileges
I0825 04:45:58.570441  6690 provisioner.cpp:255] Using default backend 'copy'
I0825 04:45:58.574009  6715 slave.cpp:252] Mesos agent started on (802)@172.17.0.11:39727
I0825 04:45:58.574040  6715 slave.cpp:253] Flags at startup: --acls="" --appc_simple_discovery_uri_prefix="http://"
--appc_store_dir="/tmp/Endpoint_SlaveEndpointTest_UnauthorizedRequest_2_cPQbAB/store/appc"
--authenticate_http_readonly="true" --authenticate_http_readwrite="true" --authenticatee="crammd5"
--authentication_backoff_factor="1secs" --authorizer="local" --cgroups_cpu_enable_pids_and_tids_count="false"
--cgroups_enable_cfs="false" --cgroups_hierarchy="/sys/fs/cgroup" --cgroups_limit_swap="false"
--cgroups_root="mesos" --container_disk_watch_interval="15secs" --containerizers="mesos" --credential="/tmp/Endpoint_SlaveEndpointTest_UnauthorizedRequest_2_cPQbAB/credential"
--default_role="*" --disallow_sharing_agent_pid_namespace="false" --disk_watch_interval="1mins"
--docker="docker" --docker_kill_orphans="true" --docker_registry="https://registry-1.docker.io"
--docker_remove_delay="6hrs" --docker_socket="/var/run/docker.sock" --docker_stop_timeout="0ns"
--docker_store_dir="/tmp/Endpoint_SlaveEndpointTest_UnauthorizedRequest_2_cPQbAB/store/docker"
--docker_volume_checkpoint_dir="/var/run/mesos/isolators/docker/volume" --enforce_container_disk_quota="false"
--executor_registration_timeout="1mins" --executor_reregistration_timeout="2secs" --executor_shutdown_grace_period="5secs"
--fetcher_cache_dir="/tmp/Endpoint_SlaveEndpointTest_UnauthorizedRequest_2_cPQbAB/fetch" --fetcher_cache_size="2GB"
--frameworks_home="" --gc_delay="1weeks" --gc_disk_headroom="0.1" --hadoop_home="" --help="false"
--hostname_lookup="true" --http_command_executor="false" --http_credentials="/tmp/Endpoint_SlaveEndpointTest_UnauthorizedRequest_2_cPQbAB/http_credentials"
--http_heartbeat_interval="30secs" --initialize_driver_logging="true" --isolation="posix/cpu,posix/mem"
--launcher="posix" --launcher_dir="/mesos/mesos-1.5.0/_build/src" --logbufsecs="0" --logging_level="INFO"
--max_completed_executors_per_framework="150" --oversubscribed_resources_interval="15secs"
--perf_duration="10secs" --perf_interval="1mins" --port="5051" --qos_correction_interval_min="0ns"
--quiet="false" --recover="reconnect" --recovery_timeout="15mins" --registration_backoff_factor="10ms"
--resources="cpus:2;gpus:0;mem:1024;disk:1024;ports:[31000-32000]" --revocable_cpu_low_priority="true"
--runtime_dir="/tmp/Endpoint_SlaveEndpointTest_UnauthorizedRequest_2_cPQbAB" --sandbox_directory="/mnt/mesos/sandbox"
--strict="true" --switch_user="true" --systemd_enable_support="true" --systemd_runtime_directory="/run/systemd/system"
--version="false" --work_dir="/tmp/Endpoint_SlaveEndpointTest_UnauthorizedRequest_2_QWRHW7"
I0825 04:45:58.574503  6715 credentials.hpp:86] Loading credential for authentication from
'/tmp/Endpoint_SlaveEndpointTest_UnauthorizedRequest_2_cPQbAB/credential'
I0825 04:45:58.574659  6715 slave.cpp:285] Agent using credential for: test-principal
I0825 04:45:58.574686  6715 credentials.hpp:37] Loading credentials for authentication from
'/tmp/Endpoint_SlaveEndpointTest_UnauthorizedRequest_2_cPQbAB/http_credentials'
I0825 04:45:58.574972  6715 http.cpp:1026] Creating default 'basic' HTTP authenticator for
realm 'mesos-agent-readonly'
I0825 04:45:58.575136  6715 http.cpp:1026] Creating default 'basic' HTTP authenticator for
realm 'mesos-agent-readwrite'
I0825 04:45:58.576521  6715 slave.cpp:581] Agent resources: [{"name":"cpus","scalar":{"value":2.0},"type":"SCALAR"},{"name":"mem","scalar":{"value":1024.0},"type":"SCALAR"},{"name":"disk","scalar":{"value":1024.0},"type":"SCALAR"},{"name":"ports","ranges":{"range":[{"begin":31000,"end":32000}]},"type":"RANGES"}]
I0825 04:45:58.576753  6715 slave.cpp:589] Agent attributes: [  ]
I0825 04:45:58.576768  6715 slave.cpp:598] Agent hostname: 94d03570fded
I0825 04:45:58.576898  6710 status_update_manager.cpp:177] Pausing sending status updates
I0825 04:45:58.578323  6732 state.cpp:64] Recovering state from '/tmp/Endpoint_SlaveEndpointTest_UnauthorizedRequest_2_QWRHW7/meta'
I0825 04:45:58.578680  6716 status_update_manager.cpp:203] Recovering status update manager
I0825 04:45:58.578902  6724 containerizer.cpp:643] Recovering containerizer
I0825 04:45:58.580324  6729 provisioner.cpp:416] Provisioner recovery complete
I0825 04:45:58.580691  6712 slave.cpp:6264] Finished recovery
I0825 04:45:58.581164  6712 slave.cpp:6446] Querying resource estimator for oversubscribable
resources
I0825 04:45:58.581485  6713 slave.cpp:6460] Received oversubscribable resources {} from the
resource estimator
I0825 04:45:58.584695  6731 process.cpp:3933] Handling HTTP event for process 'slave(802)'
with path: '/slave(802)/containers'
I0825 04:45:58.586030  6726 http.cpp:1166] HTTP GET for /slave(802)/containers from 172.17.0.11:46882
I0825 04:45:58.586099  6726 http.cpp:957] Authorizing principal 'test-principal' to GET the
'/containers' endpoint
I0825 04:45:58.588601  6690 slave.cpp:859] Agent terminating
[       OK ] Endpoint/SlaveEndpointTest.UnauthorizedRequest/2 (31 ms)
[ RUN      ] Endpoint/SlaveEndpointTest.NoAuthorizer/0
I0825 04:45:58.601617  6690 containerizer.cpp:288] Using isolation { environment_secret, posix/cpu,
posix/mem, filesystem/posix, network/cni }
W0825 04:45:58.602109  6690 backend.cpp:76] Failed to create 'aufs' backend: AufsBackend requires
root privileges
W0825 04:45:58.602219  6690 backend.cpp:76] Failed to create 'bind' backend: BindBackend requires
root privileges
I0825 04:45:58.602250  6690 provisioner.cpp:255] Using default backend 'copy'
I0825 04:45:58.603808  6690 cluster.cpp:448] Creating default 'local' authorizer
I0825 04:45:58.605865  6731 slave.cpp:252] Mesos agent started on (803)@172.17.0.11:39727
I0825 04:45:58.605902  6731 slave.cpp:253] Flags at startup: --acls="" --appc_simple_discovery_uri_prefix="http://"
--appc_store_dir="/tmp/Endpoint_SlaveEndpointTest_NoAuthorizer_0_UrTTnw/store/appc" --authenticate_http_readonly="true"
--authenticate_http_readwrite="true" --authenticatee="crammd5" --authentication_backoff_factor="1secs"
--authorizer="local" --cgroups_cpu_enable_pids_and_tids_count="false" --cgroups_enable_cfs="false"
--cgroups_hierarchy="/sys/fs/cgroup" --cgroups_limit_swap="false" --cgroups_root="mesos" --container_disk_watch_interval="15secs"
--containerizers="mesos" --credential="/tmp/Endpoint_SlaveEndpointTest_NoAuthorizer_0_UrTTnw/credential"
--default_role="*" --disallow_sharing_agent_pid_namespace="false" --disk_watch_interval="1mins"
--docker="docker" --docker_kill_orphans="true" --docker_registry="https://registry-1.docker.io"
--docker_remove_delay="6hrs" --docker_socket="/var/run/docker.sock" --docker_stop_timeout="0ns"
--docker_store_dir="/tmp/Endpoint_SlaveEndpointTest_NoAuthorizer_0_UrTTnw/store/docker" --docker_volume_checkpoint_dir="/var/run/mesos/isolators/docker/volume"
--enforce_container_disk_quota="false" --executor_registration_timeout="1mins" --executor_reregistration_timeout="2secs"
--executor_shutdown_grace_period="5secs" --fetcher_cache_dir="/tmp/Endpoint_SlaveEndpointTest_NoAuthorizer_0_UrTTnw/fetch"
--fetcher_cache_size="2GB" --frameworks_home="" --gc_delay="1weeks" --gc_disk_headroom="0.1"
--hadoop_home="" --help="false" --hostname_lookup="true" --http_command_executor="false" --http_credentials="/tmp/Endpoint_SlaveEndpointTest_NoAuthorizer_0_UrTTnw/http_credentials"
--http_heartbeat_interval="30secs" --initialize_driver_logging="true" --isolation="posix/cpu,posix/mem"
--launcher="posix" --launcher_dir="/mesos/mesos-1.5.0/_build/src" --logbufsecs="0" --logging_level="INFO"
--max_completed_executors_per_framework="150" --oversubscribed_resources_interval="15secs"
--perf_duration="10secs" --perf_interval="1mins" --port="5051" --qos_correction_interval_min="0ns"
--quiet="false" --recover="reconnect" --recovery_timeout="15mins" --registration_backoff_factor="10ms"
--resources="cpus:2;gpus:0;mem:1024;disk:1024;ports:[31000-32000]" --revocable_cpu_low_priority="true"
--runtime_dir="/tmp/Endpoint_SlaveEndpointTest_NoAuthorizer_0_UrTTnw" --sandbox_directory="/mnt/mesos/sandbox"
--strict="true" --switch_user="true" --systemd_enable_support="true" --systemd_runtime_directory="/run/systemd/system"
--version="false" --work_dir="/tmp/Endpoint_SlaveEndpointTest_NoAuthorizer_0_2JNJF2"
I0825 04:45:58.606683  6731 credentials.hpp:86] Loading credential for authentication from
'/tmp/Endpoint_SlaveEndpointTest_NoAuthorizer_0_UrTTnw/credential'
I0825 04:45:58.606956  6731 slave.cpp:285] Agent using credential for: test-principal
I0825 04:45:58.606978  6731 credentials.hpp:37] Loading credentials for authentication from
'/tmp/Endpoint_SlaveEndpointTest_NoAuthorizer_0_UrTTnw/http_credentials'
I0825 04:45:58.607357  6731 http.cpp:1026] Creating default 'basic' HTTP authenticator for
realm 'mesos-agent-readonly'
I0825 04:45:58.607599  6731 http.cpp:1026] Creating default 'basic' HTTP authenticator for
realm 'mesos-agent-readwrite'
I0825 04:45:58.610038  6731 slave.cpp:581] Agent resources: [{"name":"cpus","scalar":{"value":2.0},"type":"SCALAR"},{"name":"mem","scalar":{"value":1024.0},"type":"SCALAR"},{"name":"disk","scalar":{"value":1024.0},"type":"SCALAR"},{"name":"ports","ranges":{"range":[{"begin":31000,"end":32000}]},"type":"RANGES"}]
I0825 04:45:58.610371  6731 slave.cpp:589] Agent attributes: [  ]
I0825 04:45:58.610411  6731 slave.cpp:598] Agent hostname: 94d03570fded
I0825 04:45:58.610594  6711 status_update_manager.cpp:177] Pausing sending status updates
I0825 04:45:58.612952  6714 state.cpp:64] Recovering state from '/tmp/Endpoint_SlaveEndpointTest_NoAuthorizer_0_2JNJF2/meta'
I0825 04:45:58.613343  6712 status_update_manager.cpp:203] Recovering status update manager
I0825 04:45:58.613528  6712 containerizer.cpp:643] Recovering containerizer
I0825 04:45:58.614764  6722 provisioner.cpp:416] Provisioner recovery complete
I0825 04:45:58.615164  6720 slave.cpp:6264] Finished recovery
I0825 04:45:58.615669  6720 slave.cpp:6446] Querying resource estimator for oversubscribable
resources
I0825 04:45:58.615996  6732 slave.cpp:6460] Received oversubscribable resources {} from the
resource estimator
I0825 04:45:58.618448  6716 process.cpp:3933] Handling HTTP event for process 'slave(803)'
with path: '/slave(803)/monitor/statistics'
I0825 04:45:58.619954  6714 http.cpp:1166] HTTP GET for /slave(803)/monitor/statistics from
172.17.0.11:46886
I0825 04:45:58.620085  6714 http.cpp:957] Authorizing principal 'test-principal' to GET the
'/monitor/statistics' endpoint
I0825 04:45:58.624639  6690 slave.cpp:859] Agent terminating
[       OK ] Endpoint/SlaveEndpointTest.NoAuthorizer/0 (35 ms)
[ RUN      ] Endpoint/SlaveEndpointTest.NoAuthorizer/1
I0825 04:45:58.641728  6690 containerizer.cpp:288] Using isolation { environment_secret, posix/cpu,
posix/mem, filesystem/posix, network/cni }
W0825 04:45:58.642683  6690 backend.cpp:76] Failed to create 'aufs' backend: AufsBackend requires
root privileges
W0825 04:45:58.642899  6690 backend.cpp:76] Failed to create 'bind' backend: BindBackend requires
root privileges
I0825 04:45:58.642949  6690 provisioner.cpp:255] Using default backend 'copy'
I0825 04:45:58.646420  6690 cluster.cpp:448] Creating default 'local' authorizer
I0825 04:45:58.650353  6714 slave.cpp:252] Mesos agent started on (804)@172.17.0.11:39727
I0825 04:45:58.650399  6714 slave.cpp:253] Flags at startup: --acls="" --appc_simple_discovery_uri_prefix="http://"
--appc_store_dir="/tmp/Endpoint_SlaveEndpointTest_NoAuthorizer_1_OvVgxr/store/appc" --authenticate_http_readonly="true"
--authenticate_http_readwrite="true" --authenticatee="crammd5" --authentication_backoff_factor="1secs"
--authorizer="local" --cgroups_cpu_enable_pids_and_tids_count="false" --cgroups_enable_cfs="false"
--cgroups_hierarchy="/sys/fs/cgroup" --cgroups_limit_swap="false" --cgroups_root="mesos" --container_disk_watch_interval="15secs"
--containerizers="mesos" --credential="/tmp/Endpoint_SlaveEndpointTest_NoAuthorizer_1_OvVgxr/credential"
--default_role="*" --disallow_sharing_agent_pid_namespace="false" --disk_watch_interval="1mins"
--docker="docker" --docker_kill_orphans="true" --docker_registry="https://registry-1.docker.io"
--docker_remove_delay="6hrs" --docker_socket="/var/run/docker.sock" --docker_stop_timeout="0ns"
--docker_store_dir="/tmp/Endpoint_SlaveEndpointTest_NoAuthorizer_1_OvVgxr/store/docker" --docker_volume_checkpoint_dir="/var/run/mesos/isolators/docker/volume"
--enforce_container_disk_quota="false" --executor_registration_timeout="1mins" --executor_reregistration_timeout="2secs"
--executor_shutdown_grace_period="5secs" --fetcher_cache_dir="/tmp/Endpoint_SlaveEndpointTest_NoAuthorizer_1_OvVgxr/fetch"
--fetcher_cache_size="2GB" --frameworks_home="" --gc_delay="1weeks" --gc_disk_headroom="0.1"
--hadoop_home="" --help="false" --hostname_lookup="true" --http_command_executor="false" --http_credentials="/tmp/Endpoint_SlaveEndpointTest_NoAuthorizer_1_OvVgxr/http_credentials"
--http_heartbeat_interval="30secs" --initialize_driver_logging="true" --isolation="posix/cpu,posix/mem"
--launcher="posix" --launcher_dir="/mesos/mesos-1.5.0/_build/src" --logbufsecs="0" --logging_level="INFO"
--max_completed_executors_per_framework="150" --oversubscribed_resources_interval="15secs"
--perf_duration="10secs" --perf_interval="1mins" --port="5051" --qos_correction_interval_min="0ns"
--quiet="false" --recover="reconnect" --recovery_timeout="15mins" --registration_backoff_factor="10ms"
--resources="cpus:2;gpus:0;mem:1024;disk:1024;ports:[31000-32000]" --revocable_cpu_low_priority="true"
--runtime_dir="/tmp/Endpoint_SlaveEndpointTest_NoAuthorizer_1_OvVgxr" --sandbox_directory="/mnt/mesos/sandbox"
--strict="true" --switch_user="true" --systemd_enable_support="true" --systemd_runtime_directory="/run/systemd/system"
--version="false" --work_dir="/tmp/Endpoint_SlaveEndpointTest_NoAuthorizer_1_wfwwJX"
I0825 04:45:58.651196  6714 credentials.hpp:86] Loading credential for authentication from
'/tmp/Endpoint_SlaveEndpointTest_NoAuthorizer_1_OvVgxr/credential'
I0825 04:45:58.651425  6714 slave.cpp:285] Agent using credential for: test-principal
I0825 04:45:58.651471  6714 credentials.hpp:37] Loading credentials for authentication from
'/tmp/Endpoint_SlaveEndpointTest_NoAuthorizer_1_OvVgxr/http_credentials'
I0825 04:45:58.651913  6714 http.cpp:1026] Creating default 'basic' HTTP authenticator for
realm 'mesos-agent-readonly'
I0825 04:45:58.652169  6714 http.cpp:1026] Creating default 'basic' HTTP authenticator for
realm 'mesos-agent-readwrite'
I0825 04:45:58.654681  6714 slave.cpp:581] Agent resources: [{"name":"cpus","scalar":{"value":2.0},"type":"SCALAR"},{"name":"mem","scalar":{"value":1024.0},"type":"SCALAR"},{"name":"disk","scalar":{"value":1024.0},"type":"SCALAR"},{"name":"ports","ranges":{"range":[{"begin":31000,"end":32000}]},"type":"RANGES"}]
I0825 04:45:58.655097  6714 slave.cpp:589] Agent attributes: [  ]
I0825 04:45:58.655128  6714 slave.cpp:598] Agent hostname: 94d03570fded
I0825 04:45:58.655305  6726 status_update_manager.cpp:177] Pausing sending status updates
I0825 04:45:58.657232  6716 state.cpp:64] Recovering state from '/tmp/Endpoint_SlaveEndpointTest_NoAuthorizer_1_wfwwJX/meta'
I0825 04:45:58.657565  6709 status_update_manager.cpp:203] Recovering status update manager
I0825 04:45:58.657757  6723 containerizer.cpp:643] Recovering containerizer
I0825 04:45:58.659512  6712 provisioner.cpp:416] Provisioner recovery complete
I0825 04:45:58.659906  6714 slave.cpp:6264] Finished recovery
I0825 04:45:58.660415  6714 slave.cpp:6446] Querying resource estimator for oversubscribable
resources
I0825 04:45:58.660706  6710 slave.cpp:6460] Received oversubscribable resources {} from the
resource estimator
I0825 04:45:58.663411  6732 process.cpp:3933] Handling HTTP event for process 'slave(804)'
with path: '/slave(804)/monitor/statistics.json'
I0825 04:45:58.664947  6722 http.cpp:1166] HTTP GET for /slave(804)/monitor/statistics.json
from 172.17.0.11:46888
I0825 04:45:58.665024  6722 http.cpp:957] Authorizing principal 'test-principal' to GET the
'/monitor/statistics.json' endpoint
I0825 04:45:58.669010  6690 slave.cpp:859] Agent terminating
[       OK ] Endpoint/SlaveEndpointTest.NoAuthorizer/1 (45 ms)
[ RUN      ] Endpoint/SlaveEndpointTest.NoAuthorizer/2
I0825 04:45:58.683337  6690 containerizer.cpp:288] Using isolation { environment_secret, posix/cpu,
posix/mem, filesystem/posix, network/cni }
W0825 04:45:58.683985  6690 backend.cpp:76] Failed to create 'aufs' backend: AufsBackend requires
root privileges
W0825 04:45:58.684159  6690 backend.cpp:76] Failed to create 'bind' backend: BindBackend requires
root privileges
I0825 04:45:58.684190  6690 provisioner.cpp:255] Using default backend 'copy'
I0825 04:45:58.686614  6690 cluster.cpp:448] Creating default 'local' authorizer
I0825 04:45:58.688896  6713 slave.cpp:252] Mesos agent started on (805)@172.17.0.11:39727
I0825 04:45:58.688925  6713 slave.cpp:253] Flags at startup: --acls="" --appc_simple_discovery_uri_prefix="http://"
--appc_store_dir="/tmp/Endpoint_SlaveEndpointTest_NoAuthorizer_2_iwo46m/store/appc" --authenticate_http_readonly="true"
--authenticate_http_readwrite="true" --authenticatee="crammd5" --authentication_backoff_factor="1secs"
--authorizer="local" --cgroups_cpu_enable_pids_and_tids_count="false" --cgroups_enable_cfs="false"
--cgroups_hierarchy="/sys/fs/cgroup" --cgroups_limit_swap="false" --cgroups_root="mesos" --container_disk_watch_interval="15secs"
--containerizers="mesos" --credential="/tmp/Endpoint_SlaveEndpointTest_NoAuthorizer_2_iwo46m/credential"
--default_role="*" --disallow_sharing_agent_pid_namespace="false" --disk_watch_interval="1mins"
--docker="docker" --docker_kill_orphans="true" --docker_registry="https://registry-1.docker.io"
--docker_remove_delay="6hrs" --docker_socket="/var/run/docker.sock" --docker_stop_timeout="0ns"
--docker_store_dir="/tmp/Endpoint_SlaveEndpointTest_NoAuthorizer_2_iwo46m/store/docker" --docker_volume_checkpoint_dir="/var/run/mesos/isolators/docker/volume"
--enforce_container_disk_quota="false" --executor_registration_timeout="1mins" --executor_reregistration_timeout="2secs"
--executor_shutdown_grace_period="5secs" --fetcher_cache_dir="/tmp/Endpoint_SlaveEndpointTest_NoAuthorizer_2_iwo46m/fetch"
--fetcher_cache_size="2GB" --frameworks_home="" --gc_delay="1weeks" --gc_disk_headroom="0.1"
--hadoop_home="" --help="false" --hostname_lookup="true" --http_command_executor="false" --http_credentials="/tmp/Endpoint_SlaveEndpointTest_NoAuthorizer_2_iwo46m/http_credentials"
--http_heartbeat_interval="30secs" --initialize_driver_logging="true" --isolation="posix/cpu,posix/mem"
--launcher="posix" --launcher_dir="/mesos/mesos-1.5.0/_build/src" --logbufsecs="0" --logging_level="INFO"
--max_completed_executors_per_framework="150" --oversubscribed_resources_interval="15secs"
--perf_duration="10secs" --perf_interval="1mins" --port="5051" --qos_correction_interval_min="0ns"
--quiet="false" --recover="reconnect" --recovery_timeout="15mins" --registration_backoff_factor="10ms"
--resources="cpus:2;gpus:0;mem:1024;disk:1024;ports:[31000-32000]" --revocable_cpu_low_priority="true"
--runtime_dir="/tmp/Endpoint_SlaveEndpointTest_NoAuthorizer_2_iwo46m" --sandbox_directory="/mnt/mesos/sandbox"
--strict="true" --switch_user="true" --systemd_enable_support="true" --systemd_runtime_directory="/run/systemd/system"
--version="false" --work_dir="/tmp/Endpoint_SlaveEndpointTest_NoAuthorizer_2_OKcOcT"
I0825 04:45:58.689666  6713 credentials.hpp:86] Loading credential for authentication from
'/tmp/Endpoint_SlaveEndpointTest_NoAuthorizer_2_iwo46m/credential'
I0825 04:45:58.689936  6713 slave.cpp:285] Agent using credential for: test-principal
I0825 04:45:58.689975  6713 credentials.hpp:37] Loading credentials for authentication from
'/tmp/Endpoint_SlaveEndpointTest_NoAuthorizer_2_iwo46m/http_credentials'
I0825 04:45:58.690224  6713 http.cpp:1026] Creating default 'basic' HTTP authenticator for
realm 'mesos-agent-readonly'
I0825 04:45:58.690394  6713 http.cpp:1026] Creating default 'basic' HTTP authenticator for
realm 'mesos-agent-readwrite'
I0825 04:45:58.691764  6713 slave.cpp:581] Agent resources: [{"name":"cpus","scalar":{"value":2.0},"type":"SCALAR"},{"name":"mem","scalar":{"value":1024.0},"type":"SCALAR"},{"name":"disk","scalar":{"value":1024.0},"type":"SCALAR"},{"name":"ports","ranges":{"range":[{"begin":31000,"end":32000}]},"type":"RANGES"}]
I0825 04:45:58.691995  6713 slave.cpp:589] Agent attributes: [  ]
I0825 04:45:58.692009  6713 slave.cpp:598] Agent hostname: 94d03570fded
I0825 04:45:58.692183  6714 status_update_manager.cpp:177] Pausing sending status updates
I0825 04:45:58.693891  6728 state.cpp:64] Recovering state from '/tmp/Endpoint_SlaveEndpointTest_NoAuthorizer_2_OKcOcT/meta'
I0825 04:45:58.694272  6730 status_update_manager.cpp:203] Recovering status update manager
I0825 04:45:58.694586  6720 containerizer.cpp:643] Recovering containerizer
I0825 04:45:58.697064  6710 provisioner.cpp:416] Provisioner recovery complete
I0825 04:45:58.697603  6713 slave.cpp:6264] Finished recovery
I0825 04:45:58.698125  6713 slave.cpp:6446] Querying resource estimator for oversubscribable
resources
I0825 04:45:58.698427  6727 slave.cpp:6460] Received oversubscribable resources {} from the
resource estimator
I0825 04:45:58.702229  6721 process.cpp:3933] Handling HTTP event for process 'slave(805)'
with path: '/slave(805)/containers'
I0825 04:45:58.704102  6710 http.cpp:1166] HTTP GET for /slave(805)/containers from 172.17.0.11:46890
I0825 04:45:58.704179  6710 http.cpp:957] Authorizing principal 'test-principal' to GET the
'/containers' endpoint
I0825 04:45:58.709075  6716 slave.cpp:859] Agent terminating
[       OK ] Endpoint/SlaveEndpointTest.NoAuthorizer/2 (40 ms)
[----------] 9 tests from Endpoint/SlaveEndpointTest (345 ms total)

[----------] 2 tests from ContainerizerType/DefaultContainerDNSFlagTest
[ RUN      ] ContainerizerType/DefaultContainerDNSFlagTest.ValidateFlag/0
[       OK ] ContainerizerType/DefaultContainerDNSFlagTest.ValidateFlag/0 (12 ms)
[ RUN      ] ContainerizerType/DefaultContainerDNSFlagTest.ValidateFlag/1
[       OK ] ContainerizerType/DefaultContainerDNSFlagTest.ValidateFlag/1 (10 ms)
[----------] 2 tests from ContainerizerType/DefaultContainerDNSFlagTest (22 ms total)

[----------] Global test environment tear-down
[==========] 1657 tests from 182 test cases ran. (548658 ms total)
[  PASSED  ] 1656 tests.
[  FAILED  ] 1 test, listed below:
[  FAILED  ] ExamplesTest.V0JavaFramework

 1 FAILED TEST
  YOU HAVE 20 DISABLED TESTS

I0825 04:45:58.802903  6733 process.cpp:1072] Failed to accept socket: future discarded
make[4]: *** [check-local] Error 1
make[4]: Leaving directory `/mesos/mesos-1.5.0/_build/src'
make[3]: *** [check-am] Error 2
make[3]: Leaving directory `/mesos/mesos-1.5.0/_build/src'
make[2]: *** [check] Error 2
make[2]: Leaving directory `/mesos/mesos-1.5.0/_build/src'
make[1]: *** [check-recursive] Error 1
make[1]: Leaving directory `/mesos/mesos-1.5.0/_build'
make: *** [distcheck] Error 1
+ docker rmi mesos-1503633701-5988
Untagged: mesos-1503633701-5988:latest
Deleted: sha256:017191be3ced154e1c1af26e28e5307dc1d52573d802d36f190d7920418e4a4b
Deleted: sha256:3a6e5b1772813a6d64b73f7e32ebda2d87301ecd2809321375642bcab90844db
Deleted: sha256:eae2bd3207e56e73e433014e7da0ba0535e04e5d12185c06fc4b49e5629d7c0f
Deleted: sha256:985e8a7abcb5cb8c517a28b901ec3bf7e3a634846263cf1e99dd180a01266ec8
Deleted: sha256:0e4dba9284469bb1ffe08280856bd6105d4d4e6a865b032e7f2684cbab3011f0
Deleted: sha256:26fc35295bd8a3814491538cf39299db10566239f64262f0a873d62d8ab4b0ab
Deleted: sha256:8ee16ba16a0c6cdd47d3a0c9596bb43fddd3d55db0e5e8d07306d734af5c82c4
Deleted: sha256:4727d5d0a5c27d677ac599e7e2fd6d79fedf6645f31dc361aac1e81bf9a360de
Deleted: sha256:7b74defa6f0499243a658557c4d4a3bdc630e0c4d4ca20ac143ac09dee5a2153
Deleted: sha256:e19d7dc852f3a7becd4c881af20d241b9a3f3cf02cb0e4c73b0dbdc899d03cb3
Deleted: sha256:586e649ccb60a83d64c1ec56209d6c994ce885c229bdfc72535fe9048ab6fba9
Deleted: sha256:4a2c66879803190cdbb653f55188633972c663e0134d9ab9457b2f9a08d09ce5
Deleted: sha256:59022d908d875662d2b3cabb3cb9e0ce53adc6b1e082f42237fe63b687e11df3
Deleted: sha256:84e25b19137cd359cec1c7cb74501a7aae84172e6f25494dbf4378b95a08cbfe
Deleted: sha256:c62e282f72c6a9032611521f2ac605531f13f5458b56aacfadf3b00e03288db4
Deleted: sha256:36172006162e3f9f72a29093a828b4b515a70b5631370109cc6697b87ceb6297
Deleted: sha256:7405aa13aba7c65f355c3937ff861c30805010cace6c31b157fabcf5e3f9c585
Deleted: sha256:6e1301fd1068ed96cf61de0b26a050eae73811f6be7a677fbd5fa18f6d2d76c5
Deleted: sha256:67af8334c2acf15f9df705f4fc24ca74c0add59ecaef206fa680659a239ca5d7
Deleted: sha256:46e50bddda10d32dfdc32cfcd5264b71f98508008ede21916ce25ada68563909
Deleted: sha256:2a61bd1dece8e74de7c556274d6dcedc2cb2b63152f8deb0f8a649caea690f50
Deleted: sha256:d8f084d945254b6ee28e74aa93016193272f7c576159a94781da4c22f7c46175
Deleted: sha256:90e03ae21c0a4b180efa53d1f200f4ba09766a5f722a9ee319cd96a521cba10b
Deleted: sha256:e83172bff0f08bb41df4e579fa20efe98bd672f41fa03a36cb8ad7eaecb5424a
Deleted: sha256:80c87ec348df72e0a4cbe567c529edc8106f6541894741e118f8b20567d4d52e
Build step 'Execute shell' marked build as failure
Not sending mail to unregistered user yujie.jay@gmail.com
Not sending mail to unregistered user xujyan@apple.com

Mime
View raw message