mesos-builds mailing list archives

Site index · List index
Message view « Date » · « Thread »
Top « Date » · « Thread »
From Apache Jenkins Server <jenk...@builds.apache.org>
Subject Build failed in Jenkins: Mesos-Reviewbot #18997
Date Wed, 23 Aug 2017 18:59:03 GMT
See <https://builds.apache.org/job/Mesos-Reviewbot/18997/display/redirect>

------------------------------------------
[...truncated 31.10 MB...]
I0823 18:58:48.990209  5388 slave.cpp:285] Agent using credential for: test-principal
I0823 18:58:48.990238  5388 credentials.hpp:37] Loading credentials for authentication from
'/tmp/Endpoint_SlaveEndpointTest_AuthorizedRequest_2_vSMwIA/http_credentials'
I0823 18:58:48.990613  5388 http.cpp:1026] Creating default 'basic' HTTP authenticator for
realm 'mesos-agent-readonly'
I0823 18:58:48.990896  5388 http.cpp:1026] Creating default 'basic' HTTP authenticator for
realm 'mesos-agent-readwrite'
I0823 18:58:48.993145  5388 slave.cpp:581] Agent resources: [{"name":"cpus","scalar":{"value":2.0},"type":"SCALAR"},{"name":"mem","scalar":{"value":1024.0},"type":"SCALAR"},{"name":"disk","scalar":{"value":1024.0},"type":"SCALAR"},{"name":"ports","ranges":{"range":[{"begin":31000,"end":32000}]},"type":"RANGES"}]
I0823 18:58:48.993587  5388 slave.cpp:589] Agent attributes: [  ]
I0823 18:58:48.993609  5388 slave.cpp:598] Agent hostname: 083ec0b93bae
I0823 18:58:48.993837  5391 status_update_manager.cpp:177] Pausing sending status updates
I0823 18:58:48.995957  5385 state.cpp:64] Recovering state from '/tmp/Endpoint_SlaveEndpointTest_AuthorizedRequest_2_6rUhM2/meta'
I0823 18:58:48.996330  5384 status_update_manager.cpp:203] Recovering status update manager
I0823 18:58:48.996654  5388 containerizer.cpp:643] Recovering containerizer
I0823 18:58:48.998797  5388 provisioner.cpp:416] Provisioner recovery complete
I0823 18:58:48.999284  5385 slave.cpp:6226] Finished recovery
I0823 18:58:48.999908  5385 slave.cpp:6408] Querying resource estimator for oversubscribable
resources
I0823 18:58:49.000310  5389 slave.cpp:6422] Received oversubscribable resources {} from the
resource estimator
I0823 18:58:49.004314  5391 process.cpp:3933] Handling HTTP event for process 'slave(801)'
with path: '/slave(801)/containers'
I0823 18:58:49.006382  5385 http.cpp:1166] HTTP GET for /slave(801)/containers from 172.17.0.2:60926
I0823 18:58:49.006500  5385 http.cpp:957] Authorizing principal 'test-principal' to GET the
'/containers' endpoint
I0823 18:58:49.011965  5365 slave.cpp:859] Agent terminating
[       OK ] Endpoint/SlaveEndpointTest.AuthorizedRequest/2 (47 ms)
[ RUN      ] Endpoint/SlaveEndpointTest.UnauthorizedRequest/0
I0823 18:58:49.030654  5365 containerizer.cpp:288] Using isolation { environment_secret, posix/cpu,
posix/mem, filesystem/posix, network/cni }
W0823 18:58:49.031646  5365 backend.cpp:76] Failed to create 'overlay' backend: OverlayBackend
requires root privileges
W0823 18:58:49.031867  5365 backend.cpp:76] Failed to create 'bind' backend: BindBackend requires
root privileges
I0823 18:58:49.031908  5365 provisioner.cpp:255] Using default backend 'copy'
I0823 18:58:49.037963  5388 slave.cpp:252] Mesos agent started on (802)@172.17.0.2:37313
I0823 18:58:49.038007  5388 slave.cpp:253] Flags at startup: --acls="" --appc_simple_discovery_uri_prefix="http://"
--appc_store_dir="/tmp/Endpoint_SlaveEndpointTest_UnauthorizedRequest_0_ziuQTM/store/appc"
--authenticate_http_readonly="true" --authenticate_http_readwrite="true" --authenticatee="crammd5"
--authentication_backoff_factor="1secs" --authorizer="local" --cgroups_cpu_enable_pids_and_tids_count="false"
--cgroups_enable_cfs="false" --cgroups_hierarchy="/sys/fs/cgroup" --cgroups_limit_swap="false"
--cgroups_root="mesos" --container_disk_watch_interval="15secs" --containerizers="mesos" --credential="/tmp/Endpoint_SlaveEndpointTest_UnauthorizedRequest_0_ziuQTM/credential"
--default_role="*" --disallow_sharing_agent_pid_namespace="false" --disk_watch_interval="1mins"
--docker="docker" --docker_kill_orphans="true" --docker_registry="https://registry-1.docker.io"
--docker_remove_delay="6hrs" --docker_socket="/var/run/docker.sock" --docker_stop_timeout="0ns"
--docker_store_dir="/tmp/Endpoint_SlaveEndpointTest_UnauthorizedRequest_0_ziuQTM/store/docker"
--docker_volume_checkpoint_dir="/var/run/mesos/isolators/docker/volume" --enforce_container_disk_quota="false"
--executor_registration_timeout="1mins" --executor_reregistration_timeout="2secs" --executor_shutdown_grace_period="5secs"
--fetcher_cache_dir="/tmp/Endpoint_SlaveEndpointTest_UnauthorizedRequest_0_ziuQTM/fetch" --fetcher_cache_size="2GB"
--frameworks_home="" --gc_delay="1weeks" --gc_disk_headroom="0.1" --hadoop_home="" --help="false"
--hostname_lookup="true" --http_command_executor="false" --http_credentials="/tmp/Endpoint_SlaveEndpointTest_UnauthorizedRequest_0_ziuQTM/http_credentials"
--http_heartbeat_interval="30secs" --initialize_driver_logging="true" --isolation="posix/cpu,posix/mem"
--launcher="posix" --launcher_dir="/mesos/mesos-1.5.0/_build/src" --logbufsecs="0" --logging_level="INFO"
--max_completed_executors_per_framework="150" --oversubscribed_resources_interval="15secs"
--perf_duration="10secs" --perf_interval="1mins" --port="5051" --qos_correction_interval_min="0ns"
--quiet="false" --recover="reconnect" --recovery_timeout="15mins" --registration_backoff_factor="10ms"
--resources="cpus:2;gpus:0;mem:1024;disk:1024;ports:[31000-32000]" --revocable_cpu_low_priority="true"
--runtime_dir="/tmp/Endpoint_SlaveEndpointTest_UnauthorizedRequest_0_ziuQTM" --sandbox_directory="/mnt/mesos/sandbox"
--strict="true" --switch_user="true" --systemd_enable_support="true" --systemd_runtime_directory="/run/systemd/system"
--version="false" --work_dir="/tmp/Endpoint_SlaveEndpointTest_UnauthorizedRequest_0_sRwNPe"
I0823 18:58:49.038806  5388 credentials.hpp:86] Loading credential for authentication from
'/tmp/Endpoint_SlaveEndpointTest_UnauthorizedRequest_0_ziuQTM/credential'
I0823 18:58:49.039149  5388 slave.cpp:285] Agent using credential for: test-principal
I0823 18:58:49.039176  5388 credentials.hpp:37] Loading credentials for authentication from
'/tmp/Endpoint_SlaveEndpointTest_UnauthorizedRequest_0_ziuQTM/http_credentials'
I0823 18:58:49.039625  5388 http.cpp:1026] Creating default 'basic' HTTP authenticator for
realm 'mesos-agent-readonly'
I0823 18:58:49.040030  5388 http.cpp:1026] Creating default 'basic' HTTP authenticator for
realm 'mesos-agent-readwrite'
I0823 18:58:49.042300  5388 slave.cpp:581] Agent resources: [{"name":"cpus","scalar":{"value":2.0},"type":"SCALAR"},{"name":"mem","scalar":{"value":1024.0},"type":"SCALAR"},{"name":"disk","scalar":{"value":1024.0},"type":"SCALAR"},{"name":"ports","ranges":{"range":[{"begin":31000,"end":32000}]},"type":"RANGES"}]
I0823 18:58:49.042779  5388 slave.cpp:589] Agent attributes: [  ]
I0823 18:58:49.042803  5388 slave.cpp:598] Agent hostname: 083ec0b93bae
I0823 18:58:49.043020  5390 status_update_manager.cpp:177] Pausing sending status updates
I0823 18:58:49.045173  5387 state.cpp:64] Recovering state from '/tmp/Endpoint_SlaveEndpointTest_UnauthorizedRequest_0_sRwNPe/meta'
I0823 18:58:49.045667  5384 status_update_manager.cpp:203] Recovering status update manager
I0823 18:58:49.045924  5387 containerizer.cpp:643] Recovering containerizer
I0823 18:58:49.048050  5387 provisioner.cpp:416] Provisioner recovery complete
I0823 18:58:49.048811  5388 slave.cpp:6226] Finished recovery
I0823 18:58:49.049582  5388 slave.cpp:6408] Querying resource estimator for oversubscribable
resources
I0823 18:58:49.050055  5388 slave.cpp:6422] Received oversubscribable resources {} from the
resource estimator
I0823 18:58:49.054374  5389 process.cpp:3933] Handling HTTP event for process 'slave(802)'
with path: '/slave(802)/monitor/statistics'
I0823 18:58:49.056421  5388 http.cpp:1166] HTTP GET for /slave(802)/monitor/statistics from
172.17.0.2:60928
I0823 18:58:49.056540  5388 http.cpp:957] Authorizing principal 'test-principal' to GET the
'/monitor/statistics' endpoint
I0823 18:58:49.059706  5365 slave.cpp:859] Agent terminating
[       OK ] Endpoint/SlaveEndpointTest.UnauthorizedRequest/0 (47 ms)
[ RUN      ] Endpoint/SlaveEndpointTest.UnauthorizedRequest/1
I0823 18:58:49.078583  5365 containerizer.cpp:288] Using isolation { environment_secret, posix/cpu,
posix/mem, filesystem/posix, network/cni }
W0823 18:58:49.079586  5365 backend.cpp:76] Failed to create 'overlay' backend: OverlayBackend
requires root privileges
W0823 18:58:49.079810  5365 backend.cpp:76] Failed to create 'bind' backend: BindBackend requires
root privileges
I0823 18:58:49.080054  5365 provisioner.cpp:255] Using default backend 'copy'
I0823 18:58:49.085917  5386 slave.cpp:252] Mesos agent started on (803)@172.17.0.2:37313
I0823 18:58:49.085963  5386 slave.cpp:253] Flags at startup: --acls="" --appc_simple_discovery_uri_prefix="http://"
--appc_store_dir="/tmp/Endpoint_SlaveEndpointTest_UnauthorizedRequest_1_DIftAZ/store/appc"
--authenticate_http_readonly="true" --authenticate_http_readwrite="true" --authenticatee="crammd5"
--authentication_backoff_factor="1secs" --authorizer="local" --cgroups_cpu_enable_pids_and_tids_count="false"
--cgroups_enable_cfs="false" --cgroups_hierarchy="/sys/fs/cgroup" --cgroups_limit_swap="false"
--cgroups_root="mesos" --container_disk_watch_interval="15secs" --containerizers="mesos" --credential="/tmp/Endpoint_SlaveEndpointTest_UnauthorizedRequest_1_DIftAZ/credential"
--default_role="*" --disallow_sharing_agent_pid_namespace="false" --disk_watch_interval="1mins"
--docker="docker" --docker_kill_orphans="true" --docker_registry="https://registry-1.docker.io"
--docker_remove_delay="6hrs" --docker_socket="/var/run/docker.sock" --docker_stop_timeout="0ns"
--docker_store_dir="/tmp/Endpoint_SlaveEndpointTest_UnauthorizedRequest_1_DIftAZ/store/docker"
--docker_volume_checkpoint_dir="/var/run/mesos/isolators/docker/volume" --enforce_container_disk_quota="false"
--executor_registration_timeout="1mins" --executor_reregistration_timeout="2secs" --executor_shutdown_grace_period="5secs"
--fetcher_cache_dir="/tmp/Endpoint_SlaveEndpointTest_UnauthorizedRequest_1_DIftAZ/fetch" --fetcher_cache_size="2GB"
--frameworks_home="" --gc_delay="1weeks" --gc_disk_headroom="0.1" --hadoop_home="" --help="false"
--hostname_lookup="true" --http_command_executor="false" --http_credentials="/tmp/Endpoint_SlaveEndpointTest_UnauthorizedRequest_1_DIftAZ/http_credentials"
--http_heartbeat_interval="30secs" --initialize_driver_logging="true" --isolation="posix/cpu,posix/mem"
--launcher="posix" --launcher_dir="/mesos/mesos-1.5.0/_build/src" --logbufsecs="0" --logging_level="INFO"
--max_completed_executors_per_framework="150" --oversubscribed_resources_interval="15secs"
--perf_duration="10secs" --perf_interval="1mins" --port="5051" --qos_correction_interval_min="0ns"
--quiet="false" --recover="reconnect" --recovery_timeout="15mins" --registration_backoff_factor="10ms"
--resources="cpus:2;gpus:0;mem:1024;disk:1024;ports:[31000-32000]" --revocable_cpu_low_priority="true"
--runtime_dir="/tmp/Endpoint_SlaveEndpointTest_UnauthorizedRequest_1_DIftAZ" --sandbox_directory="/mnt/mesos/sandbox"
--strict="true" --switch_user="true" --systemd_enable_support="true" --systemd_runtime_directory="/run/systemd/system"
--version="false" --work_dir="/tmp/Endpoint_SlaveEndpointTest_UnauthorizedRequest_1_EPjFor"
I0823 18:58:49.086673  5386 credentials.hpp:86] Loading credential for authentication from
'/tmp/Endpoint_SlaveEndpointTest_UnauthorizedRequest_1_DIftAZ/credential'
I0823 18:58:49.086930  5386 slave.cpp:285] Agent using credential for: test-principal
I0823 18:58:49.086951  5386 credentials.hpp:37] Loading credentials for authentication from
'/tmp/Endpoint_SlaveEndpointTest_UnauthorizedRequest_1_DIftAZ/http_credentials'
I0823 18:58:49.087302  5386 http.cpp:1026] Creating default 'basic' HTTP authenticator for
realm 'mesos-agent-readonly'
I0823 18:58:49.087746  5386 http.cpp:1026] Creating default 'basic' HTTP authenticator for
realm 'mesos-agent-readwrite'
I0823 18:58:49.090185  5386 slave.cpp:581] Agent resources: [{"name":"cpus","scalar":{"value":2.0},"type":"SCALAR"},{"name":"mem","scalar":{"value":1024.0},"type":"SCALAR"},{"name":"disk","scalar":{"value":1024.0},"type":"SCALAR"},{"name":"ports","ranges":{"range":[{"begin":31000,"end":32000}]},"type":"RANGES"}]
I0823 18:58:49.090622  5386 slave.cpp:589] Agent attributes: [  ]
I0823 18:58:49.090646  5386 slave.cpp:598] Agent hostname: 083ec0b93bae
I0823 18:58:49.090939  5390 status_update_manager.cpp:177] Pausing sending status updates
I0823 18:58:49.093068  5384 state.cpp:64] Recovering state from '/tmp/Endpoint_SlaveEndpointTest_UnauthorizedRequest_1_EPjFor/meta'
I0823 18:58:49.093493  5390 status_update_manager.cpp:203] Recovering status update manager
I0823 18:58:49.093860  5391 containerizer.cpp:643] Recovering containerizer
I0823 18:58:49.096072  5391 provisioner.cpp:416] Provisioner recovery complete
I0823 18:58:49.096637  5389 slave.cpp:6226] Finished recovery
I0823 18:58:49.097239  5389 slave.cpp:6408] Querying resource estimator for oversubscribable
resources
I0823 18:58:49.097625  5388 slave.cpp:6422] Received oversubscribable resources {} from the
resource estimator
I0823 18:58:49.101837  5391 process.cpp:3933] Handling HTTP event for process 'slave(803)'
with path: '/slave(803)/monitor/statistics.json'
I0823 18:58:49.104066  5384 http.cpp:1166] HTTP GET for /slave(803)/monitor/statistics.json
from 172.17.0.2:60930
I0823 18:58:49.104185  5384 http.cpp:957] Authorizing principal 'test-principal' to GET the
'/monitor/statistics.json' endpoint
I0823 18:58:49.107357  5391 slave.cpp:859] Agent terminating
[       OK ] Endpoint/SlaveEndpointTest.UnauthorizedRequest/1 (47 ms)
[ RUN      ] Endpoint/SlaveEndpointTest.UnauthorizedRequest/2
I0823 18:58:49.126086  5365 containerizer.cpp:288] Using isolation { environment_secret, posix/cpu,
posix/mem, filesystem/posix, network/cni }
W0823 18:58:49.126977  5365 backend.cpp:76] Failed to create 'overlay' backend: OverlayBackend
requires root privileges
W0823 18:58:49.127221  5365 backend.cpp:76] Failed to create 'bind' backend: BindBackend requires
root privileges
I0823 18:58:49.127293  5365 provisioner.cpp:255] Using default backend 'copy'
I0823 18:58:49.133105  5386 slave.cpp:252] Mesos agent started on (804)@172.17.0.2:37313
I0823 18:58:49.133150  5386 slave.cpp:253] Flags at startup: --acls="" --appc_simple_discovery_uri_prefix="http://"
--appc_store_dir="/tmp/Endpoint_SlaveEndpointTest_UnauthorizedRequest_2_Hq2ZLc/store/appc"
--authenticate_http_readonly="true" --authenticate_http_readwrite="true" --authenticatee="crammd5"
--authentication_backoff_factor="1secs" --authorizer="local" --cgroups_cpu_enable_pids_and_tids_count="false"
--cgroups_enable_cfs="false" --cgroups_hierarchy="/sys/fs/cgroup" --cgroups_limit_swap="false"
--cgroups_root="mesos" --container_disk_watch_interval="15secs" --containerizers="mesos" --credential="/tmp/Endpoint_SlaveEndpointTest_UnauthorizedRequest_2_Hq2ZLc/credential"
--default_role="*" --disallow_sharing_agent_pid_namespace="false" --disk_watch_interval="1mins"
--docker="docker" --docker_kill_orphans="true" --docker_registry="https://registry-1.docker.io"
--docker_remove_delay="6hrs" --docker_socket="/var/run/docker.sock" --docker_stop_timeout="0ns"
--docker_store_dir="/tmp/Endpoint_SlaveEndpointTest_UnauthorizedRequest_2_Hq2ZLc/store/docker"
--docker_volume_checkpoint_dir="/var/run/mesos/isolators/docker/volume" --enforce_container_disk_quota="false"
--executor_registration_timeout="1mins" --executor_reregistration_timeout="2secs" --executor_shutdown_grace_period="5secs"
--fetcher_cache_dir="/tmp/Endpoint_SlaveEndpointTest_UnauthorizedRequest_2_Hq2ZLc/fetch" --fetcher_cache_size="2GB"
--frameworks_home="" --gc_delay="1weeks" --gc_disk_headroom="0.1" --hadoop_home="" --help="false"
--hostname_lookup="true" --http_command_executor="false" --http_credentials="/tmp/Endpoint_SlaveEndpointTest_UnauthorizedRequest_2_Hq2ZLc/http_credentials"
--http_heartbeat_interval="30secs" --initialize_driver_logging="true" --isolation="posix/cpu,posix/mem"
--launcher="posix" --launcher_dir="/mesos/mesos-1.5.0/_build/src" --logbufsecs="0" --logging_level="INFO"
--max_completed_executors_per_framework="150" --oversubscribed_resources_interval="15secs"
--perf_duration="10secs" --perf_interval="1mins" --port="5051" --qos_correction_interval_min="0ns"
--quiet="false" --recover="reconnect" --recovery_timeout="15mins" --registration_backoff_factor="10ms"
--resources="cpus:2;gpus:0;mem:1024;disk:1024;ports:[31000-32000]" --revocable_cpu_low_priority="true"
--runtime_dir="/tmp/Endpoint_SlaveEndpointTest_UnauthorizedRequest_2_Hq2ZLc" --sandbox_directory="/mnt/mesos/sandbox"
--strict="true" --switch_user="true" --systemd_enable_support="true" --systemd_runtime_directory="/run/systemd/system"
--version="false" --work_dir="/tmp/Endpoint_SlaveEndpointTest_UnauthorizedRequest_2_w14tsE"
I0823 18:58:49.134140  5386 credentials.hpp:86] Loading credential for authentication from
'/tmp/Endpoint_SlaveEndpointTest_UnauthorizedRequest_2_Hq2ZLc/credential'
I0823 18:58:49.134490  5386 slave.cpp:285] Agent using credential for: test-principal
I0823 18:58:49.134519  5386 credentials.hpp:37] Loading credentials for authentication from
'/tmp/Endpoint_SlaveEndpointTest_UnauthorizedRequest_2_Hq2ZLc/http_credentials'
I0823 18:58:49.134969  5386 http.cpp:1026] Creating default 'basic' HTTP authenticator for
realm 'mesos-agent-readonly'
I0823 18:58:49.135320  5386 http.cpp:1026] Creating default 'basic' HTTP authenticator for
realm 'mesos-agent-readwrite'
I0823 18:58:49.137651  5386 slave.cpp:581] Agent resources: [{"name":"cpus","scalar":{"value":2.0},"type":"SCALAR"},{"name":"mem","scalar":{"value":1024.0},"type":"SCALAR"},{"name":"disk","scalar":{"value":1024.0},"type":"SCALAR"},{"name":"ports","ranges":{"range":[{"begin":31000,"end":32000}]},"type":"RANGES"}]
I0823 18:58:49.138118  5386 slave.cpp:589] Agent attributes: [  ]
I0823 18:58:49.138139  5386 slave.cpp:598] Agent hostname: 083ec0b93bae
I0823 18:58:49.138386  5384 status_update_manager.cpp:177] Pausing sending status updates
I0823 18:58:49.140786  5388 state.cpp:64] Recovering state from '/tmp/Endpoint_SlaveEndpointTest_UnauthorizedRequest_2_w14tsE/meta'
I0823 18:58:49.141311  5384 status_update_manager.cpp:203] Recovering status update manager
I0823 18:58:49.141656  5385 containerizer.cpp:643] Recovering containerizer
I0823 18:58:49.143779  5385 provisioner.cpp:416] Provisioner recovery complete
I0823 18:58:49.144455  5391 slave.cpp:6226] Finished recovery
I0823 18:58:49.145246  5391 slave.cpp:6408] Querying resource estimator for oversubscribable
resources
I0823 18:58:49.145663  5386 slave.cpp:6422] Received oversubscribable resources {} from the
resource estimator
I0823 18:58:49.149783  5390 process.cpp:3933] Handling HTTP event for process 'slave(804)'
with path: '/slave(804)/containers'
I0823 18:58:49.151751  5386 http.cpp:1166] HTTP GET for /slave(804)/containers from 172.17.0.2:60932
I0823 18:58:49.151871  5386 http.cpp:957] Authorizing principal 'test-principal' to GET the
'/containers' endpoint
I0823 18:58:49.156062  5365 slave.cpp:859] Agent terminating
[       OK ] Endpoint/SlaveEndpointTest.UnauthorizedRequest/2 (47 ms)
[ RUN      ] Endpoint/SlaveEndpointTest.NoAuthorizer/0
I0823 18:58:49.174471  5365 containerizer.cpp:288] Using isolation { environment_secret, posix/cpu,
posix/mem, filesystem/posix, network/cni }
W0823 18:58:49.175364  5365 backend.cpp:76] Failed to create 'overlay' backend: OverlayBackend
requires root privileges
W0823 18:58:49.175621  5365 backend.cpp:76] Failed to create 'bind' backend: BindBackend requires
root privileges
I0823 18:58:49.175693  5365 provisioner.cpp:255] Using default backend 'copy'
I0823 18:58:49.178309  5365 cluster.cpp:448] Creating default 'local' authorizer
I0823 18:58:49.181517  5389 slave.cpp:252] Mesos agent started on (805)@172.17.0.2:37313
I0823 18:58:49.181558  5389 slave.cpp:253] Flags at startup: --acls="" --appc_simple_discovery_uri_prefix="http://"
--appc_store_dir="/tmp/Endpoint_SlaveEndpointTest_NoAuthorizer_0_9UlBsq/store/appc" --authenticate_http_readonly="true"
--authenticate_http_readwrite="true" --authenticatee="crammd5" --authentication_backoff_factor="1secs"
--authorizer="local" --cgroups_cpu_enable_pids_and_tids_count="false" --cgroups_enable_cfs="false"
--cgroups_hierarchy="/sys/fs/cgroup" --cgroups_limit_swap="false" --cgroups_root="mesos" --container_disk_watch_interval="15secs"
--containerizers="mesos" --credential="/tmp/Endpoint_SlaveEndpointTest_NoAuthorizer_0_9UlBsq/credential"
--default_role="*" --disallow_sharing_agent_pid_namespace="false" --disk_watch_interval="1mins"
--docker="docker" --docker_kill_orphans="true" --docker_registry="https://registry-1.docker.io"
--docker_remove_delay="6hrs" --docker_socket="/var/run/docker.sock" --docker_stop_timeout="0ns"
--docker_store_dir="/tmp/Endpoint_SlaveEndpointTest_NoAuthorizer_0_9UlBsq/store/docker" --docker_volume_checkpoint_dir="/var/run/mesos/isolators/docker/volume"
--enforce_container_disk_quota="false" --executor_registration_timeout="1mins" --executor_reregistration_timeout="2secs"
--executor_shutdown_grace_period="5secs" --fetcher_cache_dir="/tmp/Endpoint_SlaveEndpointTest_NoAuthorizer_0_9UlBsq/fetch"
--fetcher_cache_size="2GB" --frameworks_home="" --gc_delay="1weeks" --gc_disk_headroom="0.1"
--hadoop_home="" --help="false" --hostname_lookup="true" --http_command_executor="false" --http_credentials="/tmp/Endpoint_SlaveEndpointTest_NoAuthorizer_0_9UlBsq/http_credentials"
--http_heartbeat_interval="30secs" --initialize_driver_logging="true" --isolation="posix/cpu,posix/mem"
--launcher="posix" --launcher_dir="/mesos/mesos-1.5.0/_build/src" --logbufsecs="0" --logging_level="INFO"
--max_completed_executors_per_framework="150" --oversubscribed_resources_interval="15secs"
--perf_duration="10secs" --perf_interval="1mins" --port="5051" --qos_correction_interval_min="0ns"
--quiet="false" --recover="reconnect" --recovery_timeout="15mins" --registration_backoff_factor="10ms"
--resources="cpus:2;gpus:0;mem:1024;disk:1024;ports:[31000-32000]" --revocable_cpu_low_priority="true"
--runtime_dir="/tmp/Endpoint_SlaveEndpointTest_NoAuthorizer_0_9UlBsq" --sandbox_directory="/mnt/mesos/sandbox"
--strict="true" --switch_user="true" --systemd_enable_support="true" --systemd_runtime_directory="/run/systemd/system"
--version="false" --work_dir="/tmp/Endpoint_SlaveEndpointTest_NoAuthorizer_0_eqbk1R"
I0823 18:58:49.182350  5389 credentials.hpp:86] Loading credential for authentication from
'/tmp/Endpoint_SlaveEndpointTest_NoAuthorizer_0_9UlBsq/credential'
I0823 18:58:49.182900  5389 slave.cpp:285] Agent using credential for: test-principal
I0823 18:58:49.182930  5389 credentials.hpp:37] Loading credentials for authentication from
'/tmp/Endpoint_SlaveEndpointTest_NoAuthorizer_0_9UlBsq/http_credentials'
I0823 18:58:49.183472  5389 http.cpp:1026] Creating default 'basic' HTTP authenticator for
realm 'mesos-agent-readonly'
I0823 18:58:49.183862  5389 http.cpp:1026] Creating default 'basic' HTTP authenticator for
realm 'mesos-agent-readwrite'
I0823 18:58:49.186230  5389 slave.cpp:581] Agent resources: [{"name":"cpus","scalar":{"value":2.0},"type":"SCALAR"},{"name":"mem","scalar":{"value":1024.0},"type":"SCALAR"},{"name":"disk","scalar":{"value":1024.0},"type":"SCALAR"},{"name":"ports","ranges":{"range":[{"begin":31000,"end":32000}]},"type":"RANGES"}]
I0823 18:58:49.186717  5389 slave.cpp:589] Agent attributes: [  ]
I0823 18:58:49.186735  5389 slave.cpp:598] Agent hostname: 083ec0b93bae
I0823 18:58:49.187155  5384 status_update_manager.cpp:177] Pausing sending status updates
I0823 18:58:49.189327  5387 state.cpp:64] Recovering state from '/tmp/Endpoint_SlaveEndpointTest_NoAuthorizer_0_eqbk1R/meta'
I0823 18:58:49.189776  5384 status_update_manager.cpp:203] Recovering status update manager
I0823 18:58:49.190037  5384 containerizer.cpp:643] Recovering containerizer
I0823 18:58:49.192183  5384 provisioner.cpp:416] Provisioner recovery complete
I0823 18:58:49.192826  5388 slave.cpp:6226] Finished recovery
I0823 18:58:49.193459  5388 slave.cpp:6408] Querying resource estimator for oversubscribable
resources
I0823 18:58:49.193904  5385 slave.cpp:6422] Received oversubscribable resources {} from the
resource estimator
I0823 18:58:49.197942  5384 process.cpp:3933] Handling HTTP event for process 'slave(805)'
with path: '/slave(805)/monitor/statistics'
I0823 18:58:49.200119  5388 http.cpp:1166] HTTP GET for /slave(805)/monitor/statistics from
172.17.0.2:60934
I0823 18:58:49.200233  5388 http.cpp:957] Authorizing principal 'test-principal' to GET the
'/monitor/statistics' endpoint
I0823 18:58:49.205535  5365 slave.cpp:859] Agent terminating
[       OK ] Endpoint/SlaveEndpointTest.NoAuthorizer/0 (49 ms)
[ RUN      ] Endpoint/SlaveEndpointTest.NoAuthorizer/1
I0823 18:58:49.224242  5365 containerizer.cpp:288] Using isolation { environment_secret, posix/cpu,
posix/mem, filesystem/posix, network/cni }
W0823 18:58:49.225111  5365 backend.cpp:76] Failed to create 'overlay' backend: OverlayBackend
requires root privileges
W0823 18:58:49.225442  5365 backend.cpp:76] Failed to create 'bind' backend: BindBackend requires
root privileges
I0823 18:58:49.225544  5365 provisioner.cpp:255] Using default backend 'copy'
I0823 18:58:49.228315  5365 cluster.cpp:448] Creating default 'local' authorizer
I0823 18:58:49.231593  5390 slave.cpp:252] Mesos agent started on (806)@172.17.0.2:37313
I0823 18:58:49.231637  5390 slave.cpp:253] Flags at startup: --acls="" --appc_simple_discovery_uri_prefix="http://"
--appc_store_dir="/tmp/Endpoint_SlaveEndpointTest_NoAuthorizer_1_3jjbFE/store/appc" --authenticate_http_readonly="true"
--authenticate_http_readwrite="true" --authenticatee="crammd5" --authentication_backoff_factor="1secs"
--authorizer="local" --cgroups_cpu_enable_pids_and_tids_count="false" --cgroups_enable_cfs="false"
--cgroups_hierarchy="/sys/fs/cgroup" --cgroups_limit_swap="false" --cgroups_root="mesos" --container_disk_watch_interval="15secs"
--containerizers="mesos" --credential="/tmp/Endpoint_SlaveEndpointTest_NoAuthorizer_1_3jjbFE/credential"
--default_role="*" --disallow_sharing_agent_pid_namespace="false" --disk_watch_interval="1mins"
--docker="docker" --docker_kill_orphans="true" --docker_registry="https://registry-1.docker.io"
--docker_remove_delay="6hrs" --docker_socket="/var/run/docker.sock" --docker_stop_timeout="0ns"
--docker_store_dir="/tmp/Endpoint_SlaveEndpointTest_NoAuthorizer_1_3jjbFE/store/docker" --docker_volume_checkpoint_dir="/var/run/mesos/isolators/docker/volume"
--enforce_container_disk_quota="false" --executor_registration_timeout="1mins" --executor_reregistration_timeout="2secs"
--executor_shutdown_grace_period="5secs" --fetcher_cache_dir="/tmp/Endpoint_SlaveEndpointTest_NoAuthorizer_1_3jjbFE/fetch"
--fetcher_cache_size="2GB" --frameworks_home="" --gc_delay="1weeks" --gc_disk_headroom="0.1"
--hadoop_home="" --help="false" --hostname_lookup="true" --http_command_executor="false" --http_credentials="/tmp/Endpoint_SlaveEndpointTest_NoAuthorizer_1_3jjbFE/http_credentials"
--http_heartbeat_interval="30secs" --initialize_driver_logging="true" --isolation="posix/cpu,posix/mem"
--launcher="posix" --launcher_dir="/mesos/mesos-1.5.0/_build/src" --logbufsecs="0" --logging_level="INFO"
--max_completed_executors_per_framework="150" --oversubscribed_resources_interval="15secs"
--perf_duration="10secs" --perf_interval="1mins" --port="5051" --qos_correction_interval_min="0ns"
--quiet="false" --recover="reconnect" --recovery_timeout="15mins" --registration_backoff_factor="10ms"
--resources="cpus:2;gpus:0;mem:1024;disk:1024;ports:[31000-32000]" --revocable_cpu_low_priority="true"
--runtime_dir="/tmp/Endpoint_SlaveEndpointTest_NoAuthorizer_1_3jjbFE" --sandbox_directory="/mnt/mesos/sandbox"
--strict="true" --switch_user="true" --systemd_enable_support="true" --systemd_runtime_directory="/run/systemd/system"
--version="false" --work_dir="/tmp/Endpoint_SlaveEndpointTest_NoAuthorizer_1_eEJQ55"
I0823 18:58:49.232348  5390 credentials.hpp:86] Loading credential for authentication from
'/tmp/Endpoint_SlaveEndpointTest_NoAuthorizer_1_3jjbFE/credential'
I0823 18:58:49.232604  5390 slave.cpp:285] Agent using credential for: test-principal
I0823 18:58:49.232628  5390 credentials.hpp:37] Loading credentials for authentication from
'/tmp/Endpoint_SlaveEndpointTest_NoAuthorizer_1_3jjbFE/http_credentials'
I0823 18:58:49.232985  5390 http.cpp:1026] Creating default 'basic' HTTP authenticator for
realm 'mesos-agent-readonly'
I0823 18:58:49.233266  5390 http.cpp:1026] Creating default 'basic' HTTP authenticator for
realm 'mesos-agent-readwrite'
I0823 18:58:49.235440  5390 slave.cpp:581] Agent resources: [{"name":"cpus","scalar":{"value":2.0},"type":"SCALAR"},{"name":"mem","scalar":{"value":1024.0},"type":"SCALAR"},{"name":"disk","scalar":{"value":1024.0},"type":"SCALAR"},{"name":"ports","ranges":{"range":[{"begin":31000,"end":32000}]},"type":"RANGES"}]
I0823 18:58:49.235868  5390 slave.cpp:589] Agent attributes: [  ]
I0823 18:58:49.235890  5390 slave.cpp:598] Agent hostname: 083ec0b93bae
I0823 18:58:49.236163  5387 status_update_manager.cpp:177] Pausing sending status updates
I0823 18:58:49.238201  5385 state.cpp:64] Recovering state from '/tmp/Endpoint_SlaveEndpointTest_NoAuthorizer_1_eEJQ55/meta'
I0823 18:58:49.238782  5385 status_update_manager.cpp:203] Recovering status update manager
I0823 18:58:49.239049  5385 containerizer.cpp:643] Recovering containerizer
I0823 18:58:49.241412  5386 provisioner.cpp:416] Provisioner recovery complete
I0823 18:58:49.241947  5388 slave.cpp:6226] Finished recovery
I0823 18:58:49.242588  5388 slave.cpp:6408] Querying resource estimator for oversubscribable
resources
I0823 18:58:49.242970  5389 slave.cpp:6422] Received oversubscribable resources {} from the
resource estimator
I0823 18:58:49.246961  5386 process.cpp:3933] Handling HTTP event for process 'slave(806)'
with path: '/slave(806)/monitor/statistics.json'
I0823 18:58:49.249114  5389 http.cpp:1166] HTTP GET for /slave(806)/monitor/statistics.json
from 172.17.0.2:60936
I0823 18:58:49.249233  5389 http.cpp:957] Authorizing principal 'test-principal' to GET the
'/monitor/statistics.json' endpoint
I0823 18:58:49.254762  5365 slave.cpp:859] Agent terminating
[       OK ] Endpoint/SlaveEndpointTest.NoAuthorizer/1 (49 ms)
[ RUN      ] Endpoint/SlaveEndpointTest.NoAuthorizer/2
I0823 18:58:49.272927  5365 containerizer.cpp:288] Using isolation { environment_secret, posix/cpu,
posix/mem, filesystem/posix, network/cni }
W0823 18:58:49.273782  5365 backend.cpp:76] Failed to create 'overlay' backend: OverlayBackend
requires root privileges
W0823 18:58:49.274128  5365 backend.cpp:76] Failed to create 'bind' backend: BindBackend requires
root privileges
I0823 18:58:49.274227  5365 provisioner.cpp:255] Using default backend 'copy'
I0823 18:58:49.276912  5365 cluster.cpp:448] Creating default 'local' authorizer
I0823 18:58:49.280274  5389 slave.cpp:252] Mesos agent started on (807)@172.17.0.2:37313
I0823 18:58:49.280318  5389 slave.cpp:253] Flags at startup: --acls="" --appc_simple_discovery_uri_prefix="http://"
--appc_store_dir="/tmp/Endpoint_SlaveEndpointTest_NoAuthorizer_2_pRjnnT/store/appc" --authenticate_http_readonly="true"
--authenticate_http_readwrite="true" --authenticatee="crammd5" --authentication_backoff_factor="1secs"
--authorizer="local" --cgroups_cpu_enable_pids_and_tids_count="false" --cgroups_enable_cfs="false"
--cgroups_hierarchy="/sys/fs/cgroup" --cgroups_limit_swap="false" --cgroups_root="mesos" --container_disk_watch_interval="15secs"
--containerizers="mesos" --credential="/tmp/Endpoint_SlaveEndpointTest_NoAuthorizer_2_pRjnnT/credential"
--default_role="*" --disallow_sharing_agent_pid_namespace="false" --disk_watch_interval="1mins"
--docker="docker" --docker_kill_orphans="true" --docker_registry="https://registry-1.docker.io"
--docker_remove_delay="6hrs" --docker_socket="/var/run/docker.sock" --docker_stop_timeout="0ns"
--docker_store_dir="/tmp/Endpoint_SlaveEndpointTest_NoAuthorizer_2_pRjnnT/store/docker" --docker_volume_checkpoint_dir="/var/run/mesos/isolators/docker/volume"
--enforce_container_disk_quota="false" --executor_registration_timeout="1mins" --executor_reregistration_timeout="2secs"
--executor_shutdown_grace_period="5secs" --fetcher_cache_dir="/tmp/Endpoint_SlaveEndpointTest_NoAuthorizer_2_pRjnnT/fetch"
--fetcher_cache_size="2GB" --frameworks_home="" --gc_delay="1weeks" --gc_disk_headroom="0.1"
--hadoop_home="" --help="false" --hostname_lookup="true" --http_command_executor="false" --http_credentials="/tmp/Endpoint_SlaveEndpointTest_NoAuthorizer_2_pRjnnT/http_credentials"
--http_heartbeat_interval="30secs" --initialize_driver_logging="true" --isolation="posix/cpu,posix/mem"
--launcher="posix" --launcher_dir="/mesos/mesos-1.5.0/_build/src" --logbufsecs="0" --logging_level="INFO"
--max_completed_executors_per_framework="150" --oversubscribed_resources_interval="15secs"
--perf_duration="10secs" --perf_interval="1mins" --port="5051" --qos_correction_interval_min="0ns"
--quiet="false" --recover="reconnect" --recovery_timeout="15mins" --registration_backoff_factor="10ms"
--resources="cpus:2;gpus:0;mem:1024;disk:1024;ports:[31000-32000]" --revocable_cpu_low_priority="true"
--runtime_dir="/tmp/Endpoint_SlaveEndpointTest_NoAuthorizer_2_pRjnnT" --sandbox_directory="/mnt/mesos/sandbox"
--strict="true" --switch_user="true" --systemd_enable_support="true" --systemd_runtime_directory="/run/systemd/system"
--version="false" --work_dir="/tmp/Endpoint_SlaveEndpointTest_NoAuthorizer_2_qQ79Fk"
I0823 18:58:49.281067  5389 credentials.hpp:86] Loading credential for authentication from
'/tmp/Endpoint_SlaveEndpointTest_NoAuthorizer_2_pRjnnT/credential'
I0823 18:58:49.281339  5389 slave.cpp:285] Agent using credential for: test-principal
I0823 18:58:49.281371  5389 credentials.hpp:37] Loading credentials for authentication from
'/tmp/Endpoint_SlaveEndpointTest_NoAuthorizer_2_pRjnnT/http_credentials'
I0823 18:58:49.281798  5389 http.cpp:1026] Creating default 'basic' HTTP authenticator for
realm 'mesos-agent-readonly'
I0823 18:58:49.282097  5389 http.cpp:1026] Creating default 'basic' HTTP authenticator for
realm 'mesos-agent-readwrite'
I0823 18:58:49.284333  5389 slave.cpp:581] Agent resources: [{"name":"cpus","scalar":{"value":2.0},"type":"SCALAR"},{"name":"mem","scalar":{"value":1024.0},"type":"SCALAR"},{"name":"disk","scalar":{"value":1024.0},"type":"SCALAR"},{"name":"ports","ranges":{"range":[{"begin":31000,"end":32000}]},"type":"RANGES"}]
I0823 18:58:49.284812  5389 slave.cpp:589] Agent attributes: [  ]
I0823 18:58:49.284835  5389 slave.cpp:598] Agent hostname: 083ec0b93bae
I0823 18:58:49.285092  5390 status_update_manager.cpp:177] Pausing sending status updates
I0823 18:58:49.287219  5389 state.cpp:64] Recovering state from '/tmp/Endpoint_SlaveEndpointTest_NoAuthorizer_2_qQ79Fk/meta'
I0823 18:58:49.287652  5384 status_update_manager.cpp:203] Recovering status update manager
I0823 18:58:49.287961  5387 containerizer.cpp:643] Recovering containerizer
I0823 18:58:49.290421  5390 provisioner.cpp:416] Provisioner recovery complete
I0823 18:58:49.291034  5389 slave.cpp:6226] Finished recovery
I0823 18:58:49.291687  5389 slave.cpp:6408] Querying resource estimator for oversubscribable
resources
I0823 18:58:49.292114  5391 slave.cpp:6422] Received oversubscribable resources {} from the
resource estimator
I0823 18:58:49.296052  5385 process.cpp:3933] Handling HTTP event for process 'slave(807)'
with path: '/slave(807)/containers'
I0823 18:58:49.298099  5391 http.cpp:1166] HTTP GET for /slave(807)/containers from 172.17.0.2:60938
I0823 18:58:49.298223  5391 http.cpp:957] Authorizing principal 'test-principal' to GET the
'/containers' endpoint
I0823 18:58:49.305039  5365 slave.cpp:859] Agent terminating
[       OK ] Endpoint/SlaveEndpointTest.NoAuthorizer/2 (56 ms)
[----------] 9 tests from Endpoint/SlaveEndpointTest (444 ms total)

[----------] 2 tests from ContainerizerType/DefaultContainerDNSFlagTest
[ RUN      ] ContainerizerType/DefaultContainerDNSFlagTest.ValidateFlag/0
[       OK ] ContainerizerType/DefaultContainerDNSFlagTest.ValidateFlag/0 (18 ms)
[ RUN      ] ContainerizerType/DefaultContainerDNSFlagTest.ValidateFlag/1
[       OK ] ContainerizerType/DefaultContainerDNSFlagTest.ValidateFlag/1 (19 ms)
[----------] 2 tests from ContainerizerType/DefaultContainerDNSFlagTest (39 ms total)

[----------] Global test environment tear-down
[==========] 1659 tests from 182 test cases ran. (736863 ms total)
[  PASSED  ] 1655 tests.
[  FAILED  ] 4 tests, listed below:
[  FAILED  ] DefaultExecutorCheckTest.CommandCheckDeliveredAndReconciled
[  FAILED  ] DefaultExecutorCheckTest.CommandCheckStatusChange
[  FAILED  ] DefaultExecutorCheckTest.CommandCheckSeesParentsEnv
[  FAILED  ] DefaultExecutorCheckTest.CommandCheckSharesWorkDirWithTask

 4 FAILED TESTS
  YOU HAVE 20 DISABLED TESTS

I0823 18:58:49.496800  5392 process.cpp:1072] Failed to accept socket: future discarded
make[4]: *** [check-local] Error 1
make[4]: Leaving directory `/mesos/mesos-1.5.0/_build/src'
make[3]: *** [check-am] Error 2
make[3]: Leaving directory `/mesos/mesos-1.5.0/_build/src'
make[2]: *** [check] Error 2
make[2]: Leaving directory `/mesos/mesos-1.5.0/_build/src'
make[1]: *** [check-recursive] Error 1
make[1]: Leaving directory `/mesos/mesos-1.5.0/_build'
make: *** [distcheck] Error 1
+ docker rmi mesos-1503508510-3742
Untagged: mesos-1503508510-3742:latest
Deleted: sha256:6523c5e8bfcf3ae52e0397a862e3e9c366689af802546fb04fa25532bba3b082
Deleted: sha256:5bcda53d50e4ead4e387560f57f02baf05e27562089cbe43e753b0d65d75aefd
Deleted: sha256:34c9dcc8cb99ce6de1deb822ddd9fd5e975588c550a7c846ae053f2efee0e7bd
Deleted: sha256:c34fdeaaf2008a87797c640a0a684e243e17ad5fc09787d979eb85ca62d18d8d
Deleted: sha256:6e407cb6d2064217486dbd816e40dd49080639267dff5b292c42d837398a9f5f
Deleted: sha256:a7356e93046345f87f5219dbb917437276972b56f1e0145e1f161cbc9252f663
Deleted: sha256:e8630d994a1d78fbc740e7440d9c4952eb7566a8c63c6683f2f01226654b6615
Deleted: sha256:d943aabb695ae6bbfddacea447537e067c069cbfab11bd46bd7f347111454954
Deleted: sha256:3958dd5b3b7072db66e8413471321399dbff12de994db699d829ef0684f16ad3
Deleted: sha256:5bdf212cbb65b65bfbcc2ccc4d598129b27cdd1976e2ce33cf87c7811f1b3210
Deleted: sha256:e8e380a841d439b83e7272877a7a863d337d463052419cb9e8359eaf2e46d89b
Deleted: sha256:a7923f4d39abdd999b6bd76b8bf21a40c3aa32139cb42ef54579a234bebd7de1
Deleted: sha256:91fdbffe6f1e827cdef4f9af5b1a52e5eeadde3f59222379cf247c560dee9968
Deleted: sha256:9405cc14d3be63d8e7ecf922a1e375b399b1d00068b768b3b0acf8e2ae53b193
Deleted: sha256:9fed8f67c25087820336bdfba0972b27f101d39c0bd4ee389411a291681391d1
Deleted: sha256:87ba611ee9a3d2f470192d10ca838c1f87c3ff3b90f82c19305fbcc733c3feb7
Deleted: sha256:d2b354fc10441a52a44b9981e66ae7065f5358ba22f02800ddef154f8c12126b
Deleted: sha256:351a702763cd33473c6ae89ff3194b016390a306417555f222a44fb5cdbddc1f
Deleted: sha256:0c4b42e23d4262e53a2f6fa4b8f90c8932acf21186c3bab1f7c9c70ae8074b32
Deleted: sha256:7004068066787cd71c1ffa89002bf366e30294130e5a19a14317b2770b6209b7
Deleted: sha256:47ba14bf8e496bab3be5effce6a630cd78d055c3330a1156a23beaf0c3e2c33a
Deleted: sha256:75449d6a7085b1b84f33c771d57b5061a7c58ba699c3be8b222597a8ef982b12
Deleted: sha256:7424e8decfa8affd86d3be57dcedc61a2ab1756d2917a93cd057ee4056970a4c
Deleted: sha256:a38ffb7d96d0527ea40d8a3449ab990832169b6bcfaac51f9cc8659fdc45a892
Build step 'Execute shell' marked build as failure

Mime
View raw message