mesos-builds mailing list archives

Site index · List index
Message view « Date » · « Thread »
Top « Date » · « Thread »
From Apache Jenkins Server <jenk...@builds.apache.org>
Subject Build failed in Jenkins: Mesos-Reviewbot #18860
Date Mon, 14 Aug 2017 18:23:34 GMT
See <https://builds.apache.org/job/Mesos-Reviewbot/18860/display/redirect>

------------------------------------------
[...truncated 700.49 KB...]
Downloading: http://repo.maven.apache.org/maven2/org/apache/maven/maven-plugin-registry/2.0.8/maven-plugin-registry-2.0.8.pom
Downloaded: http://repo.maven.apache.org/maven2/org/apache/maven/maven-plugin-registry/2.0.8/maven-plugin-registry-2.0.8.pom
(2 KB at 150.2 KB/sec)
Downloading: http://repo.maven.apache.org/maven2/org/apache/maven/maven-plugin-api/2.0.8/maven-plugin-api-2.0.8.pom
Downloaded: http://repo.maven.apache.org/maven2/org/apache/maven/maven-plugin-api/2.0.8/maven-plugin-api-2.0.8.pom
(2 KB at 112.2 KB/sec)
Downloading: http://repo.maven.apache.org/maven2/org/apache/maven/doxia/doxia-site-renderer/1.0/doxia-site-renderer-1.0.pom
Downloaded: http://repo.maven.apache.org/maven2/org/apache/maven/doxia/doxia-site-renderer/1.0/doxia-site-renderer-1.0.pom
(5 KB at 196.5 KB/sec)
Downloading: http://repo.maven.apache.org/maven2/org/apache/maven/doxia/doxia-sitetools/1.0/doxia-sitetools-1.0.pom
Downloaded: http://repo.maven.apache.org/maven2/org/apache/maven/doxia/doxia-sitetools/1.0/doxia-sitetools-1.0.pom
(10 KB at 203.5 KB/sec)
Downloading: http://repo.maven.apache.org/maven2/org/apache/maven/doxia/doxia-core/1.0/doxia-core-1.0.pom
Downloaded: http://repo.maven.apache.org/maven2/org/apache/maven/doxia/doxia-core/1.0/doxia-core-1.0.pom
(3 KB at 97.5 KB/sec)
Downloading: http://repo.maven.apache.org/maven2/org/codehaus/plexus/plexus-utils/1.5.7/plexus-utils-1.5.7.pom
Downloaded: http://repo.maven.apache.org/maven2/org/codehaus/plexus/plexus-utils/1.5.7/plexus-utils-1.5.7.pom
(8 KB at 148.6 KB/sec)
Downloading: http://repo.maven.apache.org/maven2/org/apache/maven/doxia/doxia-decoration-model/1.0/doxia-decoration-model-1.0.pom
Downloaded: http://repo.maven.apache.org/maven2/org/apache/maven/doxia/doxia-decoration-model/1.0/doxia-decoration-model-1.0.pom
(4 KB at 128.3 KB/sec)
Downloading: http://repo.maven.apache.org/maven2/org/apache/maven/doxia/doxia-module-apt/1.0/doxia-module-apt-1.0.pom
Downloaded: http://repo.maven.apache.org/maven2/org/apache/maven/doxia/doxia-module-apt/1.0/doxia-module-apt-1.0.pom
(3 KB at 122.2 KB/sec)
Downloading: http://repo.maven.apache.org/maven2/org/apache/maven/doxia/doxia-modules/1.0/doxia-modules-1.0.pom
Downloaded: http://repo.maven.apache.org/maven2/org/apache/maven/doxia/doxia-modules/1.0/doxia-modules-1.0.pom
(3 KB at 129.9 KB/sec)
Downloading: http://repo.maven.apache.org/maven2/org/apache/maven/doxia/doxia-module-fml/1.0/doxia-module-fml-1.0.pom
Downloaded: http://repo.maven.apache.org/maven2/org/apache/maven/doxia/doxia-module-fml/1.0/doxia-module-fml-1.0.pom
(3 KB at 119.5 KB/sec)
Downloading: http://repo.maven.apache.org/maven2/org/apache/maven/doxia/doxia-module-xdoc/1.0/doxia-module-xdoc-1.0.pom
Downloaded: http://repo.maven.apache.org/maven2/org/apache/maven/doxia/doxia-module-xdoc/1.0/doxia-module-xdoc-1.0.pom
(3 KB at 128.8 KB/sec)
Downloading: http://repo.maven.apache.org/maven2/org/apache/maven/doxia/doxia-module-xhtml/1.0/doxia-module-xhtml-1.0.pom
Downloaded: http://repo.maven.apache.org/maven2/org/apache/maven/doxia/doxia-module-xhtml/1.0/doxia-module-xhtml-1.0.pom
(2 KB at 78.1 KB/sec)
Downloading: http://repo.maven.apache.org/maven2/org/apache/maven/wagon/wagon-provider-api/1.0-beta-6/wagon-provider-api-1.0-beta-6.pom
Downloaded: http://repo.maven.apache.org/maven2/org/apache/maven/wagon/wagon-provider-api/1.0-beta-6/wagon-provider-api-1.0-beta-6.pom
(2 KB at 107.4 KB/sec)
Downloading: http://repo.maven.apache.org/maven2/org/apache/maven/wagon/wagon/1.0-beta-6/wagon-1.0-beta-6.pom
Downloaded: http://repo.maven.apache.org/maven2/org/apache/maven/wagon/wagon/1.0-beta-6/wagon-1.0-beta-6.pom
(13 KB at 366.5 KB/sec)
Downloading: http://repo.maven.apache.org/maven2/commons-httpclient/commons-httpclient/3.1/commons-httpclient-3.1.pom
Downloaded: http://repo.maven.apache.org/maven2/commons-httpclient/commons-httpclient/3.1/commons-httpclient-3.1.pom
(8 KB at 244.6 KB/sec)
Downloading: http://repo.maven.apache.org/maven2/commons-codec/commons-codec/1.2/commons-codec-1.2.pom
Downloaded: http://repo.maven.apache.org/maven2/commons-codec/commons-codec/1.2/commons-codec-1.2.pom
(4 KB at 186.8 KB/sec)
Downloading: http://repo.maven.apache.org/maven2/log4j/log4j/1.2.14/log4j-1.2.14.pom
Downloaded: http://repo.maven.apache.org/maven2/log4j/log4j/1.2.14/log4j-1.2.14.pom (3 KB
at 9.7 KB/sec)
Downloading: http://repo.maven.apache.org/maven2/com/thoughtworks/qdox/qdox/1.12/qdox-1.12.pom
Downloaded: http://repo.maven.apache.org/maven2/com/thoughtworks/qdox/qdox/1.12/qdox-1.12.pom
(19 KB at 283.1 KB/sec)
Downloading: http://repo.maven.apache.org/maven2/org/mockito/mockito-core/1.8.5/mockito-core-1.8.5.pom
Downloaded: http://repo.maven.apache.org/maven2/org/mockito/mockito-core/1.8.5/mockito-core-1.8.5.pom
(2 KB at 77.3 KB/sec)
Downloading: http://repo.maven.apache.org/maven2/org/objenesis/objenesis/1.0/objenesis-1.0.pom
Downloaded: http://repo.maven.apache.org/maven2/org/objenesis/objenesis/1.0/objenesis-1.0.pom
(853 B at 41.7 KB/sec)
Downloading: http://repo.maven.apache.org/maven2/org/apache/maven/maven-archiver/2.3/maven-archiver-2.3.jar
Downloading: http://repo.maven.apache.org/maven2/org/apache/maven/shared/maven-invoker/2.0.9/maven-invoker-2.0.9.jar
Downloading: http://repo.maven.apache.org/maven2/org/apache/maven/doxia/doxia-sink-api/1.0/doxia-sink-api-1.0.jar
Downloading: http://repo.maven.apache.org/maven2/org/apache/maven/doxia/doxia-site-renderer/1.0/doxia-site-renderer-1.0.jar
Downloading: http://repo.maven.apache.org/maven2/org/apache/maven/doxia/doxia-core/1.0/doxia-core-1.0.jar
Downloaded: http://repo.maven.apache.org/maven2/org/apache/maven/doxia/doxia-core/1.0/doxia-core-1.0.jar
(54 KB at 2981.2 KB/sec)
Downloading: http://repo.maven.apache.org/maven2/org/codehaus/plexus/plexus-velocity/1.1.7/plexus-velocity-1.1.7.jar
Downloaded: http://repo.maven.apache.org/maven2/org/apache/maven/doxia/doxia-sink-api/1.0/doxia-sink-api-1.0.jar
(10 KB at 351.3 KB/sec)
Downloading: http://repo.maven.apache.org/maven2/org/apache/maven/doxia/doxia-decoration-model/1.0/doxia-decoration-model-1.0.jar
Downloaded: http://repo.maven.apache.org/maven2/org/apache/maven/doxia/doxia-site-renderer/1.0/doxia-site-renderer-1.0.jar
(46 KB at 1682.5 KB/sec)
Downloading: http://repo.maven.apache.org/maven2/commons-collections/commons-collections/3.2/commons-collections-3.2.jar
Downloaded: http://repo.maven.apache.org/maven2/org/codehaus/plexus/plexus-velocity/1.1.7/plexus-velocity-1.1.7.jar
(8 KB at 440.5 KB/sec)
Downloading: http://repo.maven.apache.org/maven2/org/apache/maven/doxia/doxia-module-apt/1.0/doxia-module-apt-1.0.jar
Downloaded: http://repo.maven.apache.org/maven2/org/apache/maven/maven-archiver/2.3/maven-archiver-2.3.jar
(18 KB at 368.6 KB/sec)
Downloading: http://repo.maven.apache.org/maven2/org/apache/maven/doxia/doxia-module-fml/1.0/doxia-module-fml-1.0.jar
Downloaded: http://repo.maven.apache.org/maven2/org/apache/maven/doxia/doxia-decoration-model/1.0/doxia-decoration-model-1.0.jar
(48 KB at 2079.9 KB/sec)
Downloading: http://repo.maven.apache.org/maven2/org/apache/maven/doxia/doxia-module-xdoc/1.0/doxia-module-xdoc-1.0.jar
Downloaded: http://repo.maven.apache.org/maven2/org/apache/maven/doxia/doxia-module-apt/1.0/doxia-module-apt-1.0.jar
(46 KB at 3065.0 KB/sec)
Downloading: http://repo.maven.apache.org/maven2/org/apache/maven/doxia/doxia-module-xhtml/1.0/doxia-module-xhtml-1.0.jar
Downloaded: http://repo.maven.apache.org/maven2/org/apache/maven/doxia/doxia-module-xdoc/1.0/doxia-module-xdoc-1.0.jar
(28 KB at 1428.7 KB/sec)
Downloading: http://repo.maven.apache.org/maven2/commons-httpclient/commons-httpclient/3.1/commons-httpclient-3.1.jar
Downloaded: http://repo.maven.apache.org/maven2/org/apache/maven/doxia/doxia-module-xhtml/1.0/doxia-module-xhtml-1.0.jar
(22 KB at 1252.6 KB/sec)
Downloading: http://repo.maven.apache.org/maven2/commons-codec/commons-codec/1.2/commons-codec-1.2.jar
Downloaded: http://repo.maven.apache.org/maven2/org/apache/maven/doxia/doxia-module-fml/1.0/doxia-module-fml-1.0.jar
(19 KB at 532.7 KB/sec)
Downloading: http://repo.maven.apache.org/maven2/log4j/log4j/1.2.14/log4j-1.2.14.jar
Downloaded: http://repo.maven.apache.org/maven2/org/apache/maven/shared/maven-invoker/2.0.9/maven-invoker-2.0.9.jar
(28 KB at 324.9 KB/sec)
Downloading: http://repo.maven.apache.org/maven2/com/thoughtworks/qdox/qdox/1.12/qdox-1.12.jar
Downloaded: http://repo.maven.apache.org/maven2/commons-codec/commons-codec/1.2/commons-codec-1.2.jar
(30 KB at 2098.6 KB/sec)
Downloading: http://repo.maven.apache.org/maven2/org/codehaus/plexus/plexus-archiver/1.0-alpha-9/plexus-archiver-1.0-alpha-9.jar
Downloaded: http://repo.maven.apache.org/maven2/log4j/log4j/1.2.14/log4j-1.2.14.jar (359 KB
at 5520.5 KB/sec)
Downloading: http://repo.maven.apache.org/maven2/org/codehaus/plexus/plexus-io/1.0-alpha-1/plexus-io-1.0-alpha-1.jar
Downloaded: http://repo.maven.apache.org/maven2/org/codehaus/plexus/plexus-io/1.0-alpha-1/plexus-io-1.0-alpha-1.jar
(12 KB at 995.3 KB/sec)
Downloading: http://repo.maven.apache.org/maven2/org/mockito/mockito-core/1.8.5/mockito-core-1.8.5.jar
Downloaded: http://repo.maven.apache.org/maven2/commons-httpclient/commons-httpclient/3.1/commons-httpclient-3.1.jar
(298 KB at 2345.3 KB/sec)
Downloading: http://repo.maven.apache.org/maven2/org/hamcrest/hamcrest-core/1.1/hamcrest-core-1.1.jar
Downloaded: http://repo.maven.apache.org/maven2/org/mockito/mockito-core/1.8.5/mockito-core-1.8.5.jar
(1308 KB at 27238.2 KB/sec)
Downloading: http://repo.maven.apache.org/maven2/org/objenesis/objenesis/1.0/objenesis-1.0.jar
Downloaded: http://repo.maven.apache.org/maven2/org/objenesis/objenesis/1.0/objenesis-1.0.jar
(28 KB at 2789.9 KB/sec)
Downloaded: http://repo.maven.apache.org/maven2/org/hamcrest/hamcrest-core/1.1/hamcrest-core-1.1.jar
(75 KB at 2414.4 KB/sec)
Downloaded: http://repo.maven.apache.org/maven2/com/thoughtworks/qdox/qdox/1.12/qdox-1.12.jar
(176 KB at 1008.7 KB/sec)
Downloaded: http://repo.maven.apache.org/maven2/commons-collections/commons-collections/3.2/commons-collections-3.2.jar
(558 KB at 2222.6 KB/sec)
Downloaded: http://repo.maven.apache.org/maven2/org/codehaus/plexus/plexus-archiver/1.0-alpha-9/plexus-archiver-1.0-alpha-9.jar
(154 KB at 185.7 KB/sec)
[ERROR] Unable to write 'javadoc.sh' debug script file
[INFO] 
Loading source files for package org.apache.mesos.state...
Loading source files for package org.apache.mesos...
Loading source files for package org.apache.mesos.v1.scheduler...
Loading source files for package org.apache.mesos.scheduler...
Loading source files for package org.apache.mesos.executor...
Loading source files for package org.apache.mesos.v1.allocator...
Loading source files for package org.apache.mesos.v1.executor...
Loading source files for package org.apache.mesos.v1.quota...
Loading source files for package org.apache.mesos.v1.master...
Loading source files for package org.apache.mesos.v1.resource_provider...
Loading source files for package org.apache.mesos.v1...
Loading source files for package org.apache.mesos.v1.agent...
Loading source files for package org.apache.mesos.v1.maintenance...
Constructing Javadoc information...
Standard Doclet version 1.7.0_131
Building tree for all the packages and classes...
Generating /mesos/mesos-1.4.0/_build/src/java/target/apidocs/org/apache/mesos/state/AbstractState.html...
Generating /mesos/mesos-1.4.0/_build/src/java/target/apidocs/org/apache/mesos/state/InMemoryState.html...
Generating /mesos/mesos-1.4.0/_build/src/java/target/apidocs/org/apache/mesos/state/LevelDBState.html...
Generating /mesos/mesos-1.4.0/_build/src/java/target/apidocs/org/apache/mesos/state/LogState.html...
Generating /mesos/mesos-1.4.0/_build/src/java/target/apidocs/org/apache/mesos/state/State.html...
Generating /mesos/mesos-1.4.0/_build/src/java/target/apidocs/org/apache/mesos/state/Variable.html...
Generating /mesos/mesos-1.4.0/_build/src/java/target/apidocs/org/apache/mesos/state/ZooKeeperState.html...
Generating /mesos/mesos-1.4.0/_build/src/java/target/apidocs/org/apache/mesos/Executor.html...
Generating /mesos/mesos-1.4.0/_build/src/java/target/apidocs/org/apache/mesos/ExecutorDriver.html...
Generating /mesos/mesos-1.4.0/_build/src/java/target/apidocs/org/apache/mesos/Log.html...
Generating /mesos/mesos-1.4.0/_build/src/java/target/apidocs/org/apache/mesos/Log.Entry.html...
Generating /mesos/mesos-1.4.0/_build/src/java/target/apidocs/org/apache/mesos/Log.OperationFailedException.html...
Generating /mesos/mesos-1.4.0/_build/src/java/target/apidocs/org/apache/mesos/Log.Position.html...
Generating /mesos/mesos-1.4.0/_build/src/java/target/apidocs/org/apache/mesos/Log.Reader.html...
Generating /mesos/mesos-1.4.0/_build/src/java/target/apidocs/org/apache/mesos/Log.Writer.html...
Generating /mesos/mesos-1.4.0/_build/src/java/target/apidocs/org/apache/mesos/Log.WriterFailedException.html...
Generating /mesos/mesos-1.4.0/_build/src/java/target/apidocs/org/apache/mesos/MesosExecutorDriver.html...
Generating /mesos/mesos-1.4.0/_build/src/java/target/apidocs/org/apache/mesos/MesosNativeLibrary.html...
Generating /mesos/mesos-1.4.0/_build/src/java/target/apidocs/org/apache/mesos/MesosNativeLibrary.Version.html...
Generating /mesos/mesos-1.4.0/_build/src/java/target/apidocs/org/apache/mesos/MesosSchedulerDriver.html...
Generating /mesos/mesos-1.4.0/_build/src/java/target/apidocs/org/apache/mesos/Protos.html...
Generating /mesos/mesos-1.4.0/_build/src/java/target/apidocs/org/apache/mesos/Protos.Address.html...
Generating /mesos/mesos-1.4.0/_build/src/java/target/apidocs/org/apache/mesos/Protos.Address.Builder.html...
Generating /mesos/mesos-1.4.0/_build/src/java/target/apidocs/org/apache/mesos/Protos.AddressOrBuilder.html...
Generating /mesos/mesos-1.4.0/_build/src/java/target/apidocs/org/apache/mesos/Protos.Attribute.html...
Generating /mesos/mesos-1.4.0/_build/src/java/target/apidocs/org/apache/mesos/Protos.Attribute.Builder.html...
Generating /mesos/mesos-1.4.0/_build/src/java/target/apidocs/org/apache/mesos/Protos.AttributeOrBuilder.html...
Generating /mesos/mesos-1.4.0/_build/src/java/target/apidocs/org/apache/mesos/Protos.CapabilityInfo.html...
Generating /mesos/mesos-1.4.0/_build/src/java/target/apidocs/org/apache/mesos/Protos.CapabilityInfo.Builder.html...
Generating /mesos/mesos-1.4.0/_build/src/java/target/apidocs/org/apache/mesos/Protos.CapabilityInfo.Capability.html...
Generating /mesos/mesos-1.4.0/_build/src/java/target/apidocs/org/apache/mesos/Protos.CapabilityInfoOrBuilder.html...
Generating /mesos/mesos-1.4.0/_build/src/java/target/apidocs/org/apache/mesos/Protos.CgroupInfo.html...
Generating /mesos/mesos-1.4.0/_build/src/java/target/apidocs/org/apache/mesos/Protos.CgroupInfo.Blkio.html...
Generating /mesos/mesos-1.4.0/_build/src/java/target/apidocs/org/apache/mesos/Protos.CgroupInfo.Blkio.Builder.html...
Generating /mesos/mesos-1.4.0/_build/src/java/target/apidocs/org/apache/mesos/Protos.CgroupInfo.Blkio.CFQ.html...
Generating /mesos/mesos-1.4.0/_build/src/java/target/apidocs/org/apache/mesos/Protos.CgroupInfo.Blkio.CFQ.Builder.html...
Generating /mesos/mesos-1.4.0/_build/src/java/target/apidocs/org/apache/mesos/Protos.CgroupInfo.Blkio.CFQ.Statistics.html...
Generating /mesos/mesos-1.4.0/_build/src/java/target/apidocs/org/apache/mesos/Protos.CgroupInfo.Blkio.CFQ.Statistics.Builder.html...
Generating /mesos/mesos-1.4.0/_build/src/java/target/apidocs/org/apache/mesos/Protos.CgroupInfo.Blkio.CFQ.StatisticsOrBuilder.html...
Generating /mesos/mesos-1.4.0/_build/src/java/target/apidocs/org/apache/mesos/Protos.CgroupInfo.Blkio.CFQOrBuilder.html...
Generating /mesos/mesos-1.4.0/_build/src/java/target/apidocs/org/apache/mesos/Protos.CgroupInfo.Blkio.Operation.html...
Generating /mesos/mesos-1.4.0/_build/src/java/target/apidocs/org/apache/mesos/Protos.CgroupInfo.Blkio.Statistics.html...
Generating /mesos/mesos-1.4.0/_build/src/java/target/apidocs/org/apache/mesos/Protos.CgroupInfo.Blkio.Statistics.Builder.html...
Generating /mesos/mesos-1.4.0/_build/src/java/target/apidocs/org/apache/mesos/Protos.CgroupInfo.Blkio.StatisticsOrBuilder.html...
Generating /mesos/mesos-1.4.0/_build/src/java/target/apidocs/org/apache/mesos/Protos.CgroupInfo.Blkio.Throttling.html...
Generating /mesos/mesos-1.4.0/_build/src/java/target/apidocs/org/apache/mesos/Protos.CgroupInfo.Blkio.Throttling.Builder.html...
Generating /mesos/mesos-1.4.0/_build/src/java/target/apidocs/org/apache/mesos/Protos.CgroupInfo.Blkio.Throttling.Statistics.html...
Generating /mesos/mesos-1.4.0/_build/src/java/target/apidocs/org/apache/mesos/Protos.CgroupInfo.Blkio.Throttling.Statistics.Builder.html...
Generating /mesos/mesos-1.4.0/_build/src/java/target/apidocs/org/apache/mesos/Protos.CgroupInfo.Blkio.Throttling.StatisticsOrBuilder.html...
Generating /mesos/mesos-1.4.0/_build/src/java/target/apidocs/org/apache/mesos/Protos.CgroupInfo.Blkio.ThrottlingOrBuilder.html...
Generating /mesos/mesos-1.4.0/_build/src/java/target/apidocs/org/apache/mesos/Protos.CgroupInfo.Blkio.Value.html...
Generating /mesos/mesos-1.4.0/_build/src/java/target/apidocs/org/apache/mesos/Protos.CgroupInfo.Blkio.Value.Builder.html...
Generating /mesos/mesos-1.4.0/_build/src/java/target/apidocs/org/apache/mesos/Protos.CgroupInfo.Blkio.ValueOrBuilder.html...
Generating /mesos/mesos-1.4.0/_build/src/java/target/apidocs/org/apache/mesos/Protos.CgroupInfo.BlkioOrBuilder.html...
Generating /mesos/mesos-1.4.0/_build/src/java/target/apidocs/org/apache/mesos/Protos.CgroupInfo.Builder.html...
Generating /mesos/mesos-1.4.0/_build/src/java/target/apidocs/org/apache/mesos/Protos.CgroupInfo.NetCls.html...
Generating /mesos/mesos-1.4.0/_build/src/java/target/apidocs/org/apache/mesos/Protos.CgroupInfo.NetCls.Builder.html...
Generating /mesos/mesos-1.4.0/_build/src/java/target/apidocs/org/apache/mesos/Protos.CgroupInfo.NetClsOrBuilder.html...
Generating /mesos/mesos-1.4.0/_build/src/java/target/apidocs/org/apache/mesos/Protos.CgroupInfoOrBuilder.html...
Generating /mesos/mesos-1.4.0/_build/src/java/target/apidocs/org/apache/mesos/Protos.CheckInfo.html...
Generating /mesos/mesos-1.4.0/_build/src/java/target/apidocs/org/apache/mesos/Protos.CheckInfo.Builder.html...
Generating /mesos/mesos-1.4.0/_build/src/java/target/apidocs/org/apache/mesos/Protos.CheckInfo.Command.html...
Generating /mesos/mesos-1.4.0/_build/src/java/target/apidocs/org/apache/mesos/Protos.CheckInfo.Command.Builder.html...
Generating /mesos/mesos-1.4.0/_build/src/java/target/apidocs/org/apache/mesos/Protos.CheckInfo.CommandOrBuilder.html...
Generating /mesos/mesos-1.4.0/_build/src/java/target/apidocs/org/apache/mesos/Protos.CheckInfo.Http.html...
Generating /mesos/mesos-1.4.0/_build/src/java/target/apidocs/org/apache/mesos/Protos.CheckInfo.Http.Builder.html...
Generating /mesos/mesos-1.4.0/_build/src/java/target/apidocs/org/apache/mesos/Protos.CheckInfo.HttpOrBuilder.html...
Generating /mesos/mesos-1.4.0/_build/src/java/target/apidocs/org/apache/mesos/Protos.CheckInfo.Tcp.html...
Generating /mesos/mesos-1.4.0/_build/src/java/target/apidocs/org/apache/mesos/Protos.CheckInfo.Tcp.Builder.html...
Generating /mesos/mesos-1.4.0/_build/src/java/target/apidocs/org/apache/mesos/Protos.CheckInfo.TcpOrBuilder.html...
Generating /mesos/mesos-1.4.0/_build/src/java/target/apidocs/org/apache/mesos/Protos.CheckInfo.Type.html...
Generating /mesos/mesos-1.4.0/_build/src/java/target/apidocs/org/apache/mesos/Protos.CheckInfoOrBuilder.html...
Generating /mesos/mesos-1.4.0/_build/src/java/target/apidocs/org/apache/mesos/Protos.CheckStatusInfo.html...
Generating /mesos/mesos-1.4.0/_build/src/java/target/apidocs/org/apache/mesos/Protos.CheckStatusInfo.Builder.html...
Generating /mesos/mesos-1.4.0/_build/src/java/target/apidocs/org/apache/mesos/Protos.CheckStatusInfo.Command.html...
Generating /mesos/mesos-1.4.0/_build/src/java/target/apidocs/org/apache/mesos/Protos.CheckStatusInfo.Command.Builder.html...
Generating /mesos/mesos-1.4.0/_build/src/java/target/apidocs/org/apache/mesos/Protos.CheckStatusInfo.CommandOrBuilder.html...
Generating /mesos/mesos-1.4.0/_build/src/java/target/apidocs/org/apache/mesos/Protos.CheckStatusInfo.Http.html...
Generating /mesos/mesos-1.4.0/_build/src/java/target/apidocs/org/apache/mesos/Protos.CheckStatusInfo.Http.Builder.html...
Generating /mesos/mesos-1.4.0/_build/src/java/target/apidocs/org/apache/mesos/Protos.CheckStatusInfo.HttpOrBuilder.html...
Generating /mesos/mesos-1.4.0/_build/src/java/target/apidocs/org/apache/mesos/Protos.CheckStatusInfo.Tcp.html...
Generating /mesos/mesos-1.4.0/_build/src/java/target/apidocs/org/apache/mesos/Protos.CheckStatusInfo.Tcp.Builder.html...
Generating /mesos/mesos-1.4.0/_build/src/java/target/apidocs/org/apache/mesos/Protos.CheckStatusInfo.TcpOrBuilder.html...
Generating /mesos/mesos-1.4.0/_build/src/java/target/apidocs/org/apache/mesos/Protos.CheckStatusInfoOrBuilder.html...
Generating /mesos/mesos-1.4.0/_build/src/java/target/apidocs/org/apache/mesos/Protos.CommandInfo.html...
Generating /mesos/mesos-1.4.0/_build/src/java/target/apidocs/org/apache/mesos/Protos.CommandInfo.Builder.html...
Generating /mesos/mesos-1.4.0/_build/src/java/target/apidocs/org/apache/mesos/Protos.CommandInfo.URI.html...
Generating /mesos/mesos-1.4.0/_build/src/java/target/apidocs/org/apache/mesos/Protos.CommandInfo.URI.Builder.html...
Generating /mesos/mesos-1.4.0/_build/src/java/target/apidocs/org/apache/mesos/Protos.CommandInfo.URIOrBuilder.html...
Generating /mesos/mesos-1.4.0/_build/src/java/target/apidocs/org/apache/mesos/Protos.CommandInfoOrBuilder.html...
Generating /mesos/mesos-1.4.0/_build/src/java/target/apidocs/org/apache/mesos/Protos.ContainerID.html...
Generating /mesos/mesos-1.4.0/_build/src/java/target/apidocs/org/apache/mesos/Protos.ContainerID.Builder.html...
Generating /mesos/mesos-1.4.0/_build/src/java/target/apidocs/org/apache/mesos/Protos.ContainerIDOrBuilder.html...
Generating /mesos/mesos-1.4.0/_build/src/java/target/apidocs/org/apache/mesos/Protos.ContainerInfo.html...
1 error
1 warning
[INFO] ------------------------------------------------------------------------
[INFO] BUILD FAILURE
[INFO] ------------------------------------------------------------------------
[INFO] Total time: 2:53.190s
[INFO] Finished at: Mon Aug 14 18:23:28 UTC 2017
[INFO] Final Memory: 39M/2244M
[INFO] ------------------------------------------------------------------------
[ERROR] Failed to execute goal org.apache.maven.plugins:maven-javadoc-plugin:2.8.1:jar (build-and-attach-javadocs)
on project mesos: MavenReportException: Error while creating archive:
[ERROR] Exit code: 1 - /mesos/mesos-1.4.0/_build/../src/java/src/org/apache/mesos/SchedulerDriver.java:222:
warning - Tag @see: reference not found: Offer.Operation
[ERROR] javadoc: error - No space left on device
[ERROR] 
[ERROR] Command line was: /usr/lib/jvm/java-7-openjdk-amd64/jre/../bin/javadoc @options
[ERROR] 
[ERROR] Refer to the generated Javadoc files in '/mesos/mesos-1.4.0/_build/src/java/target/apidocs'
dir.
[ERROR] -> [Help 1]
[ERROR] 
[ERROR] To see the full stack trace of the errors, re-run Maven with the -e switch.
[ERROR] Re-run Maven using the -X switch to enable full debug logging.
[ERROR] 
[ERROR] For more information about the errors and possible solutions, please read the following
articles:
[ERROR] [Help 1] http://cwiki.apache.org/confluence/display/MAVEN/MojoExecutionException
make[2]: *** [java/target/mesos-1.4.0.jar] Error 1
make[2]: Leaving directory `/mesos/mesos-1.4.0/_build/src'
make[1]: *** [all-recursive] Error 1
make[1]: Leaving directory `/mesos/mesos-1.4.0/_build'
make: *** [distcheck] Error 1
+ docker rmi mesos-1502733881-22269
Untagged: mesos-1502733881-22269:latest
Deleted: sha256:5d93cbe0ad0beea94c2bfe72d1b0903e1f28811d53b2bf923be3c9676e142191
Deleted: sha256:7b643c84eb4c708a0a422795e2e0627614718a260f9b555b4628693e183e965a
Deleted: sha256:035e02d0f76e560274e308618f290260e42d4992c7f4e6b6e1160c41dea8467f
Deleted: sha256:37c71973b33e464c0ab0eab624fa2c87c6144d630f39c6323463a13faa51a778
Deleted: sha256:5002a072defa936951feb469724680bd7e5b7649aafb05f4f73be08937b2ed6c
Deleted: sha256:4ae1cc8bf41d4e676ba05dfea03038dcdb558a4d78e36a95c10f4a0acf331ba2
Deleted: sha256:a2b6d27b5d55d4c3ae5787c01915f09191873eedaffb9ff33d5ee76f70c78b73
Deleted: sha256:7da36a18c570e6c615e9751afbeb26b72891a7eacd1d490ea0e6cf6a8724d621
Deleted: sha256:f9691d821c8119fda01ddd73c5361783c8e25d9a32f554ab7ca4d5ab1e8b70a3
Deleted: sha256:51a80e656e4db231250231476471f47d4cc9b82036290448cbba65c9f48afd01
Deleted: sha256:bd05acd30f16b30554b9f9a70c1a1c20fbabe0e14f93bdf8489dfc984abdb5aa
Deleted: sha256:6e7f5e800da3d21bebde5db0fb052d6efe0975d7706c5594e05dc8a3ce80f0d7
Deleted: sha256:08b2d27027a699f262b53b9260593ecdbbafa802ab1466c9b2630f37a76abd22
Deleted: sha256:b0049df10ced5a1b91c5e38d2281e87d310429c2417302aa44e15a8a5d217416
Deleted: sha256:98ceb225609445928cc1ccd1d7b06294010a32d02cd37c8e9fb1ef3ac5f8b427
Deleted: sha256:de604e87f1ae94815173858e8ccac0eda66f2ce33d1b3fd3d02a36576bd6c631
Deleted: sha256:4b5392c3b54b29128906017c112ab7be1d1fbf6d99d57c845cd8d0c026e142b5
Deleted: sha256:59d4cc2fc209ecb4657b07ae9da0cee30c4c49ff452839135a9a8fca98382acc
Deleted: sha256:dcdc7f22370951a7a129b4c33b83ecc9385502f3c04ae711ccdc05fd8e7f5e39
Deleted: sha256:5390a866d0ec3984517758d2487129581ffdbb725e29330d240ca6a13362dd01
Deleted: sha256:8e2d870618f5e06d55015e3ff484879ad049801f412b30de633e15eac65c3b8a
Deleted: sha256:2300c76788663970d19ec8e58640fc911dda1df2ee8ccd07b3a4b72b15760438
Deleted: sha256:91c09a8aea59c0bb94f9265f45bc0987794dd9c3f23524dbd678fd2e32e70cb6
Deleted: sha256:f80c3a021949198c832e271fa37e895c1527ae52c2a8b7763118b5ed2d47ccb8
Build step 'Execute shell' marked build as failure

Mime
View raw message