mesos-builds mailing list archives

Site index · List index
Message view « Date » · « Thread »
Top « Date » · « Thread »
From Apache Jenkins Server <jenk...@builds.apache.org>
Subject Build failed in Jenkins: Mesos-Buildbot » autotools,gcc,--verbose,GLOG_v=1 MESOS_VERBOSE=1,centos:7,(ubuntu)&&(!ubuntu-us1)&&(!ubuntu-eu2) #4072
Date Sat, 05 Aug 2017 02:21:13 GMT
See <https://builds.apache.org/job/Mesos-Buildbot/BUILDTOOL=autotools,COMPILER=gcc,CONFIGURATION=--verbose,ENVIRONMENT=GLOG_v=1%20MESOS_VERBOSE=1,OS=centos%3A7,label_exp=(ubuntu)&&(!ubuntu-us1)&&(!ubuntu-eu2)/4072/display/redirect>

------------------------------------------
[...truncated 30.61 MB...]
I0805 02:21:07.988129  6459 credentials.hpp:86] Loading credential for authentication from
'/tmp/Endpoint_SlaveEndpointTest_AuthorizedRequest_2_FaUJkz/credential'
I0805 02:21:07.988289  6459 slave.cpp:283] Agent using credential for: test-principal
I0805 02:21:07.988312  6459 credentials.hpp:37] Loading credentials for authentication from
'/tmp/Endpoint_SlaveEndpointTest_AuthorizedRequest_2_FaUJkz/http_credentials'
I0805 02:21:07.988539  6459 http.cpp:1026] Creating default 'basic' HTTP authenticator for
realm 'mesos-agent-readonly'
I0805 02:21:07.988759  6459 http.cpp:1026] Creating default 'basic' HTTP authenticator for
realm 'mesos-agent-readwrite'
I0805 02:21:07.990139  6459 slave.cpp:565] Agent resources: [{"name":"cpus","scalar":{"value":2.0},"type":"SCALAR"},{"name":"mem","scalar":{"value":1024.0},"type":"SCALAR"},{"name":"disk","scalar":{"value":1024.0},"type":"SCALAR"},{"name":"ports","ranges":{"range":[{"begin":31000,"end":32000}]},"type":"RANGES"}]
I0805 02:21:07.990384  6459 slave.cpp:573] Agent attributes: [  ]
I0805 02:21:07.990399  6459 slave.cpp:582] Agent hostname: 1eb86fc73547
I0805 02:21:07.990531  6469 status_update_manager.cpp:177] Pausing sending status updates
I0805 02:21:07.992046  6447 state.cpp:64] Recovering state from '/tmp/Endpoint_SlaveEndpointTest_AuthorizedRequest_2_n4ZAj1/meta'
I0805 02:21:07.992398  6447 status_update_manager.cpp:203] Recovering status update manager
I0805 02:21:07.992715  6449 containerizer.cpp:598] Recovering containerizer
I0805 02:21:07.994657  6459 provisioner.cpp:416] Provisioner recovery complete
I0805 02:21:07.995120  6448 slave.cpp:6207] Finished recovery
I0805 02:21:07.995617  6448 slave.cpp:6389] Querying resource estimator for oversubscribable
resources
I0805 02:21:07.995904  6449 slave.cpp:6403] Received oversubscribable resources {} from the
resource estimator
I0805 02:21:07.998837  6465 process.cpp:3933] Handling HTTP event for process 'slave(795)'
with path: '/slave(795)/containers'
I0805 02:21:08.000283  6459 http.cpp:1166] HTTP GET for /slave(795)/containers from 172.17.0.3:42702
I0805 02:21:08.000368  6459 http.cpp:957] Authorizing principal 'test-principal' to GET the
'/containers' endpoint
I0805 02:21:08.004912  6453 slave.cpp:843] Agent terminating
[       OK ] Endpoint/SlaveEndpointTest.AuthorizedRequest/2 (40 ms)
[ RUN      ] Endpoint/SlaveEndpointTest.UnauthorizedRequest/0
I0805 02:21:08.020105  6427 containerizer.cpp:246] Using isolation: posix/cpu,posix/mem,filesystem/posix,network/cni,environment_secret
W0805 02:21:08.021070  6427 backend.cpp:76] Failed to create 'aufs' backend: AufsBackend requires
root privileges
W0805 02:21:08.021271  6427 backend.cpp:76] Failed to create 'bind' backend: BindBackend requires
root privileges
I0805 02:21:08.021335  6427 provisioner.cpp:255] Using default backend 'copy'
I0805 02:21:08.026888  6461 slave.cpp:250] Mesos agent started on (796)@172.17.0.3:41208
I0805 02:21:08.026917  6461 slave.cpp:251] Flags at startup: --acls="" --appc_simple_discovery_uri_prefix="http://"
--appc_store_dir="/tmp/Endpoint_SlaveEndpointTest_UnauthorizedRequest_0_Ejs0JL/store/appc"
--authenticate_http_readonly="true" --authenticate_http_readwrite="true" --authenticatee="crammd5"
--authentication_backoff_factor="1secs" --authorizer="local" --cgroups_cpu_enable_pids_and_tids_count="false"
--cgroups_enable_cfs="false" --cgroups_hierarchy="/sys/fs/cgroup" --cgroups_limit_swap="false"
--cgroups_root="mesos" --container_disk_watch_interval="15secs" --containerizers="mesos" --credential="/tmp/Endpoint_SlaveEndpointTest_UnauthorizedRequest_0_Ejs0JL/credential"
--default_role="*" --disk_watch_interval="1mins" --docker="docker" --docker_kill_orphans="true"
--docker_registry="https://registry-1.docker.io" --docker_remove_delay="6hrs" --docker_socket="/var/run/docker.sock"
--docker_stop_timeout="0ns" --docker_store_dir="/tmp/Endpoint_SlaveEndpointTest_UnauthorizedRequest_0_Ejs0JL/store/docker"
--docker_volume_checkpoint_dir="/var/run/mesos/isolators/docker/volume" --enforce_container_disk_quota="false"
--executor_registration_timeout="1mins" --executor_reregistration_timeout="2secs" --executor_shutdown_grace_period="5secs"
--fetcher_cache_dir="/tmp/Endpoint_SlaveEndpointTest_UnauthorizedRequest_0_Ejs0JL/fetch" --fetcher_cache_size="2GB"
--frameworks_home="" --gc_delay="1weeks" --gc_disk_headroom="0.1" --hadoop_home="" --help="false"
--hostname_lookup="true" --http_command_executor="false" --http_credentials="/tmp/Endpoint_SlaveEndpointTest_UnauthorizedRequest_0_Ejs0JL/http_credentials"
--http_heartbeat_interval="30secs" --initialize_driver_logging="true" --isolation="posix/cpu,posix/mem"
--launcher="posix" --launcher_dir="/mesos/mesos-1.4.0/_build/src" --logbufsecs="0" --logging_level="INFO"
--max_completed_executors_per_framework="150" --oversubscribed_resources_interval="15secs"
--perf_duration="10secs" --perf_interval="1mins" --port="5051" --qos_correction_interval_min="0ns"
--quiet="false" --recover="reconnect" --recovery_timeout="15mins" --registration_backoff_factor="10ms"
--resources="cpus:2;gpus:0;mem:1024;disk:1024;ports:[31000-32000]" --revocable_cpu_low_priority="true"
--runtime_dir="/tmp/Endpoint_SlaveEndpointTest_UnauthorizedRequest_0_Ejs0JL" --sandbox_directory="/mnt/mesos/sandbox"
--strict="true" --switch_user="true" --systemd_enable_support="true" --systemd_runtime_directory="/run/systemd/system"
--version="false" --work_dir="/tmp/Endpoint_SlaveEndpointTest_UnauthorizedRequest_0_wtbOCd"
I0805 02:21:08.027330  6461 credentials.hpp:86] Loading credential for authentication from
'/tmp/Endpoint_SlaveEndpointTest_UnauthorizedRequest_0_Ejs0JL/credential'
I0805 02:21:08.027600  6461 slave.cpp:283] Agent using credential for: test-principal
I0805 02:21:08.027631  6461 credentials.hpp:37] Loading credentials for authentication from
'/tmp/Endpoint_SlaveEndpointTest_UnauthorizedRequest_0_Ejs0JL/http_credentials'
I0805 02:21:08.028007  6461 http.cpp:1026] Creating default 'basic' HTTP authenticator for
realm 'mesos-agent-readonly'
I0805 02:21:08.028221  6461 http.cpp:1026] Creating default 'basic' HTTP authenticator for
realm 'mesos-agent-readwrite'
I0805 02:21:08.030279  6461 slave.cpp:565] Agent resources: [{"name":"cpus","scalar":{"value":2.0},"type":"SCALAR"},{"name":"mem","scalar":{"value":1024.0},"type":"SCALAR"},{"name":"disk","scalar":{"value":1024.0},"type":"SCALAR"},{"name":"ports","ranges":{"range":[{"begin":31000,"end":32000}]},"type":"RANGES"}]
I0805 02:21:08.030683  6461 slave.cpp:573] Agent attributes: [  ]
I0805 02:21:08.030705  6461 slave.cpp:582] Agent hostname: 1eb86fc73547
I0805 02:21:08.030908  6469 status_update_manager.cpp:177] Pausing sending status updates
I0805 02:21:08.032380  6468 state.cpp:64] Recovering state from '/tmp/Endpoint_SlaveEndpointTest_UnauthorizedRequest_0_wtbOCd/meta'
I0805 02:21:08.032765  6465 status_update_manager.cpp:203] Recovering status update manager
I0805 02:21:08.033063  6465 containerizer.cpp:598] Recovering containerizer
I0805 02:21:08.034888  6464 provisioner.cpp:416] Provisioner recovery complete
I0805 02:21:08.035286  6461 slave.cpp:6207] Finished recovery
I0805 02:21:08.035809  6461 slave.cpp:6389] Querying resource estimator for oversubscribable
resources
I0805 02:21:08.036187  6453 slave.cpp:6403] Received oversubscribable resources {} from the
resource estimator
I0805 02:21:08.038746  6457 process.cpp:3933] Handling HTTP event for process 'slave(796)'
with path: '/slave(796)/monitor/statistics'
I0805 02:21:08.040546  6458 http.cpp:1166] HTTP GET for /slave(796)/monitor/statistics from
172.17.0.3:42704
I0805 02:21:08.040653  6458 http.cpp:957] Authorizing principal 'test-principal' to GET the
'/monitor/statistics' endpoint
I0805 02:21:08.045104  6427 slave.cpp:843] Agent terminating
[       OK ] Endpoint/SlaveEndpointTest.UnauthorizedRequest/0 (40 ms)
[ RUN      ] Endpoint/SlaveEndpointTest.UnauthorizedRequest/1
I0805 02:21:08.059095  6427 containerizer.cpp:246] Using isolation: posix/cpu,posix/mem,filesystem/posix,network/cni,environment_secret
W0805 02:21:08.059739  6427 backend.cpp:76] Failed to create 'aufs' backend: AufsBackend requires
root privileges
W0805 02:21:08.059860  6427 backend.cpp:76] Failed to create 'bind' backend: BindBackend requires
root privileges
I0805 02:21:08.059902  6427 provisioner.cpp:255] Using default backend 'copy'
I0805 02:21:08.064076  6465 slave.cpp:250] Mesos agent started on (797)@172.17.0.3:41208
I0805 02:21:08.064108  6465 slave.cpp:251] Flags at startup: --acls="" --appc_simple_discovery_uri_prefix="http://"
--appc_store_dir="/tmp/Endpoint_SlaveEndpointTest_UnauthorizedRequest_1_Uk0fxY/store/appc"
--authenticate_http_readonly="true" --authenticate_http_readwrite="true" --authenticatee="crammd5"
--authentication_backoff_factor="1secs" --authorizer="local" --cgroups_cpu_enable_pids_and_tids_count="false"
--cgroups_enable_cfs="false" --cgroups_hierarchy="/sys/fs/cgroup" --cgroups_limit_swap="false"
--cgroups_root="mesos" --container_disk_watch_interval="15secs" --containerizers="mesos" --credential="/tmp/Endpoint_SlaveEndpointTest_UnauthorizedRequest_1_Uk0fxY/credential"
--default_role="*" --disk_watch_interval="1mins" --docker="docker" --docker_kill_orphans="true"
--docker_registry="https://registry-1.docker.io" --docker_remove_delay="6hrs" --docker_socket="/var/run/docker.sock"
--docker_stop_timeout="0ns" --docker_store_dir="/tmp/Endpoint_SlaveEndpointTest_UnauthorizedRequest_1_Uk0fxY/store/docker"
--docker_volume_checkpoint_dir="/var/run/mesos/isolators/docker/volume" --enforce_container_disk_quota="false"
--executor_registration_timeout="1mins" --executor_reregistration_timeout="2secs" --executor_shutdown_grace_period="5secs"
--fetcher_cache_dir="/tmp/Endpoint_SlaveEndpointTest_UnauthorizedRequest_1_Uk0fxY/fetch" --fetcher_cache_size="2GB"
--frameworks_home="" --gc_delay="1weeks" --gc_disk_headroom="0.1" --hadoop_home="" --help="false"
--hostname_lookup="true" --http_command_executor="false" --http_credentials="/tmp/Endpoint_SlaveEndpointTest_UnauthorizedRequest_1_Uk0fxY/http_credentials"
--http_heartbeat_interval="30secs" --initialize_driver_logging="true" --isolation="posix/cpu,posix/mem"
--launcher="posix" --launcher_dir="/mesos/mesos-1.4.0/_build/src" --logbufsecs="0" --logging_level="INFO"
--max_completed_executors_per_framework="150" --oversubscribed_resources_interval="15secs"
--perf_duration="10secs" --perf_interval="1mins" --port="5051" --qos_correction_interval_min="0ns"
--quiet="false" --recover="reconnect" --recovery_timeout="15mins" --registration_backoff_factor="10ms"
--resources="cpus:2;gpus:0;mem:1024;disk:1024;ports:[31000-32000]" --revocable_cpu_low_priority="true"
--runtime_dir="/tmp/Endpoint_SlaveEndpointTest_UnauthorizedRequest_1_Uk0fxY" --sandbox_directory="/mnt/mesos/sandbox"
--strict="true" --switch_user="true" --systemd_enable_support="true" --systemd_runtime_directory="/run/systemd/system"
--version="false" --work_dir="/tmp/Endpoint_SlaveEndpointTest_UnauthorizedRequest_1_Tzx6jq"
I0805 02:21:08.064498  6465 credentials.hpp:86] Loading credential for authentication from
'/tmp/Endpoint_SlaveEndpointTest_UnauthorizedRequest_1_Uk0fxY/credential'
I0805 02:21:08.064735  6465 slave.cpp:283] Agent using credential for: test-principal
I0805 02:21:08.064770  6465 credentials.hpp:37] Loading credentials for authentication from
'/tmp/Endpoint_SlaveEndpointTest_UnauthorizedRequest_1_Uk0fxY/http_credentials'
I0805 02:21:08.065049  6465 http.cpp:1026] Creating default 'basic' HTTP authenticator for
realm 'mesos-agent-readonly'
I0805 02:21:08.065235  6465 http.cpp:1026] Creating default 'basic' HTTP authenticator for
realm 'mesos-agent-readwrite'
I0805 02:21:08.066776  6465 slave.cpp:565] Agent resources: [{"name":"cpus","scalar":{"value":2.0},"type":"SCALAR"},{"name":"mem","scalar":{"value":1024.0},"type":"SCALAR"},{"name":"disk","scalar":{"value":1024.0},"type":"SCALAR"},{"name":"ports","ranges":{"range":[{"begin":31000,"end":32000}]},"type":"RANGES"}]
I0805 02:21:08.067037  6465 slave.cpp:573] Agent attributes: [  ]
I0805 02:21:08.067051  6465 slave.cpp:582] Agent hostname: 1eb86fc73547
I0805 02:21:08.067284  6455 status_update_manager.cpp:177] Pausing sending status updates
I0805 02:21:08.068778  6447 state.cpp:64] Recovering state from '/tmp/Endpoint_SlaveEndpointTest_UnauthorizedRequest_1_Tzx6jq/meta'
I0805 02:21:08.069192  6449 status_update_manager.cpp:203] Recovering status update manager
I0805 02:21:08.069464  6459 containerizer.cpp:598] Recovering containerizer
I0805 02:21:08.071322  6460 provisioner.cpp:416] Provisioner recovery complete
I0805 02:21:08.071779  6465 slave.cpp:6207] Finished recovery
I0805 02:21:08.072284  6465 slave.cpp:6389] Querying resource estimator for oversubscribable
resources
I0805 02:21:08.072693  6467 slave.cpp:6403] Received oversubscribable resources {} from the
resource estimator
I0805 02:21:08.075372  6458 process.cpp:3933] Handling HTTP event for process 'slave(797)'
with path: '/slave(797)/monitor/statistics.json'
I0805 02:21:08.076639  6462 http.cpp:1166] HTTP GET for /slave(797)/monitor/statistics.json
from 172.17.0.3:42706
I0805 02:21:08.076786  6462 http.cpp:957] Authorizing principal 'test-principal' to GET the
'/monitor/statistics.json' endpoint
I0805 02:21:08.079609  6462 slave.cpp:843] Agent terminating
[       OK ] Endpoint/SlaveEndpointTest.UnauthorizedRequest/1 (34 ms)
[ RUN      ] Endpoint/SlaveEndpointTest.UnauthorizedRequest/2
I0805 02:21:08.092875  6427 containerizer.cpp:246] Using isolation: posix/cpu,posix/mem,filesystem/posix,network/cni,environment_secret
W0805 02:21:08.093384  6427 backend.cpp:76] Failed to create 'aufs' backend: AufsBackend requires
root privileges
W0805 02:21:08.093492  6427 backend.cpp:76] Failed to create 'bind' backend: BindBackend requires
root privileges
I0805 02:21:08.093523  6427 provisioner.cpp:255] Using default backend 'copy'
I0805 02:21:08.097174  6465 slave.cpp:250] Mesos agent started on (798)@172.17.0.3:41208
I0805 02:21:08.097200  6465 slave.cpp:251] Flags at startup: --acls="" --appc_simple_discovery_uri_prefix="http://"
--appc_store_dir="/tmp/Endpoint_SlaveEndpointTest_UnauthorizedRequest_2_mVWlFb/store/appc"
--authenticate_http_readonly="true" --authenticate_http_readwrite="true" --authenticatee="crammd5"
--authentication_backoff_factor="1secs" --authorizer="local" --cgroups_cpu_enable_pids_and_tids_count="false"
--cgroups_enable_cfs="false" --cgroups_hierarchy="/sys/fs/cgroup" --cgroups_limit_swap="false"
--cgroups_root="mesos" --container_disk_watch_interval="15secs" --containerizers="mesos" --credential="/tmp/Endpoint_SlaveEndpointTest_UnauthorizedRequest_2_mVWlFb/credential"
--default_role="*" --disk_watch_interval="1mins" --docker="docker" --docker_kill_orphans="true"
--docker_registry="https://registry-1.docker.io" --docker_remove_delay="6hrs" --docker_socket="/var/run/docker.sock"
--docker_stop_timeout="0ns" --docker_store_dir="/tmp/Endpoint_SlaveEndpointTest_UnauthorizedRequest_2_mVWlFb/store/docker"
--docker_volume_checkpoint_dir="/var/run/mesos/isolators/docker/volume" --enforce_container_disk_quota="false"
--executor_registration_timeout="1mins" --executor_reregistration_timeout="2secs" --executor_shutdown_grace_period="5secs"
--fetcher_cache_dir="/tmp/Endpoint_SlaveEndpointTest_UnauthorizedRequest_2_mVWlFb/fetch" --fetcher_cache_size="2GB"
--frameworks_home="" --gc_delay="1weeks" --gc_disk_headroom="0.1" --hadoop_home="" --help="false"
--hostname_lookup="true" --http_command_executor="false" --http_credentials="/tmp/Endpoint_SlaveEndpointTest_UnauthorizedRequest_2_mVWlFb/http_credentials"
--http_heartbeat_interval="30secs" --initialize_driver_logging="true" --isolation="posix/cpu,posix/mem"
--launcher="posix" --launcher_dir="/mesos/mesos-1.4.0/_build/src" --logbufsecs="0" --logging_level="INFO"
--max_completed_executors_per_framework="150" --oversubscribed_resources_interval="15secs"
--perf_duration="10secs" --perf_interval="1mins" --port="5051" --qos_correction_interval_min="0ns"
--quiet="false" --recover="reconnect" --recovery_timeout="15mins" --registration_backoff_factor="10ms"
--resources="cpus:2;gpus:0;mem:1024;disk:1024;ports:[31000-32000]" --revocable_cpu_low_priority="true"
--runtime_dir="/tmp/Endpoint_SlaveEndpointTest_UnauthorizedRequest_2_mVWlFb" --sandbox_directory="/mnt/mesos/sandbox"
--strict="true" --switch_user="true" --systemd_enable_support="true" --systemd_runtime_directory="/run/systemd/system"
--version="false" --work_dir="/tmp/Endpoint_SlaveEndpointTest_UnauthorizedRequest_2_B934mD"
I0805 02:21:08.097545  6465 credentials.hpp:86] Loading credential for authentication from
'/tmp/Endpoint_SlaveEndpointTest_UnauthorizedRequest_2_mVWlFb/credential'
I0805 02:21:08.097710  6465 slave.cpp:283] Agent using credential for: test-principal
I0805 02:21:08.097733  6465 credentials.hpp:37] Loading credentials for authentication from
'/tmp/Endpoint_SlaveEndpointTest_UnauthorizedRequest_2_mVWlFb/http_credentials'
I0805 02:21:08.097970  6465 http.cpp:1026] Creating default 'basic' HTTP authenticator for
realm 'mesos-agent-readonly'
I0805 02:21:08.098112  6465 http.cpp:1026] Creating default 'basic' HTTP authenticator for
realm 'mesos-agent-readwrite'
I0805 02:21:08.099475  6465 slave.cpp:565] Agent resources: [{"name":"cpus","scalar":{"value":2.0},"type":"SCALAR"},{"name":"mem","scalar":{"value":1024.0},"type":"SCALAR"},{"name":"disk","scalar":{"value":1024.0},"type":"SCALAR"},{"name":"ports","ranges":{"range":[{"begin":31000,"end":32000}]},"type":"RANGES"}]
I0805 02:21:08.099735  6465 slave.cpp:573] Agent attributes: [  ]
I0805 02:21:08.099747  6465 slave.cpp:582] Agent hostname: 1eb86fc73547
I0805 02:21:08.099963  6450 status_update_manager.cpp:177] Pausing sending status updates
I0805 02:21:08.101441  6448 state.cpp:64] Recovering state from '/tmp/Endpoint_SlaveEndpointTest_UnauthorizedRequest_2_B934mD/meta'
I0805 02:21:08.101858  6447 status_update_manager.cpp:203] Recovering status update manager
I0805 02:21:08.102133  6461 containerizer.cpp:598] Recovering containerizer
I0805 02:21:08.104058  6464 provisioner.cpp:416] Provisioner recovery complete
I0805 02:21:08.104487  6464 slave.cpp:6207] Finished recovery
I0805 02:21:08.104990  6464 slave.cpp:6389] Querying resource estimator for oversubscribable
resources
I0805 02:21:08.105322  6463 slave.cpp:6403] Received oversubscribable resources {} from the
resource estimator
I0805 02:21:08.107977  6452 process.cpp:3933] Handling HTTP event for process 'slave(798)'
with path: '/slave(798)/containers'
I0805 02:21:08.109570  6452 http.cpp:1166] HTTP GET for /slave(798)/containers from 172.17.0.3:42710
I0805 02:21:08.109658  6452 http.cpp:957] Authorizing principal 'test-principal' to GET the
'/containers' endpoint
I0805 02:21:08.112252  6447 slave.cpp:843] Agent terminating
[       OK ] Endpoint/SlaveEndpointTest.UnauthorizedRequest/2 (32 ms)
[ RUN      ] Endpoint/SlaveEndpointTest.NoAuthorizer/0
I0805 02:21:08.126437  6427 containerizer.cpp:246] Using isolation: posix/cpu,posix/mem,filesystem/posix,network/cni,environment_secret
W0805 02:21:08.127035  6427 backend.cpp:76] Failed to create 'aufs' backend: AufsBackend requires
root privileges
W0805 02:21:08.127162  6427 backend.cpp:76] Failed to create 'bind' backend: BindBackend requires
root privileges
I0805 02:21:08.127197  6427 provisioner.cpp:255] Using default backend 'copy'
I0805 02:21:08.129372  6427 cluster.cpp:448] Creating default 'local' authorizer
I0805 02:21:08.131556  6454 slave.cpp:250] Mesos agent started on (799)@172.17.0.3:41208
I0805 02:21:08.131585  6454 slave.cpp:251] Flags at startup: --acls="" --appc_simple_discovery_uri_prefix="http://"
--appc_store_dir="/tmp/Endpoint_SlaveEndpointTest_NoAuthorizer_0_mH7Y6o/store/appc" --authenticate_http_readonly="true"
--authenticate_http_readwrite="true" --authenticatee="crammd5" --authentication_backoff_factor="1secs"
--authorizer="local" --cgroups_cpu_enable_pids_and_tids_count="false" --cgroups_enable_cfs="false"
--cgroups_hierarchy="/sys/fs/cgroup" --cgroups_limit_swap="false" --cgroups_root="mesos" --container_disk_watch_interval="15secs"
--containerizers="mesos" --credential="/tmp/Endpoint_SlaveEndpointTest_NoAuthorizer_0_mH7Y6o/credential"
--default_role="*" --disk_watch_interval="1mins" --docker="docker" --docker_kill_orphans="true"
--docker_registry="https://registry-1.docker.io" --docker_remove_delay="6hrs" --docker_socket="/var/run/docker.sock"
--docker_stop_timeout="0ns" --docker_store_dir="/tmp/Endpoint_SlaveEndpointTest_NoAuthorizer_0_mH7Y6o/store/docker"
--docker_volume_checkpoint_dir="/var/run/mesos/isolators/docker/volume" --enforce_container_disk_quota="false"
--executor_registration_timeout="1mins" --executor_reregistration_timeout="2secs" --executor_shutdown_grace_period="5secs"
--fetcher_cache_dir="/tmp/Endpoint_SlaveEndpointTest_NoAuthorizer_0_mH7Y6o/fetch" --fetcher_cache_size="2GB"
--frameworks_home="" --gc_delay="1weeks" --gc_disk_headroom="0.1" --hadoop_home="" --help="false"
--hostname_lookup="true" --http_command_executor="false" --http_credentials="/tmp/Endpoint_SlaveEndpointTest_NoAuthorizer_0_mH7Y6o/http_credentials"
--http_heartbeat_interval="30secs" --initialize_driver_logging="true" --isolation="posix/cpu,posix/mem"
--launcher="posix" --launcher_dir="/mesos/mesos-1.4.0/_build/src" --logbufsecs="0" --logging_level="INFO"
--max_completed_executors_per_framework="150" --oversubscribed_resources_interval="15secs"
--perf_duration="10secs" --perf_interval="1mins" --port="5051" --qos_correction_interval_min="0ns"
--quiet="false" --recover="reconnect" --recovery_timeout="15mins" --registration_backoff_factor="10ms"
--resources="cpus:2;gpus:0;mem:1024;disk:1024;ports:[31000-32000]" --revocable_cpu_low_priority="true"
--runtime_dir="/tmp/Endpoint_SlaveEndpointTest_NoAuthorizer_0_mH7Y6o" --sandbox_directory="/mnt/mesos/sandbox"
--strict="true" --switch_user="true" --systemd_enable_support="true" --systemd_runtime_directory="/run/systemd/system"
--version="false" --work_dir="/tmp/Endpoint_SlaveEndpointTest_NoAuthorizer_0_HcBOJQ"
I0805 02:21:08.132001  6454 credentials.hpp:86] Loading credential for authentication from
'/tmp/Endpoint_SlaveEndpointTest_NoAuthorizer_0_mH7Y6o/credential'
I0805 02:21:08.132200  6454 slave.cpp:283] Agent using credential for: test-principal
I0805 02:21:08.132243  6454 credentials.hpp:37] Loading credentials for authentication from
'/tmp/Endpoint_SlaveEndpointTest_NoAuthorizer_0_mH7Y6o/http_credentials'
I0805 02:21:08.132648  6454 http.cpp:1026] Creating default 'basic' HTTP authenticator for
realm 'mesos-agent-readonly'
I0805 02:21:08.132910  6454 http.cpp:1026] Creating default 'basic' HTTP authenticator for
realm 'mesos-agent-readwrite'
I0805 02:21:08.135259  6454 slave.cpp:565] Agent resources: [{"name":"cpus","scalar":{"value":2.0},"type":"SCALAR"},{"name":"mem","scalar":{"value":1024.0},"type":"SCALAR"},{"name":"disk","scalar":{"value":1024.0},"type":"SCALAR"},{"name":"ports","ranges":{"range":[{"begin":31000,"end":32000}]},"type":"RANGES"}]
I0805 02:21:08.135684  6454 slave.cpp:573] Agent attributes: [  ]
I0805 02:21:08.135709  6454 slave.cpp:582] Agent hostname: 1eb86fc73547
I0805 02:21:08.135913  6456 status_update_manager.cpp:177] Pausing sending status updates
I0805 02:21:08.138149  6463 state.cpp:64] Recovering state from '/tmp/Endpoint_SlaveEndpointTest_NoAuthorizer_0_HcBOJQ/meta'
I0805 02:21:08.138541  6464 status_update_manager.cpp:203] Recovering status update manager
I0805 02:21:08.138770  6459 containerizer.cpp:598] Recovering containerizer
I0805 02:21:08.140749  6453 provisioner.cpp:416] Provisioner recovery complete
I0805 02:21:08.141224  6447 slave.cpp:6207] Finished recovery
I0805 02:21:08.141782  6447 slave.cpp:6389] Querying resource estimator for oversubscribable
resources
I0805 02:21:08.142072  6464 slave.cpp:6403] Received oversubscribable resources {} from the
resource estimator
I0805 02:21:08.144716  6452 process.cpp:3933] Handling HTTP event for process 'slave(799)'
with path: '/slave(799)/monitor/statistics'
I0805 02:21:08.146131  6454 http.cpp:1166] HTTP GET for /slave(799)/monitor/statistics from
172.17.0.3:42712
I0805 02:21:08.146239  6454 http.cpp:957] Authorizing principal 'test-principal' to GET the
'/monitor/statistics' endpoint
I0805 02:21:08.150863  6427 slave.cpp:843] Agent terminating
[       OK ] Endpoint/SlaveEndpointTest.NoAuthorizer/0 (37 ms)
[ RUN      ] Endpoint/SlaveEndpointTest.NoAuthorizer/1
I0805 02:21:08.164156  6427 containerizer.cpp:246] Using isolation: posix/cpu,posix/mem,filesystem/posix,network/cni,environment_secret
W0805 02:21:08.164804  6427 backend.cpp:76] Failed to create 'aufs' backend: AufsBackend requires
root privileges
W0805 02:21:08.164927  6427 backend.cpp:76] Failed to create 'bind' backend: BindBackend requires
root privileges
I0805 02:21:08.164964  6427 provisioner.cpp:255] Using default backend 'copy'
I0805 02:21:08.167150  6427 cluster.cpp:448] Creating default 'local' authorizer
I0805 02:21:08.169152  6451 slave.cpp:250] Mesos agent started on (800)@172.17.0.3:41208
I0805 02:21:08.169181  6451 slave.cpp:251] Flags at startup: --acls="" --appc_simple_discovery_uri_prefix="http://"
--appc_store_dir="/tmp/Endpoint_SlaveEndpointTest_NoAuthorizer_1_qHTWUC/store/appc" --authenticate_http_readonly="true"
--authenticate_http_readwrite="true" --authenticatee="crammd5" --authentication_backoff_factor="1secs"
--authorizer="local" --cgroups_cpu_enable_pids_and_tids_count="false" --cgroups_enable_cfs="false"
--cgroups_hierarchy="/sys/fs/cgroup" --cgroups_limit_swap="false" --cgroups_root="mesos" --container_disk_watch_interval="15secs"
--containerizers="mesos" --credential="/tmp/Endpoint_SlaveEndpointTest_NoAuthorizer_1_qHTWUC/credential"
--default_role="*" --disk_watch_interval="1mins" --docker="docker" --docker_kill_orphans="true"
--docker_registry="https://registry-1.docker.io" --docker_remove_delay="6hrs" --docker_socket="/var/run/docker.sock"
--docker_stop_timeout="0ns" --docker_store_dir="/tmp/Endpoint_SlaveEndpointTest_NoAuthorizer_1_qHTWUC/store/docker"
--docker_volume_checkpoint_dir="/var/run/mesos/isolators/docker/volume" --enforce_container_disk_quota="false"
--executor_registration_timeout="1mins" --executor_reregistration_timeout="2secs" --executor_shutdown_grace_period="5secs"
--fetcher_cache_dir="/tmp/Endpoint_SlaveEndpointTest_NoAuthorizer_1_qHTWUC/fetch" --fetcher_cache_size="2GB"
--frameworks_home="" --gc_delay="1weeks" --gc_disk_headroom="0.1" --hadoop_home="" --help="false"
--hostname_lookup="true" --http_command_executor="false" --http_credentials="/tmp/Endpoint_SlaveEndpointTest_NoAuthorizer_1_qHTWUC/http_credentials"
--http_heartbeat_interval="30secs" --initialize_driver_logging="true" --isolation="posix/cpu,posix/mem"
--launcher="posix" --launcher_dir="/mesos/mesos-1.4.0/_build/src" --logbufsecs="0" --logging_level="INFO"
--max_completed_executors_per_framework="150" --oversubscribed_resources_interval="15secs"
--perf_duration="10secs" --perf_interval="1mins" --port="5051" --qos_correction_interval_min="0ns"
--quiet="false" --recover="reconnect" --recovery_timeout="15mins" --registration_backoff_factor="10ms"
--resources="cpus:2;gpus:0;mem:1024;disk:1024;ports:[31000-32000]" --revocable_cpu_low_priority="true"
--runtime_dir="/tmp/Endpoint_SlaveEndpointTest_NoAuthorizer_1_qHTWUC" --sandbox_directory="/mnt/mesos/sandbox"
--strict="true" --switch_user="true" --systemd_enable_support="true" --systemd_runtime_directory="/run/systemd/system"
--version="false" --work_dir="/tmp/Endpoint_SlaveEndpointTest_NoAuthorizer_1_dkaas4"
I0805 02:21:08.169770  6451 credentials.hpp:86] Loading credential for authentication from
'/tmp/Endpoint_SlaveEndpointTest_NoAuthorizer_1_qHTWUC/credential'
I0805 02:21:08.169922  6451 slave.cpp:283] Agent using credential for: test-principal
I0805 02:21:08.169945  6451 credentials.hpp:37] Loading credentials for authentication from
'/tmp/Endpoint_SlaveEndpointTest_NoAuthorizer_1_qHTWUC/http_credentials'
I0805 02:21:08.170182  6451 http.cpp:1026] Creating default 'basic' HTTP authenticator for
realm 'mesos-agent-readonly'
I0805 02:21:08.170326  6451 http.cpp:1026] Creating default 'basic' HTTP authenticator for
realm 'mesos-agent-readwrite'
I0805 02:21:08.171597  6451 slave.cpp:565] Agent resources: [{"name":"cpus","scalar":{"value":2.0},"type":"SCALAR"},{"name":"mem","scalar":{"value":1024.0},"type":"SCALAR"},{"name":"disk","scalar":{"value":1024.0},"type":"SCALAR"},{"name":"ports","ranges":{"range":[{"begin":31000,"end":32000}]},"type":"RANGES"}]
I0805 02:21:08.171824  6451 slave.cpp:573] Agent attributes: [  ]
I0805 02:21:08.171840  6451 slave.cpp:582] Agent hostname: 1eb86fc73547
I0805 02:21:08.171977  6453 status_update_manager.cpp:177] Pausing sending status updates
I0805 02:21:08.173251  6464 state.cpp:64] Recovering state from '/tmp/Endpoint_SlaveEndpointTest_NoAuthorizer_1_dkaas4/meta'
I0805 02:21:08.173629  6458 status_update_manager.cpp:203] Recovering status update manager
I0805 02:21:08.173912  6452 containerizer.cpp:598] Recovering containerizer
I0805 02:21:08.175426  6467 provisioner.cpp:416] Provisioner recovery complete
I0805 02:21:08.175860  6455 slave.cpp:6207] Finished recovery
I0805 02:21:08.176460  6455 slave.cpp:6389] Querying resource estimator for oversubscribable
resources
I0805 02:21:08.176746  6468 slave.cpp:6403] Received oversubscribable resources {} from the
resource estimator
I0805 02:21:08.179160  6469 process.cpp:3933] Handling HTTP event for process 'slave(800)'
with path: '/slave(800)/monitor/statistics.json'
I0805 02:21:08.180589  6466 http.cpp:1166] HTTP GET for /slave(800)/monitor/statistics.json
from 172.17.0.3:42716
I0805 02:21:08.180685  6466 http.cpp:957] Authorizing principal 'test-principal' to GET the
'/monitor/statistics.json' endpoint
I0805 02:21:08.184113  6464 slave.cpp:843] Agent terminating
[       OK ] Endpoint/SlaveEndpointTest.NoAuthorizer/1 (33 ms)
[ RUN      ] Endpoint/SlaveEndpointTest.NoAuthorizer/2
I0805 02:21:08.197502  6427 containerizer.cpp:246] Using isolation: posix/cpu,posix/mem,filesystem/posix,network/cni,environment_secret
W0805 02:21:08.198050  6427 backend.cpp:76] Failed to create 'aufs' backend: AufsBackend requires
root privileges
W0805 02:21:08.198161  6427 backend.cpp:76] Failed to create 'bind' backend: BindBackend requires
root privileges
I0805 02:21:08.198194  6427 provisioner.cpp:255] Using default backend 'copy'
I0805 02:21:08.200103  6427 cluster.cpp:448] Creating default 'local' authorizer
I0805 02:21:08.202167  6467 slave.cpp:250] Mesos agent started on (801)@172.17.0.3:41208
I0805 02:21:08.202193  6467 slave.cpp:251] Flags at startup: --acls="" --appc_simple_discovery_uri_prefix="http://"
--appc_store_dir="/tmp/Endpoint_SlaveEndpointTest_NoAuthorizer_2_SwxZ2Q/store/appc" --authenticate_http_readonly="true"
--authenticate_http_readwrite="true" --authenticatee="crammd5" --authentication_backoff_factor="1secs"
--authorizer="local" --cgroups_cpu_enable_pids_and_tids_count="false" --cgroups_enable_cfs="false"
--cgroups_hierarchy="/sys/fs/cgroup" --cgroups_limit_swap="false" --cgroups_root="mesos" --container_disk_watch_interval="15secs"
--containerizers="mesos" --credential="/tmp/Endpoint_SlaveEndpointTest_NoAuthorizer_2_SwxZ2Q/credential"
--default_role="*" --disk_watch_interval="1mins" --docker="docker" --docker_kill_orphans="true"
--docker_registry="https://registry-1.docker.io" --docker_remove_delay="6hrs" --docker_socket="/var/run/docker.sock"
--docker_stop_timeout="0ns" --docker_store_dir="/tmp/Endpoint_SlaveEndpointTest_NoAuthorizer_2_SwxZ2Q/store/docker"
--docker_volume_checkpoint_dir="/var/run/mesos/isolators/docker/volume" --enforce_container_disk_quota="false"
--executor_registration_timeout="1mins" --executor_reregistration_timeout="2secs" --executor_shutdown_grace_period="5secs"
--fetcher_cache_dir="/tmp/Endpoint_SlaveEndpointTest_NoAuthorizer_2_SwxZ2Q/fetch" --fetcher_cache_size="2GB"
--frameworks_home="" --gc_delay="1weeks" --gc_disk_headroom="0.1" --hadoop_home="" --help="false"
--hostname_lookup="true" --http_command_executor="false" --http_credentials="/tmp/Endpoint_SlaveEndpointTest_NoAuthorizer_2_SwxZ2Q/http_credentials"
--http_heartbeat_interval="30secs" --initialize_driver_logging="true" --isolation="posix/cpu,posix/mem"
--launcher="posix" --launcher_dir="/mesos/mesos-1.4.0/_build/src" --logbufsecs="0" --logging_level="INFO"
--max_completed_executors_per_framework="150" --oversubscribed_resources_interval="15secs"
--perf_duration="10secs" --perf_interval="1mins" --port="5051" --qos_correction_interval_min="0ns"
--quiet="false" --recover="reconnect" --recovery_timeout="15mins" --registration_backoff_factor="10ms"
--resources="cpus:2;gpus:0;mem:1024;disk:1024;ports:[31000-32000]" --revocable_cpu_low_priority="true"
--runtime_dir="/tmp/Endpoint_SlaveEndpointTest_NoAuthorizer_2_SwxZ2Q" --sandbox_directory="/mnt/mesos/sandbox"
--strict="true" --switch_user="true" --systemd_enable_support="true" --systemd_runtime_directory="/run/systemd/system"
--version="false" --work_dir="/tmp/Endpoint_SlaveEndpointTest_NoAuthorizer_2_NWeevi"
I0805 02:21:08.202630  6467 credentials.hpp:86] Loading credential for authentication from
'/tmp/Endpoint_SlaveEndpointTest_NoAuthorizer_2_SwxZ2Q/credential'
I0805 02:21:08.202783  6467 slave.cpp:283] Agent using credential for: test-principal
I0805 02:21:08.202805  6467 credentials.hpp:37] Loading credentials for authentication from
'/tmp/Endpoint_SlaveEndpointTest_NoAuthorizer_2_SwxZ2Q/http_credentials'
I0805 02:21:08.203032  6467 http.cpp:1026] Creating default 'basic' HTTP authenticator for
realm 'mesos-agent-readonly'
I0805 02:21:08.203168  6467 http.cpp:1026] Creating default 'basic' HTTP authenticator for
realm 'mesos-agent-readwrite'
I0805 02:21:08.204432  6467 slave.cpp:565] Agent resources: [{"name":"cpus","scalar":{"value":2.0},"type":"SCALAR"},{"name":"mem","scalar":{"value":1024.0},"type":"SCALAR"},{"name":"disk","scalar":{"value":1024.0},"type":"SCALAR"},{"name":"ports","ranges":{"range":[{"begin":31000,"end":32000}]},"type":"RANGES"}]
I0805 02:21:08.204672  6467 slave.cpp:573] Agent attributes: [  ]
I0805 02:21:08.204684  6467 slave.cpp:582] Agent hostname: 1eb86fc73547
I0805 02:21:08.204874  6465 status_update_manager.cpp:177] Pausing sending status updates
I0805 02:21:08.206260  6457 state.cpp:64] Recovering state from '/tmp/Endpoint_SlaveEndpointTest_NoAuthorizer_2_NWeevi/meta'
I0805 02:21:08.206532  6463 status_update_manager.cpp:203] Recovering status update manager
I0805 02:21:08.206712  6463 containerizer.cpp:598] Recovering containerizer
I0805 02:21:08.208497  6464 provisioner.cpp:416] Provisioner recovery complete
I0805 02:21:08.208892  6454 slave.cpp:6207] Finished recovery
I0805 02:21:08.209420  6454 slave.cpp:6389] Querying resource estimator for oversubscribable
resources
I0805 02:21:08.209740  6456 slave.cpp:6403] Received oversubscribable resources {} from the
resource estimator
I0805 02:21:08.212226  6460 process.cpp:3933] Handling HTTP event for process 'slave(801)'
with path: '/slave(801)/containers'
I0805 02:21:08.213937  6468 http.cpp:1166] HTTP GET for /slave(801)/containers from 172.17.0.3:42718
I0805 02:21:08.214033  6468 http.cpp:957] Authorizing principal 'test-principal' to GET the
'/containers' endpoint
I0805 02:21:08.218119  6427 slave.cpp:843] Agent terminating
[       OK ] Endpoint/SlaveEndpointTest.NoAuthorizer/2 (32 ms)
[----------] 9 tests from Endpoint/SlaveEndpointTest (325 ms total)

[----------] 2 tests from ContainerizerType/DefaultContainerDNSFlagTest
[ RUN      ] ContainerizerType/DefaultContainerDNSFlagTest.ValidateFlag/0
[       OK ] ContainerizerType/DefaultContainerDNSFlagTest.ValidateFlag/0 (10 ms)
[ RUN      ] ContainerizerType/DefaultContainerDNSFlagTest.ValidateFlag/1
[       OK ] ContainerizerType/DefaultContainerDNSFlagTest.ValidateFlag/1 (10 ms)
[----------] 2 tests from ContainerizerType/DefaultContainerDNSFlagTest (20 ms total)

[----------] Global test environment tear-down
[==========] 1651 tests from 182 test cases ran. (545704 ms total)
[  PASSED  ] 1649 tests.
[  FAILED  ] 2 tests, listed below:
[  FAILED  ] CommandExecutorCheckTest.CommandCheckDeliveredAndReconciled
[  FAILED  ] ExamplesTest.NoExecutorFramework

 2 FAILED TESTS
  YOU HAVE 20 DISABLED TESTS

I0805 02:21:08.307497  6470 process.cpp:1072] Failed to accept socket: future discarded
make[4]: *** [check-local] Error 1
make[4]: Leaving directory `/mesos/mesos-1.4.0/_build/src'
make[3]: *** [check-am] Error 2
make[3]: Leaving directory `/mesos/mesos-1.4.0/_build/src'
make[2]: *** [check] Error 2
make[2]: Leaving directory `/mesos/mesos-1.4.0/_build/src'
make[1]: *** [check-recursive] Error 1
make[1]: Leaving directory `/mesos/mesos-1.4.0/_build'
make: *** [distcheck] Error 1
+ docker rmi mesos-1501897179-9837
Untagged: mesos-1501897179-9837:latest
Deleted: sha256:3661938472b598c84aa01fc8fc934df66ebd8a2281077f5bbf4e1df492c7f5e2
Deleted: sha256:b36865e701c880b68b83a2d7535c262dd9106218cda7adf8c4fe85bcc830855f
Deleted: sha256:78806a762ddbe54a72c40b356f72318dedf0c05b0529c1e8d0f9d21bae0f739a
Deleted: sha256:67d82e3d19ddc8f1df66831a67ee17da926264a3f96590ccab07272b1a0e94e6
Deleted: sha256:217cd5b5e440ea07fc7892b3e951c5bf0aefd60c459c93d67bc9d2c6863819ef
Deleted: sha256:733cef70e048747a16944dcc225fa9cf1d47deeb406d11d076cfc5c1846612e8
Deleted: sha256:25f4a817519ab54daf2d2ab7babd9f746ae97e35578d44f6a38138eebfe1a2c0
Deleted: sha256:0eafe672ed2f1177cbbfe03dae6905299f7493523d227165ed66f4fae472cfa1
Deleted: sha256:d1b4330eef290afcab60623f7152ceeb31045c6b6a1d47747fcbc4f34d353c5c
Deleted: sha256:0b6d7e33e77fc399fccb0852ce475bf93a2640b451dbf80fac33c2a686cf1407
Deleted: sha256:d242dafa4aa5795512e759284d002dba60f38e13a1752ae79abf7b70cbf9181a
Deleted: sha256:5e86cc238c3d2ce0677085df684ccd9a26396f6e9f42d9d213d828af0aad1a25
Deleted: sha256:214a2fb5ec27ddac18559811e4616197bd16e0d420090f8629216e22fdafe253
Deleted: sha256:b5b94c654faaffb328015d6a648d95c2536033430a9b4f1c88b41a290a6b7e70
Deleted: sha256:db6c127cb5b826d5f6c31076f554d331ae34110d3d2424e180920dad4b3dad61
Deleted: sha256:61267593a5de3d940fa7a9a3ac6c1d56c09f0c34be7a3b2309f663afb93428c9
Deleted: sha256:10c9cdb6f0e0291c4c5393e958aa1adad641f5d6a5931b52b7e8e1d7030cdd83
Deleted: sha256:48baae6357c3d8f911068ee1305c9ff3fcf1a01ac1daf212e380ff43ffafb536
Deleted: sha256:5367eefe9be1cf67fa21c2ae970a495b6e11425c3a212961050165cedae57d5f
Deleted: sha256:33cce517166b1030443a0d5dde1e292bb4473ebfa21129651dd1a655dcbf5557
Deleted: sha256:a52afa1c0a81f0572732480cfb258c7ae7b1066a33c92194481445bd56b5b794
Deleted: sha256:65f48ce4839aa89bb9079648146a601d7c95dd1fb5a7b8b39fa7acc3556acef3
Deleted: sha256:6160ff202ccf25203f924a82cc312cac504423d14faa2ebc1a1ad93ceeca4f5b
Deleted: sha256:42266e5dc739c6eea3903a649ad4cea2cb21ee326fe3bf4fe64627117c101477
Deleted: sha256:0f3cfaa8befd439a6f8454faacc36c3c55e2dabce92afb99b9b8019fa9c2f98f
Build step 'Execute shell' marked build as failure

Mime
View raw message