mesos-builds mailing list archives

Site index · List index
Message view « Date » · « Thread »
Top « Date » · « Thread »
From Apache Jenkins Server <jenk...@builds.apache.org>
Subject Build failed in Jenkins: Mesos-Buildbot » autotools,clang,--verbose,GLOG_v=1 MESOS_VERBOSE=1,ubuntu:14.04,(ubuntu)&&(!ubuntu-us1)&&(!ubuntu-eu2) #4066
Date Fri, 04 Aug 2017 12:14:27 GMT
See <https://builds.apache.org/job/Mesos-Buildbot/BUILDTOOL=autotools,COMPILER=clang,CONFIGURATION=--verbose,ENVIRONMENT=GLOG_v=1%20MESOS_VERBOSE=1,OS=ubuntu%3A14.04,label_exp=(ubuntu)&&(!ubuntu-us1)&&(!ubuntu-eu2)/4066/display/redirect?page=changes>

Changes:

[alexr] Logged when an offer is removed.

[alexr] Fixed slaves_unreachable metric.

[alexr] Added missing metrics to tests.

[alexr] Adjusted the style in metrics tests for consistency.

------------------------------------------
[...truncated 30.60 MB...]
I0804 12:14:17.219471  3740 slave.cpp:250] Mesos agent started on (797)@172.17.0.3:41889
I0804 12:14:17.219506  3740 slave.cpp:251] Flags at startup: --acls="" --appc_simple_discovery_uri_prefix="http://"
--appc_store_dir="/tmp/Endpoint_SlaveEndpointTest_AuthorizedRequest_2_2fevdN/store/appc" --authenticate_http_readonly="true"
--authenticate_http_readwrite="true" --authenticatee="crammd5" --authentication_backoff_factor="1secs"
--authorizer="local" --cgroups_cpu_enable_pids_and_tids_count="false" --cgroups_enable_cfs="false"
--cgroups_hierarchy="/sys/fs/cgroup" --cgroups_limit_swap="false" --cgroups_root="mesos" --container_disk_watch_interval="15secs"
--containerizers="mesos" --credential="/tmp/Endpoint_SlaveEndpointTest_AuthorizedRequest_2_2fevdN/credential"
--default_role="*" --disk_watch_interval="1mins" --docker="docker" --docker_kill_orphans="true"
--docker_registry="https://registry-1.docker.io" --docker_remove_delay="6hrs" --docker_socket="/var/run/docker.sock"
--docker_stop_timeout="0ns" --docker_store_dir="/tmp/Endpoint_SlaveEndpointTest_AuthorizedRequest_2_2fevdN/store/docker"
--docker_volume_checkpoint_dir="/var/run/mesos/isolators/docker/volume" --enforce_container_disk_quota="false"
--executor_registration_timeout="1mins" --executor_reregistration_timeout="2secs" --executor_shutdown_grace_period="5secs"
--fetcher_cache_dir="/tmp/Endpoint_SlaveEndpointTest_AuthorizedRequest_2_2fevdN/fetch" --fetcher_cache_size="2GB"
--frameworks_home="" --gc_delay="1weeks" --gc_disk_headroom="0.1" --hadoop_home="" --help="false"
--hostname_lookup="true" --http_command_executor="false" --http_credentials="/tmp/Endpoint_SlaveEndpointTest_AuthorizedRequest_2_2fevdN/http_credentials"
--http_heartbeat_interval="30secs" --initialize_driver_logging="true" --isolation="posix/cpu,posix/mem"
--launcher="posix" --launcher_dir="/mesos/mesos-1.4.0/_build/src" --logbufsecs="0" --logging_level="INFO"
--max_completed_executors_per_framework="150" --oversubscribed_resources_interval="15secs"
--perf_duration="10secs" --perf_interval="1mins" --port="5051" --qos_correction_interval_min="0ns"
--quiet="false" --recover="reconnect" --recovery_timeout="15mins" --registration_backoff_factor="10ms"
--resources="cpus:2;gpus:0;mem:1024;disk:1024;ports:[31000-32000]" --revocable_cpu_low_priority="true"
--runtime_dir="/tmp/Endpoint_SlaveEndpointTest_AuthorizedRequest_2_2fevdN" --sandbox_directory="/mnt/mesos/sandbox"
--strict="true" --switch_user="true" --systemd_enable_support="true" --systemd_runtime_directory="/run/systemd/system"
--version="false" --work_dir="/tmp/Endpoint_SlaveEndpointTest_AuthorizedRequest_2_2yKalu"
I0804 12:14:17.219892  3740 credentials.hpp:86] Loading credential for authentication from
'/tmp/Endpoint_SlaveEndpointTest_AuthorizedRequest_2_2fevdN/credential'
I0804 12:14:17.220105  3740 slave.cpp:283] Agent using credential for: test-principal
I0804 12:14:17.220154  3740 credentials.hpp:37] Loading credentials for authentication from
'/tmp/Endpoint_SlaveEndpointTest_AuthorizedRequest_2_2fevdN/http_credentials'
I0804 12:14:17.220438  3740 http.cpp:1026] Creating default 'basic' HTTP authenticator for
realm 'mesos-agent-readonly'
I0804 12:14:17.220685  3740 http.cpp:1026] Creating default 'basic' HTTP authenticator for
realm 'mesos-agent-readwrite'
I0804 12:14:17.221948  3740 slave.cpp:565] Agent resources: [{"name":"cpus","scalar":{"value":2.0},"type":"SCALAR"},{"name":"mem","scalar":{"value":1024.0},"type":"SCALAR"},{"name":"disk","scalar":{"value":1024.0},"type":"SCALAR"},{"name":"ports","ranges":{"range":[{"begin":31000,"end":32000}]},"type":"RANGES"}]
I0804 12:14:17.222172  3740 slave.cpp:573] Agent attributes: [  ]
I0804 12:14:17.222184  3740 slave.cpp:582] Agent hostname: 4eb20b6abf80
I0804 12:14:17.222308  3737 status_update_manager.cpp:177] Pausing sending status updates
I0804 12:14:17.223625  3746 state.cpp:64] Recovering state from '/tmp/Endpoint_SlaveEndpointTest_AuthorizedRequest_2_2yKalu/meta'
I0804 12:14:17.224061  3738 status_update_manager.cpp:203] Recovering status update manager
I0804 12:14:17.224256  3731 containerizer.cpp:598] Recovering containerizer
I0804 12:14:17.226145  3750 provisioner.cpp:416] Provisioner recovery complete
I0804 12:14:17.226502  3734 slave.cpp:6207] Finished recovery
I0804 12:14:17.226928  3734 slave.cpp:6389] Querying resource estimator for oversubscribable
resources
I0804 12:14:17.227129  3739 slave.cpp:6403] Received oversubscribable resources {} from the
resource estimator
I0804 12:14:17.229323  3749 process.cpp:3933] Handling HTTP event for process 'slave(797)'
with path: '/slave(797)/containers'
I0804 12:14:17.230650  3743 http.cpp:1166] HTTP GET for /slave(797)/containers from 172.17.0.3:47832
I0804 12:14:17.230716  3743 http.cpp:957] Authorizing principal 'test-principal' to GET the
'/containers' endpoint
I0804 12:14:17.233929  3752 slave.cpp:843] Agent terminating
[       OK ] Endpoint/SlaveEndpointTest.AuthorizedRequest/2 (30 ms)
[ RUN      ] Endpoint/SlaveEndpointTest.UnauthorizedRequest/0
I0804 12:14:17.246021  3712 containerizer.cpp:246] Using isolation: posix/cpu,posix/mem,filesystem/posix,network/cni,environment_secret
W0804 12:14:17.246546  3712 backend.cpp:76] Failed to create 'aufs' backend: AufsBackend requires
root privileges
W0804 12:14:17.246671  3712 backend.cpp:76] Failed to create 'bind' backend: BindBackend requires
root privileges
I0804 12:14:17.246702  3712 provisioner.cpp:255] Using default backend 'copy'
I0804 12:14:17.250046  3747 slave.cpp:250] Mesos agent started on (798)@172.17.0.3:41889
I0804 12:14:17.250109  3747 slave.cpp:251] Flags at startup: --acls="" --appc_simple_discovery_uri_prefix="http://"
--appc_store_dir="/tmp/Endpoint_SlaveEndpointTest_UnauthorizedRequest_0_8F6nY0/store/appc"
--authenticate_http_readonly="true" --authenticate_http_readwrite="true" --authenticatee="crammd5"
--authentication_backoff_factor="1secs" --authorizer="local" --cgroups_cpu_enable_pids_and_tids_count="false"
--cgroups_enable_cfs="false" --cgroups_hierarchy="/sys/fs/cgroup" --cgroups_limit_swap="false"
--cgroups_root="mesos" --container_disk_watch_interval="15secs" --containerizers="mesos" --credential="/tmp/Endpoint_SlaveEndpointTest_UnauthorizedRequest_0_8F6nY0/credential"
--default_role="*" --disk_watch_interval="1mins" --docker="docker" --docker_kill_orphans="true"
--docker_registry="https://registry-1.docker.io" --docker_remove_delay="6hrs" --docker_socket="/var/run/docker.sock"
--docker_stop_timeout="0ns" --docker_store_dir="/tmp/Endpoint_SlaveEndpointTest_UnauthorizedRequest_0_8F6nY0/store/docker"
--docker_volume_checkpoint_dir="/var/run/mesos/isolators/docker/volume" --enforce_container_disk_quota="false"
--executor_registration_timeout="1mins" --executor_reregistration_timeout="2secs" --executor_shutdown_grace_period="5secs"
--fetcher_cache_dir="/tmp/Endpoint_SlaveEndpointTest_UnauthorizedRequest_0_8F6nY0/fetch" --fetcher_cache_size="2GB"
--frameworks_home="" --gc_delay="1weeks" --gc_disk_headroom="0.1" --hadoop_home="" --help="false"
--hostname_lookup="true" --http_command_executor="false" --http_credentials="/tmp/Endpoint_SlaveEndpointTest_UnauthorizedRequest_0_8F6nY0/http_credentials"
--http_heartbeat_interval="30secs" --initialize_driver_logging="true" --isolation="posix/cpu,posix/mem"
--launcher="posix" --launcher_dir="/mesos/mesos-1.4.0/_build/src" --logbufsecs="0" --logging_level="INFO"
--max_completed_executors_per_framework="150" --oversubscribed_resources_interval="15secs"
--perf_duration="10secs" --perf_interval="1mins" --port="5051" --qos_correction_interval_min="0ns"
--quiet="false" --recover="reconnect" --recovery_timeout="15mins" --registration_backoff_factor="10ms"
--resources="cpus:2;gpus:0;mem:1024;disk:1024;ports:[31000-32000]" --revocable_cpu_low_priority="true"
--runtime_dir="/tmp/Endpoint_SlaveEndpointTest_UnauthorizedRequest_0_8F6nY0" --sandbox_directory="/mnt/mesos/sandbox"
--strict="true" --switch_user="true" --systemd_enable_support="true" --systemd_runtime_directory="/run/systemd/system"
--version="false" --work_dir="/tmp/Endpoint_SlaveEndpointTest_UnauthorizedRequest_0_KzBt1H"
I0804 12:14:17.250731  3747 credentials.hpp:86] Loading credential for authentication from
'/tmp/Endpoint_SlaveEndpointTest_UnauthorizedRequest_0_8F6nY0/credential'
I0804 12:14:17.250895  3747 slave.cpp:283] Agent using credential for: test-principal
I0804 12:14:17.250918  3747 credentials.hpp:37] Loading credentials for authentication from
'/tmp/Endpoint_SlaveEndpointTest_UnauthorizedRequest_0_8F6nY0/http_credentials'
I0804 12:14:17.251147  3747 http.cpp:1026] Creating default 'basic' HTTP authenticator for
realm 'mesos-agent-readonly'
I0804 12:14:17.251302  3747 http.cpp:1026] Creating default 'basic' HTTP authenticator for
realm 'mesos-agent-readwrite'
I0804 12:14:17.252697  3747 slave.cpp:565] Agent resources: [{"name":"cpus","scalar":{"value":2.0},"type":"SCALAR"},{"name":"mem","scalar":{"value":1024.0},"type":"SCALAR"},{"name":"disk","scalar":{"value":1024.0},"type":"SCALAR"},{"name":"ports","ranges":{"range":[{"begin":31000,"end":32000}]},"type":"RANGES"}]
I0804 12:14:17.252921  3747 slave.cpp:573] Agent attributes: [  ]
I0804 12:14:17.252934  3747 slave.cpp:582] Agent hostname: 4eb20b6abf80
I0804 12:14:17.253067  3733 status_update_manager.cpp:177] Pausing sending status updates
I0804 12:14:17.254429  3750 state.cpp:64] Recovering state from '/tmp/Endpoint_SlaveEndpointTest_UnauthorizedRequest_0_KzBt1H/meta'
I0804 12:14:17.254729  3750 status_update_manager.cpp:203] Recovering status update manager
I0804 12:14:17.254928  3734 containerizer.cpp:598] Recovering containerizer
I0804 12:14:17.256403  3752 provisioner.cpp:416] Provisioner recovery complete
I0804 12:14:17.256697  3753 slave.cpp:6207] Finished recovery
I0804 12:14:17.257107  3753 slave.cpp:6389] Querying resource estimator for oversubscribable
resources
I0804 12:14:17.257320  3744 slave.cpp:6403] Received oversubscribable resources {} from the
resource estimator
I0804 12:14:17.260097  3743 process.cpp:3933] Handling HTTP event for process 'slave(798)'
with path: '/slave(798)/monitor/statistics'
I0804 12:14:17.261736  3748 http.cpp:1166] HTTP GET for /slave(798)/monitor/statistics from
172.17.0.3:47834
I0804 12:14:17.261814  3748 http.cpp:957] Authorizing principal 'test-principal' to GET the
'/monitor/statistics' endpoint
I0804 12:14:17.264792  3712 slave.cpp:843] Agent terminating
[       OK ] Endpoint/SlaveEndpointTest.UnauthorizedRequest/0 (32 ms)
[ RUN      ] Endpoint/SlaveEndpointTest.UnauthorizedRequest/1
I0804 12:14:17.280002  3712 containerizer.cpp:246] Using isolation: posix/cpu,posix/mem,filesystem/posix,network/cni,environment_secret
W0804 12:14:17.280546  3712 backend.cpp:76] Failed to create 'aufs' backend: AufsBackend requires
root privileges
W0804 12:14:17.280697  3712 backend.cpp:76] Failed to create 'bind' backend: BindBackend requires
root privileges
I0804 12:14:17.280733  3712 provisioner.cpp:255] Using default backend 'copy'
I0804 12:14:17.284947  3738 slave.cpp:250] Mesos agent started on (799)@172.17.0.3:41889
I0804 12:14:17.285014  3738 slave.cpp:251] Flags at startup: --acls="" --appc_simple_discovery_uri_prefix="http://"
--appc_store_dir="/tmp/Endpoint_SlaveEndpointTest_UnauthorizedRequest_1_8b0G2e/store/appc"
--authenticate_http_readonly="true" --authenticate_http_readwrite="true" --authenticatee="crammd5"
--authentication_backoff_factor="1secs" --authorizer="local" --cgroups_cpu_enable_pids_and_tids_count="false"
--cgroups_enable_cfs="false" --cgroups_hierarchy="/sys/fs/cgroup" --cgroups_limit_swap="false"
--cgroups_root="mesos" --container_disk_watch_interval="15secs" --containerizers="mesos" --credential="/tmp/Endpoint_SlaveEndpointTest_UnauthorizedRequest_1_8b0G2e/credential"
--default_role="*" --disk_watch_interval="1mins" --docker="docker" --docker_kill_orphans="true"
--docker_registry="https://registry-1.docker.io" --docker_remove_delay="6hrs" --docker_socket="/var/run/docker.sock"
--docker_stop_timeout="0ns" --docker_store_dir="/tmp/Endpoint_SlaveEndpointTest_UnauthorizedRequest_1_8b0G2e/store/docker"
--docker_volume_checkpoint_dir="/var/run/mesos/isolators/docker/volume" --enforce_container_disk_quota="false"
--executor_registration_timeout="1mins" --executor_reregistration_timeout="2secs" --executor_shutdown_grace_period="5secs"
--fetcher_cache_dir="/tmp/Endpoint_SlaveEndpointTest_UnauthorizedRequest_1_8b0G2e/fetch" --fetcher_cache_size="2GB"
--frameworks_home="" --gc_delay="1weeks" --gc_disk_headroom="0.1" --hadoop_home="" --help="false"
--hostname_lookup="true" --http_command_executor="false" --http_credentials="/tmp/Endpoint_SlaveEndpointTest_UnauthorizedRequest_1_8b0G2e/http_credentials"
--http_heartbeat_interval="30secs" --initialize_driver_logging="true" --isolation="posix/cpu,posix/mem"
--launcher="posix" --launcher_dir="/mesos/mesos-1.4.0/_build/src" --logbufsecs="0" --logging_level="INFO"
--max_completed_executors_per_framework="150" --oversubscribed_resources_interval="15secs"
--perf_duration="10secs" --perf_interval="1mins" --port="5051" --qos_correction_interval_min="0ns"
--quiet="false" --recover="reconnect" --recovery_timeout="15mins" --registration_backoff_factor="10ms"
--resources="cpus:2;gpus:0;mem:1024;disk:1024;ports:[31000-32000]" --revocable_cpu_low_priority="true"
--runtime_dir="/tmp/Endpoint_SlaveEndpointTest_UnauthorizedRequest_1_8b0G2e" --sandbox_directory="/mnt/mesos/sandbox"
--strict="true" --switch_user="true" --systemd_enable_support="true" --systemd_runtime_directory="/run/systemd/system"
--version="false" --work_dir="/tmp/Endpoint_SlaveEndpointTest_UnauthorizedRequest_1_gG3M0V"
I0804 12:14:17.285681  3738 credentials.hpp:86] Loading credential for authentication from
'/tmp/Endpoint_SlaveEndpointTest_UnauthorizedRequest_1_8b0G2e/credential'
I0804 12:14:17.285919  3738 slave.cpp:283] Agent using credential for: test-principal
I0804 12:14:17.285948  3738 credentials.hpp:37] Loading credentials for authentication from
'/tmp/Endpoint_SlaveEndpointTest_UnauthorizedRequest_1_8b0G2e/http_credentials'
I0804 12:14:17.286275  3738 http.cpp:1026] Creating default 'basic' HTTP authenticator for
realm 'mesos-agent-readonly'
I0804 12:14:17.286496  3738 http.cpp:1026] Creating default 'basic' HTTP authenticator for
realm 'mesos-agent-readwrite'
I0804 12:14:17.288645  3738 slave.cpp:565] Agent resources: [{"name":"cpus","scalar":{"value":2.0},"type":"SCALAR"},{"name":"mem","scalar":{"value":1024.0},"type":"SCALAR"},{"name":"disk","scalar":{"value":1024.0},"type":"SCALAR"},{"name":"ports","ranges":{"range":[{"begin":31000,"end":32000}]},"type":"RANGES"}]
I0804 12:14:17.289031  3738 slave.cpp:573] Agent attributes: [  ]
I0804 12:14:17.289072  3738 slave.cpp:582] Agent hostname: 4eb20b6abf80
I0804 12:14:17.289264  3740 status_update_manager.cpp:177] Pausing sending status updates
I0804 12:14:17.290731  3735 state.cpp:64] Recovering state from '/tmp/Endpoint_SlaveEndpointTest_UnauthorizedRequest_1_gG3M0V/meta'
I0804 12:14:17.291097  3744 status_update_manager.cpp:203] Recovering status update manager
I0804 12:14:17.291352  3751 containerizer.cpp:598] Recovering containerizer
I0804 12:14:17.293465  3749 provisioner.cpp:416] Provisioner recovery complete
I0804 12:14:17.293928  3738 slave.cpp:6207] Finished recovery
I0804 12:14:17.294667  3738 slave.cpp:6389] Querying resource estimator for oversubscribable
resources
I0804 12:14:17.294921  3731 slave.cpp:6403] Received oversubscribable resources {} from the
resource estimator
I0804 12:14:17.297873  3732 process.cpp:3933] Handling HTTP event for process 'slave(799)'
with path: '/slave(799)/monitor/statistics.json'
I0804 12:14:17.299332  3743 http.cpp:1166] HTTP GET for /slave(799)/monitor/statistics.json
from 172.17.0.3:47836
I0804 12:14:17.299398  3743 http.cpp:957] Authorizing principal 'test-principal' to GET the
'/monitor/statistics.json' endpoint
I0804 12:14:17.302115  3712 slave.cpp:843] Agent terminating
[       OK ] Endpoint/SlaveEndpointTest.UnauthorizedRequest/1 (34 ms)
[ RUN      ] Endpoint/SlaveEndpointTest.UnauthorizedRequest/2
I0804 12:14:17.315748  3712 containerizer.cpp:246] Using isolation: posix/cpu,posix/mem,filesystem/posix,network/cni,environment_secret
W0804 12:14:17.316648  3712 backend.cpp:76] Failed to create 'aufs' backend: AufsBackend requires
root privileges
W0804 12:14:17.316848  3712 backend.cpp:76] Failed to create 'bind' backend: BindBackend requires
root privileges
I0804 12:14:17.316901  3712 provisioner.cpp:255] Using default backend 'copy'
I0804 12:14:17.323180  3751 slave.cpp:250] Mesos agent started on (800)@172.17.0.3:41889
I0804 12:14:17.323225  3751 slave.cpp:251] Flags at startup: --acls="" --appc_simple_discovery_uri_prefix="http://"
--appc_store_dir="/tmp/Endpoint_SlaveEndpointTest_UnauthorizedRequest_2_6Dxkst/store/appc"
--authenticate_http_readonly="true" --authenticate_http_readwrite="true" --authenticatee="crammd5"
--authentication_backoff_factor="1secs" --authorizer="local" --cgroups_cpu_enable_pids_and_tids_count="false"
--cgroups_enable_cfs="false" --cgroups_hierarchy="/sys/fs/cgroup" --cgroups_limit_swap="false"
--cgroups_root="mesos" --container_disk_watch_interval="15secs" --containerizers="mesos" --credential="/tmp/Endpoint_SlaveEndpointTest_UnauthorizedRequest_2_6Dxkst/credential"
--default_role="*" --disk_watch_interval="1mins" --docker="docker" --docker_kill_orphans="true"
--docker_registry="https://registry-1.docker.io" --docker_remove_delay="6hrs" --docker_socket="/var/run/docker.sock"
--docker_stop_timeout="0ns" --docker_store_dir="/tmp/Endpoint_SlaveEndpointTest_UnauthorizedRequest_2_6Dxkst/store/docker"
--docker_volume_checkpoint_dir="/var/run/mesos/isolators/docker/volume" --enforce_container_disk_quota="false"
--executor_registration_timeout="1mins" --executor_reregistration_timeout="2secs" --executor_shutdown_grace_period="5secs"
--fetcher_cache_dir="/tmp/Endpoint_SlaveEndpointTest_UnauthorizedRequest_2_6Dxkst/fetch" --fetcher_cache_size="2GB"
--frameworks_home="" --gc_delay="1weeks" --gc_disk_headroom="0.1" --hadoop_home="" --help="false"
--hostname_lookup="true" --http_command_executor="false" --http_credentials="/tmp/Endpoint_SlaveEndpointTest_UnauthorizedRequest_2_6Dxkst/http_credentials"
--http_heartbeat_interval="30secs" --initialize_driver_logging="true" --isolation="posix/cpu,posix/mem"
--launcher="posix" --launcher_dir="/mesos/mesos-1.4.0/_build/src" --logbufsecs="0" --logging_level="INFO"
--max_completed_executors_per_framework="150" --oversubscribed_resources_interval="15secs"
--perf_duration="10secs" --perf_interval="1mins" --port="5051" --qos_correction_interval_min="0ns"
--quiet="false" --recover="reconnect" --recovery_timeout="15mins" --registration_backoff_factor="10ms"
--resources="cpus:2;gpus:0;mem:1024;disk:1024;ports:[31000-32000]" --revocable_cpu_low_priority="true"
--runtime_dir="/tmp/Endpoint_SlaveEndpointTest_UnauthorizedRequest_2_6Dxkst" --sandbox_directory="/mnt/mesos/sandbox"
--strict="true" --switch_user="true" --systemd_enable_support="true" --systemd_runtime_directory="/run/systemd/system"
--version="false" --work_dir="/tmp/Endpoint_SlaveEndpointTest_UnauthorizedRequest_2_c7Gala"
I0804 12:14:17.323686  3751 credentials.hpp:86] Loading credential for authentication from
'/tmp/Endpoint_SlaveEndpointTest_UnauthorizedRequest_2_6Dxkst/credential'
I0804 12:14:17.323886  3751 slave.cpp:283] Agent using credential for: test-principal
I0804 12:14:17.323915  3751 credentials.hpp:37] Loading credentials for authentication from
'/tmp/Endpoint_SlaveEndpointTest_UnauthorizedRequest_2_6Dxkst/http_credentials'
I0804 12:14:17.324190  3751 http.cpp:1026] Creating default 'basic' HTTP authenticator for
realm 'mesos-agent-readonly'
I0804 12:14:17.324368  3751 http.cpp:1026] Creating default 'basic' HTTP authenticator for
realm 'mesos-agent-readwrite'
I0804 12:14:17.325984  3751 slave.cpp:565] Agent resources: [{"name":"cpus","scalar":{"value":2.0},"type":"SCALAR"},{"name":"mem","scalar":{"value":1024.0},"type":"SCALAR"},{"name":"disk","scalar":{"value":1024.0},"type":"SCALAR"},{"name":"ports","ranges":{"range":[{"begin":31000,"end":32000}]},"type":"RANGES"}]
I0804 12:14:17.326249  3751 slave.cpp:573] Agent attributes: [  ]
I0804 12:14:17.326264  3751 slave.cpp:582] Agent hostname: 4eb20b6abf80
I0804 12:14:17.326469  3752 status_update_manager.cpp:177] Pausing sending status updates
I0804 12:14:17.328107  3742 state.cpp:64] Recovering state from '/tmp/Endpoint_SlaveEndpointTest_UnauthorizedRequest_2_c7Gala/meta'
I0804 12:14:17.328393  3747 status_update_manager.cpp:203] Recovering status update manager
I0804 12:14:17.328650  3741 containerizer.cpp:598] Recovering containerizer
I0804 12:14:17.330379  3744 provisioner.cpp:416] Provisioner recovery complete
I0804 12:14:17.330942  3744 slave.cpp:6207] Finished recovery
I0804 12:14:17.331480  3744 slave.cpp:6389] Querying resource estimator for oversubscribable
resources
I0804 12:14:17.331670  3740 slave.cpp:6403] Received oversubscribable resources {} from the
resource estimator
I0804 12:14:17.334715  3749 process.cpp:3933] Handling HTTP event for process 'slave(800)'
with path: '/slave(800)/containers'
I0804 12:14:17.336194  3742 http.cpp:1166] HTTP GET for /slave(800)/containers from 172.17.0.3:47838
I0804 12:14:17.336271  3742 http.cpp:957] Authorizing principal 'test-principal' to GET the
'/containers' endpoint
I0804 12:14:17.339377  3712 slave.cpp:843] Agent terminating
[       OK ] Endpoint/SlaveEndpointTest.UnauthorizedRequest/2 (36 ms)
[ RUN      ] Endpoint/SlaveEndpointTest.NoAuthorizer/0
I0804 12:14:17.351984  3712 containerizer.cpp:246] Using isolation: posix/cpu,posix/mem,filesystem/posix,network/cni,environment_secret
W0804 12:14:17.352730  3712 backend.cpp:76] Failed to create 'aufs' backend: AufsBackend requires
root privileges
W0804 12:14:17.352876  3712 backend.cpp:76] Failed to create 'bind' backend: BindBackend requires
root privileges
I0804 12:14:17.352916  3712 provisioner.cpp:255] Using default backend 'copy'
I0804 12:14:17.355476  3712 cluster.cpp:448] Creating default 'local' authorizer
I0804 12:14:17.357905  3750 slave.cpp:250] Mesos agent started on (801)@172.17.0.3:41889
I0804 12:14:17.357966  3750 slave.cpp:251] Flags at startup: --acls="" --appc_simple_discovery_uri_prefix="http://"
--appc_store_dir="/tmp/Endpoint_SlaveEndpointTest_NoAuthorizer_0_MIEKdI/store/appc" --authenticate_http_readonly="true"
--authenticate_http_readwrite="true" --authenticatee="crammd5" --authentication_backoff_factor="1secs"
--authorizer="local" --cgroups_cpu_enable_pids_and_tids_count="false" --cgroups_enable_cfs="false"
--cgroups_hierarchy="/sys/fs/cgroup" --cgroups_limit_swap="false" --cgroups_root="mesos" --container_disk_watch_interval="15secs"
--containerizers="mesos" --credential="/tmp/Endpoint_SlaveEndpointTest_NoAuthorizer_0_MIEKdI/credential"
--default_role="*" --disk_watch_interval="1mins" --docker="docker" --docker_kill_orphans="true"
--docker_registry="https://registry-1.docker.io" --docker_remove_delay="6hrs" --docker_socket="/var/run/docker.sock"
--docker_stop_timeout="0ns" --docker_store_dir="/tmp/Endpoint_SlaveEndpointTest_NoAuthorizer_0_MIEKdI/store/docker"
--docker_volume_checkpoint_dir="/var/run/mesos/isolators/docker/volume" --enforce_container_disk_quota="false"
--executor_registration_timeout="1mins" --executor_reregistration_timeout="2secs" --executor_shutdown_grace_period="5secs"
--fetcher_cache_dir="/tmp/Endpoint_SlaveEndpointTest_NoAuthorizer_0_MIEKdI/fetch" --fetcher_cache_size="2GB"
--frameworks_home="" --gc_delay="1weeks" --gc_disk_headroom="0.1" --hadoop_home="" --help="false"
--hostname_lookup="true" --http_command_executor="false" --http_credentials="/tmp/Endpoint_SlaveEndpointTest_NoAuthorizer_0_MIEKdI/http_credentials"
--http_heartbeat_interval="30secs" --initialize_driver_logging="true" --isolation="posix/cpu,posix/mem"
--launcher="posix" --launcher_dir="/mesos/mesos-1.4.0/_build/src" --logbufsecs="0" --logging_level="INFO"
--max_completed_executors_per_framework="150" --oversubscribed_resources_interval="15secs"
--perf_duration="10secs" --perf_interval="1mins" --port="5051" --qos_correction_interval_min="0ns"
--quiet="false" --recover="reconnect" --recovery_timeout="15mins" --registration_backoff_factor="10ms"
--resources="cpus:2;gpus:0;mem:1024;disk:1024;ports:[31000-32000]" --revocable_cpu_low_priority="true"
--runtime_dir="/tmp/Endpoint_SlaveEndpointTest_NoAuthorizer_0_MIEKdI" --sandbox_directory="/mnt/mesos/sandbox"
--strict="true" --switch_user="true" --systemd_enable_support="true" --systemd_runtime_directory="/run/systemd/system"
--version="false" --work_dir="/tmp/Endpoint_SlaveEndpointTest_NoAuthorizer_0_YsEb1o"
I0804 12:14:17.358407  3750 credentials.hpp:86] Loading credential for authentication from
'/tmp/Endpoint_SlaveEndpointTest_NoAuthorizer_0_MIEKdI/credential'
I0804 12:14:17.358604  3750 slave.cpp:283] Agent using credential for: test-principal
I0804 12:14:17.358633  3750 credentials.hpp:37] Loading credentials for authentication from
'/tmp/Endpoint_SlaveEndpointTest_NoAuthorizer_0_MIEKdI/http_credentials'
I0804 12:14:17.358901  3750 http.cpp:1026] Creating default 'basic' HTTP authenticator for
realm 'mesos-agent-readonly'
I0804 12:14:17.359063  3750 http.cpp:1026] Creating default 'basic' HTTP authenticator for
realm 'mesos-agent-readwrite'
I0804 12:14:17.360469  3750 slave.cpp:565] Agent resources: [{"name":"cpus","scalar":{"value":2.0},"type":"SCALAR"},{"name":"mem","scalar":{"value":1024.0},"type":"SCALAR"},{"name":"disk","scalar":{"value":1024.0},"type":"SCALAR"},{"name":"ports","ranges":{"range":[{"begin":31000,"end":32000}]},"type":"RANGES"}]
I0804 12:14:17.360738  3750 slave.cpp:573] Agent attributes: [  ]
I0804 12:14:17.360754  3750 slave.cpp:582] Agent hostname: 4eb20b6abf80
I0804 12:14:17.360929  3731 status_update_manager.cpp:177] Pausing sending status updates
I0804 12:14:17.362630  3732 state.cpp:64] Recovering state from '/tmp/Endpoint_SlaveEndpointTest_NoAuthorizer_0_YsEb1o/meta'
I0804 12:14:17.362879  3746 status_update_manager.cpp:203] Recovering status update manager
I0804 12:14:17.363181  3743 containerizer.cpp:598] Recovering containerizer
I0804 12:14:17.364962  3736 provisioner.cpp:416] Provisioner recovery complete
I0804 12:14:17.365380  3737 slave.cpp:6207] Finished recovery
I0804 12:14:17.365959  3737 slave.cpp:6389] Querying resource estimator for oversubscribable
resources
I0804 12:14:17.366240  3753 slave.cpp:6403] Received oversubscribable resources {} from the
resource estimator
I0804 12:14:17.369020  3731 process.cpp:3933] Handling HTTP event for process 'slave(801)'
with path: '/slave(801)/monitor/statistics'
I0804 12:14:17.370564  3744 http.cpp:1166] HTTP GET for /slave(801)/monitor/statistics from
172.17.0.3:47840
I0804 12:14:17.370702  3744 http.cpp:957] Authorizing principal 'test-principal' to GET the
'/monitor/statistics' endpoint
I0804 12:14:17.374629  3738 slave.cpp:843] Agent terminating
[       OK ] Endpoint/SlaveEndpointTest.NoAuthorizer/0 (36 ms)
[ RUN      ] Endpoint/SlaveEndpointTest.NoAuthorizer/1
I0804 12:14:17.391438  3712 containerizer.cpp:246] Using isolation: posix/cpu,posix/mem,filesystem/posix,network/cni,environment_secret
W0804 12:14:17.392163  3712 backend.cpp:76] Failed to create 'aufs' backend: AufsBackend requires
root privileges
W0804 12:14:17.392328  3712 backend.cpp:76] Failed to create 'bind' backend: BindBackend requires
root privileges
I0804 12:14:17.392360  3712 provisioner.cpp:255] Using default backend 'copy'
I0804 12:14:17.394985  3712 cluster.cpp:448] Creating default 'local' authorizer
I0804 12:14:17.397442  3752 slave.cpp:250] Mesos agent started on (802)@172.17.0.3:41889
I0804 12:14:17.397485  3752 slave.cpp:251] Flags at startup: --acls="" --appc_simple_discovery_uri_prefix="http://"
--appc_store_dir="/tmp/Endpoint_SlaveEndpointTest_NoAuthorizer_1_RTsclX/store/appc" --authenticate_http_readonly="true"
--authenticate_http_readwrite="true" --authenticatee="crammd5" --authentication_backoff_factor="1secs"
--authorizer="local" --cgroups_cpu_enable_pids_and_tids_count="false" --cgroups_enable_cfs="false"
--cgroups_hierarchy="/sys/fs/cgroup" --cgroups_limit_swap="false" --cgroups_root="mesos" --container_disk_watch_interval="15secs"
--containerizers="mesos" --credential="/tmp/Endpoint_SlaveEndpointTest_NoAuthorizer_1_RTsclX/credential"
--default_role="*" --disk_watch_interval="1mins" --docker="docker" --docker_kill_orphans="true"
--docker_registry="https://registry-1.docker.io" --docker_remove_delay="6hrs" --docker_socket="/var/run/docker.sock"
--docker_stop_timeout="0ns" --docker_store_dir="/tmp/Endpoint_SlaveEndpointTest_NoAuthorizer_1_RTsclX/store/docker"
--docker_volume_checkpoint_dir="/var/run/mesos/isolators/docker/volume" --enforce_container_disk_quota="false"
--executor_registration_timeout="1mins" --executor_reregistration_timeout="2secs" --executor_shutdown_grace_period="5secs"
--fetcher_cache_dir="/tmp/Endpoint_SlaveEndpointTest_NoAuthorizer_1_RTsclX/fetch" --fetcher_cache_size="2GB"
--frameworks_home="" --gc_delay="1weeks" --gc_disk_headroom="0.1" --hadoop_home="" --help="false"
--hostname_lookup="true" --http_command_executor="false" --http_credentials="/tmp/Endpoint_SlaveEndpointTest_NoAuthorizer_1_RTsclX/http_credentials"
--http_heartbeat_interval="30secs" --initialize_driver_logging="true" --isolation="posix/cpu,posix/mem"
--launcher="posix" --launcher_dir="/mesos/mesos-1.4.0/_build/src" --logbufsecs="0" --logging_level="INFO"
--max_completed_executors_per_framework="150" --oversubscribed_resources_interval="15secs"
--perf_duration="10secs" --perf_interval="1mins" --port="5051" --qos_correction_interval_min="0ns"
--quiet="false" --recover="reconnect" --recovery_timeout="15mins" --registration_backoff_factor="10ms"
--resources="cpus:2;gpus:0;mem:1024;disk:1024;ports:[31000-32000]" --revocable_cpu_low_priority="true"
--runtime_dir="/tmp/Endpoint_SlaveEndpointTest_NoAuthorizer_1_RTsclX" --sandbox_directory="/mnt/mesos/sandbox"
--strict="true" --switch_user="true" --systemd_enable_support="true" --systemd_runtime_directory="/run/systemd/system"
--version="false" --work_dir="/tmp/Endpoint_SlaveEndpointTest_NoAuthorizer_1_9ojW2D"
I0804 12:14:17.398087  3752 credentials.hpp:86] Loading credential for authentication from
'/tmp/Endpoint_SlaveEndpointTest_NoAuthorizer_1_RTsclX/credential'
I0804 12:14:17.398336  3752 slave.cpp:283] Agent using credential for: test-principal
I0804 12:14:17.398368  3752 credentials.hpp:37] Loading credentials for authentication from
'/tmp/Endpoint_SlaveEndpointTest_NoAuthorizer_1_RTsclX/http_credentials'
I0804 12:14:17.398674  3752 http.cpp:1026] Creating default 'basic' HTTP authenticator for
realm 'mesos-agent-readonly'
I0804 12:14:17.398922  3752 http.cpp:1026] Creating default 'basic' HTTP authenticator for
realm 'mesos-agent-readwrite'
I0804 12:14:17.401257  3752 slave.cpp:565] Agent resources: [{"name":"cpus","scalar":{"value":2.0},"type":"SCALAR"},{"name":"mem","scalar":{"value":1024.0},"type":"SCALAR"},{"name":"disk","scalar":{"value":1024.0},"type":"SCALAR"},{"name":"ports","ranges":{"range":[{"begin":31000,"end":32000}]},"type":"RANGES"}]
I0804 12:14:17.401648  3752 slave.cpp:573] Agent attributes: [  ]
I0804 12:14:17.401671  3752 slave.cpp:582] Agent hostname: 4eb20b6abf80
I0804 12:14:17.401873  3731 status_update_manager.cpp:177] Pausing sending status updates
I0804 12:14:17.403589  3738 state.cpp:64] Recovering state from '/tmp/Endpoint_SlaveEndpointTest_NoAuthorizer_1_9ojW2D/meta'
I0804 12:14:17.403885  3741 status_update_manager.cpp:203] Recovering status update manager
I0804 12:14:17.404172  3730 containerizer.cpp:598] Recovering containerizer
I0804 12:14:17.406121  3742 provisioner.cpp:416] Provisioner recovery complete
I0804 12:14:17.406566  3732 slave.cpp:6207] Finished recovery
I0804 12:14:17.407060  3732 slave.cpp:6389] Querying resource estimator for oversubscribable
resources
I0804 12:14:17.407335  3743 slave.cpp:6403] Received oversubscribable resources {} from the
resource estimator
I0804 12:14:17.410351  3749 process.cpp:3933] Handling HTTP event for process 'slave(802)'
with path: '/slave(802)/monitor/statistics.json'
I0804 12:14:17.411806  3737 http.cpp:1166] HTTP GET for /slave(802)/monitor/statistics.json
from 172.17.0.3:47842
I0804 12:14:17.411952  3737 http.cpp:957] Authorizing principal 'test-principal' to GET the
'/monitor/statistics.json' endpoint
I0804 12:14:17.416412  3712 slave.cpp:843] Agent terminating
[       OK ] Endpoint/SlaveEndpointTest.NoAuthorizer/1 (40 ms)
[ RUN      ] Endpoint/SlaveEndpointTest.NoAuthorizer/2
I0804 12:14:17.430503  3712 containerizer.cpp:246] Using isolation: posix/cpu,posix/mem,filesystem/posix,network/cni,environment_secret
W0804 12:14:17.431047  3712 backend.cpp:76] Failed to create 'aufs' backend: AufsBackend requires
root privileges
W0804 12:14:17.431170  3712 backend.cpp:76] Failed to create 'bind' backend: BindBackend requires
root privileges
I0804 12:14:17.431212  3712 provisioner.cpp:255] Using default backend 'copy'
I0804 12:14:17.433281  3712 cluster.cpp:448] Creating default 'local' authorizer
I0804 12:14:17.435093  3746 slave.cpp:250] Mesos agent started on (803)@172.17.0.3:41889
I0804 12:14:17.435151  3746 slave.cpp:251] Flags at startup: --acls="" --appc_simple_discovery_uri_prefix="http://"
--appc_store_dir="/tmp/Endpoint_SlaveEndpointTest_NoAuthorizer_2_me9VQc/store/appc" --authenticate_http_readonly="true"
--authenticate_http_readwrite="true" --authenticatee="crammd5" --authentication_backoff_factor="1secs"
--authorizer="local" --cgroups_cpu_enable_pids_and_tids_count="false" --cgroups_enable_cfs="false"
--cgroups_hierarchy="/sys/fs/cgroup" --cgroups_limit_swap="false" --cgroups_root="mesos" --container_disk_watch_interval="15secs"
--containerizers="mesos" --credential="/tmp/Endpoint_SlaveEndpointTest_NoAuthorizer_2_me9VQc/credential"
--default_role="*" --disk_watch_interval="1mins" --docker="docker" --docker_kill_orphans="true"
--docker_registry="https://registry-1.docker.io" --docker_remove_delay="6hrs" --docker_socket="/var/run/docker.sock"
--docker_stop_timeout="0ns" --docker_store_dir="/tmp/Endpoint_SlaveEndpointTest_NoAuthorizer_2_me9VQc/store/docker"
--docker_volume_checkpoint_dir="/var/run/mesos/isolators/docker/volume" --enforce_container_disk_quota="false"
--executor_registration_timeout="1mins" --executor_reregistration_timeout="2secs" --executor_shutdown_grace_period="5secs"
--fetcher_cache_dir="/tmp/Endpoint_SlaveEndpointTest_NoAuthorizer_2_me9VQc/fetch" --fetcher_cache_size="2GB"
--frameworks_home="" --gc_delay="1weeks" --gc_disk_headroom="0.1" --hadoop_home="" --help="false"
--hostname_lookup="true" --http_command_executor="false" --http_credentials="/tmp/Endpoint_SlaveEndpointTest_NoAuthorizer_2_me9VQc/http_credentials"
--http_heartbeat_interval="30secs" --initialize_driver_logging="true" --isolation="posix/cpu,posix/mem"
--launcher="posix" --launcher_dir="/mesos/mesos-1.4.0/_build/src" --logbufsecs="0" --logging_level="INFO"
--max_completed_executors_per_framework="150" --oversubscribed_resources_interval="15secs"
--perf_duration="10secs" --perf_interval="1mins" --port="5051" --qos_correction_interval_min="0ns"
--quiet="false" --recover="reconnect" --recovery_timeout="15mins" --registration_backoff_factor="10ms"
--resources="cpus:2;gpus:0;mem:1024;disk:1024;ports:[31000-32000]" --revocable_cpu_low_priority="true"
--runtime_dir="/tmp/Endpoint_SlaveEndpointTest_NoAuthorizer_2_me9VQc" --sandbox_directory="/mnt/mesos/sandbox"
--strict="true" --switch_user="true" --systemd_enable_support="true" --systemd_runtime_directory="/run/systemd/system"
--version="false" --work_dir="/tmp/Endpoint_SlaveEndpointTest_NoAuthorizer_2_cj7EsT"
I0804 12:14:17.435676  3746 credentials.hpp:86] Loading credential for authentication from
'/tmp/Endpoint_SlaveEndpointTest_NoAuthorizer_2_me9VQc/credential'
I0804 12:14:17.435873  3746 slave.cpp:283] Agent using credential for: test-principal
I0804 12:14:17.435910  3746 credentials.hpp:37] Loading credentials for authentication from
'/tmp/Endpoint_SlaveEndpointTest_NoAuthorizer_2_me9VQc/http_credentials'
I0804 12:14:17.436215  3746 http.cpp:1026] Creating default 'basic' HTTP authenticator for
realm 'mesos-agent-readonly'
I0804 12:14:17.436413  3746 http.cpp:1026] Creating default 'basic' HTTP authenticator for
realm 'mesos-agent-readwrite'
I0804 12:14:17.437906  3746 slave.cpp:565] Agent resources: [{"name":"cpus","scalar":{"value":2.0},"type":"SCALAR"},{"name":"mem","scalar":{"value":1024.0},"type":"SCALAR"},{"name":"disk","scalar":{"value":1024.0},"type":"SCALAR"},{"name":"ports","ranges":{"range":[{"begin":31000,"end":32000}]},"type":"RANGES"}]
I0804 12:14:17.438190  3746 slave.cpp:573] Agent attributes: [  ]
I0804 12:14:17.438205  3746 slave.cpp:582] Agent hostname: 4eb20b6abf80
I0804 12:14:17.438354  3735 status_update_manager.cpp:177] Pausing sending status updates
I0804 12:14:17.440011  3747 state.cpp:64] Recovering state from '/tmp/Endpoint_SlaveEndpointTest_NoAuthorizer_2_cj7EsT/meta'
I0804 12:14:17.440357  3745 status_update_manager.cpp:203] Recovering status update manager
I0804 12:14:17.440552  3745 containerizer.cpp:598] Recovering containerizer
I0804 12:14:17.442623  3751 provisioner.cpp:416] Provisioner recovery complete
I0804 12:14:17.443202  3731 slave.cpp:6207] Finished recovery
I0804 12:14:17.443735  3731 slave.cpp:6389] Querying resource estimator for oversubscribable
resources
I0804 12:14:17.443979  3738 slave.cpp:6403] Received oversubscribable resources {} from the
resource estimator
I0804 12:14:17.446621  3739 process.cpp:3933] Handling HTTP event for process 'slave(803)'
with path: '/slave(803)/containers'
I0804 12:14:17.448120  3730 http.cpp:1166] HTTP GET for /slave(803)/containers from 172.17.0.3:47844
I0804 12:14:17.448207  3730 http.cpp:957] Authorizing principal 'test-principal' to GET the
'/containers' endpoint
I0804 12:14:17.453119  3712 slave.cpp:843] Agent terminating
[       OK ] Endpoint/SlaveEndpointTest.NoAuthorizer/2 (35 ms)
[----------] 9 tests from Endpoint/SlaveEndpointTest (327 ms total)

[----------] 2 tests from ContainerizerType/DefaultContainerDNSFlagTest
[ RUN      ] ContainerizerType/DefaultContainerDNSFlagTest.ValidateFlag/0
[       OK ] ContainerizerType/DefaultContainerDNSFlagTest.ValidateFlag/0 (9 ms)
[ RUN      ] ContainerizerType/DefaultContainerDNSFlagTest.ValidateFlag/1
[       OK ] ContainerizerType/DefaultContainerDNSFlagTest.ValidateFlag/1 (10 ms)
[----------] 2 tests from ContainerizerType/DefaultContainerDNSFlagTest (19 ms total)

[----------] Global test environment tear-down
[==========] 1653 tests from 182 test cases ran. (602875 ms total)
[  PASSED  ] 1652 tests.
[  FAILED  ] 1 test, listed below:
[  FAILED  ] ExamplesTest.DynamicReservationFramework

 1 FAILED TEST
  YOU HAVE 20 DISABLED TESTS

I0804 12:14:17.539011  3754 process.cpp:1072] Failed to accept socket: future discarded
make[4]: *** [check-local] Error 1
make[4]: Leaving directory `/mesos/mesos-1.4.0/_build/src'
make[3]: *** [check-am] Error 2
make[3]: Leaving directory `/mesos/mesos-1.4.0/_build/src'
make[2]: *** [check] Error 2
make[2]: Leaving directory `/mesos/mesos-1.4.0/_build/src'
make[1]: *** [check-recursive] Error 1
make[1]: Leaving directory `/mesos/mesos-1.4.0/_build'
make: *** [distcheck] Error 1
+ docker rmi mesos-1501845789-6122
Untagged: mesos-1501845789-6122:latest
Deleted: sha256:e3988651d8b685d03023d2431a6a88c368b12cb8f41c2eb87f2704f9d2637717
Deleted: sha256:c54959503f3f9a9996a3cf88b9b0722c07c2a60b6e043f742714275813149592
Deleted: sha256:88160ab24f983f775ab543a9c672b01b91793ac6ec0677606db75431c3cb0b3e
Deleted: sha256:245bbf83ee59bdf68e988f036a4fa2beb212613ec4771bf6342ee2a0a906b16f
Deleted: sha256:16c9f21d7c5c0288072584c2e513848bfdb8e8beb795c7cf89f86d6745e9cbb1
Deleted: sha256:d739d63d8b2114a3d5494c45cebbb5d5e452bc1b188e0b4c8fde4f5f97dd523a
Deleted: sha256:708bbaaee0964394cff9eea91305bd254affaf958eab0430f057b0528f144493
Deleted: sha256:2b23c9552742487127451dedfe6fc366aff60fc815a4c7784cd0ac880dd5364f
Deleted: sha256:0fa9d9c2cd29d9ffd5c154d84d0901f41e717f74fb08d668b75b80c5c49eeb22
Deleted: sha256:51a940040aa33b8db019f954334b5794d96df88ee1dd8dac0e0c6bdbed58a469
Deleted: sha256:f832211ee388ca9729d0ca0eb241b3050c14cc7e196fe1b1736dbaa78fb2d7ab
Deleted: sha256:303ad4ab6b9d790367a3e9492bd823cea3b501ff4a192cf65b1ce86203f5f453
Deleted: sha256:69e8d890b91040791f9d3ec28357c0ba723caf70d65b914988c5b700102e2af9
Deleted: sha256:8e91cf04197ba03d767c3f0a20be73636c7afae1c80834f29a9f6010d69d349f
Deleted: sha256:971cc81b6103f0ab5e6248ad4be8cd8709b5408e6c9fce3d893979f70f6c5ed0
Deleted: sha256:1c3ab92742538c9fd854725766b40f25183b7246e58a3c2796e7e7da2167f61a
Deleted: sha256:b1e31700f8794599e2e235f1d46d5712f3c9ee339f3ae7131ec560a80a136c5f
Deleted: sha256:292978aa096bb9ee56f30f0cca15265b3671c2e28b8044237d43a42ff86ee0f7
Deleted: sha256:bf27b7f08bee2db2ce0eabdd5fd77ba295d7c570e37e64bd38653357b9a67985
Deleted: sha256:82b7f4b7004ec18cf01786c3aa7e536f6ee9a68e6d2cfbf60ec0ebfdd6dfde62
Deleted: sha256:329ad518551d91d5b6cbe170145ee5517c3035aef8b8e488d7afe3c6c554bdcf
Deleted: sha256:c18c5db1c812c0a850192b999ca55472b32e6bacfdee59dfdde27615ef8cb0e5
Deleted: sha256:0a5b25d65e4ecb63ad1d986d883c76f80c60c95dc9754c28059ea8aeb131561c
Deleted: sha256:0b20c52ab9c3a6eceabf4e26a48957a371adaba7a24cd22a4920b911ca8f448d
Build step 'Execute shell' marked build as failure

Mime
View raw message