mesos-builds mailing list archives

Site index · List index
Message view « Date » · « Thread »
Top « Date » · « Thread »
From Apache Jenkins Server <jenk...@builds.apache.org>
Subject Build failed in Jenkins: Mesos-Buildbot » autotools,gcc,--verbose,GLOG_v=1 MESOS_VERBOSE=1,centos:7,(ubuntu)&&(!ubuntu-us1)&&(!ubuntu-eu2) #4151
Date Fri, 25 Aug 2017 05:53:54 GMT
See <https://builds.apache.org/job/Mesos-Buildbot/BUILDTOOL=autotools,COMPILER=gcc,CONFIGURATION=--verbose,ENVIRONMENT=GLOG_v=1%20MESOS_VERBOSE=1,OS=centos%3A7,label_exp=(ubuntu)&&(!ubuntu-us1)&&(!ubuntu-eu2)/4151/display/redirect>

------------------------------------------
[...truncated 30.57 MB...]
I0825 05:53:40.471599  6718 credentials.hpp:37] Loading credentials for authentication from
'/tmp/Endpoint_SlaveEndpointTest_AuthorizedRequest_2_P8xTNn/http_credentials'
I0825 05:53:40.471828  6718 http.cpp:1026] Creating default 'basic' HTTP authenticator for
realm 'mesos-agent-readonly'
I0825 05:53:40.471982  6718 http.cpp:1026] Creating default 'basic' HTTP authenticator for
realm 'mesos-agent-readwrite'
I0825 05:53:40.474143  6718 slave.cpp:581] Agent resources: [{"name":"cpus","scalar":{"value":2.0},"type":"SCALAR"},{"name":"mem","scalar":{"value":1024.0},"type":"SCALAR"},{"name":"disk","scalar":{"value":1024.0},"type":"SCALAR"},{"name":"ports","ranges":{"range":[{"begin":31000,"end":32000}]},"type":"RANGES"}]
I0825 05:53:40.474532  6718 slave.cpp:589] Agent attributes: [  ]
I0825 05:53:40.474570  6718 slave.cpp:598] Agent hostname: 88fefbed62c5
I0825 05:53:40.474742  6709 status_update_manager.cpp:177] Pausing sending status updates
I0825 05:53:40.476536  6710 state.cpp:64] Recovering state from '/tmp/Endpoint_SlaveEndpointTest_AuthorizedRequest_2_nLV4s4/meta'
I0825 05:53:40.476843  6720 status_update_manager.cpp:203] Recovering status update manager
I0825 05:53:40.477171  6727 containerizer.cpp:643] Recovering containerizer
I0825 05:53:40.478751  6722 provisioner.cpp:416] Provisioner recovery complete
I0825 05:53:40.479302  6718 slave.cpp:6264] Finished recovery
I0825 05:53:40.479900  6718 slave.cpp:6446] Querying resource estimator for oversubscribable
resources
I0825 05:53:40.480171  6716 slave.cpp:6460] Received oversubscribable resources {} from the
resource estimator
I0825 05:53:40.482578  6709 process.cpp:3933] Handling HTTP event for process 'slave(799)'
with path: '/slave(799)/containers'
I0825 05:53:40.484012  6725 http.cpp:1166] HTTP GET for /slave(799)/containers from 172.17.0.3:56350
I0825 05:53:40.484086  6725 http.cpp:957] Authorizing principal 'test-principal' to GET the
'/containers' endpoint
I0825 05:53:40.488119  6690 slave.cpp:859] Agent terminating
[       OK ] Endpoint/SlaveEndpointTest.AuthorizedRequest/2 (34 ms)
[ RUN      ] Endpoint/SlaveEndpointTest.UnauthorizedRequest/0
I0825 05:53:40.499541  6690 containerizer.cpp:288] Using isolation { environment_secret, posix/cpu,
posix/mem, filesystem/posix, network/cni }
W0825 05:53:40.499992  6690 backend.cpp:76] Failed to create 'aufs' backend: AufsBackend requires
root privileges
W0825 05:53:40.500094  6690 backend.cpp:76] Failed to create 'bind' backend: BindBackend requires
root privileges
I0825 05:53:40.500124  6690 provisioner.cpp:255] Using default backend 'copy'
I0825 05:53:40.503633  6731 slave.cpp:252] Mesos agent started on (800)@172.17.0.3:36008
I0825 05:53:40.503664  6731 slave.cpp:253] Flags at startup: --acls="" --appc_simple_discovery_uri_prefix="http://"
--appc_store_dir="/tmp/Endpoint_SlaveEndpointTest_UnauthorizedRequest_0_LZTxqD/store/appc"
--authenticate_http_readonly="true" --authenticate_http_readwrite="true" --authenticatee="crammd5"
--authentication_backoff_factor="1secs" --authorizer="local" --cgroups_cpu_enable_pids_and_tids_count="false"
--cgroups_enable_cfs="false" --cgroups_hierarchy="/sys/fs/cgroup" --cgroups_limit_swap="false"
--cgroups_root="mesos" --container_disk_watch_interval="15secs" --containerizers="mesos" --credential="/tmp/Endpoint_SlaveEndpointTest_UnauthorizedRequest_0_LZTxqD/credential"
--default_role="*" --disallow_sharing_agent_pid_namespace="false" --disk_watch_interval="1mins"
--docker="docker" --docker_kill_orphans="true" --docker_registry="https://registry-1.docker.io"
--docker_remove_delay="6hrs" --docker_socket="/var/run/docker.sock" --docker_stop_timeout="0ns"
--docker_store_dir="/tmp/Endpoint_SlaveEndpointTest_UnauthorizedRequest_0_LZTxqD/store/docker"
--docker_volume_checkpoint_dir="/var/run/mesos/isolators/docker/volume" --enforce_container_disk_quota="false"
--executor_registration_timeout="1mins" --executor_reregistration_timeout="2secs" --executor_shutdown_grace_period="5secs"
--fetcher_cache_dir="/tmp/Endpoint_SlaveEndpointTest_UnauthorizedRequest_0_LZTxqD/fetch" --fetcher_cache_size="2GB"
--frameworks_home="" --gc_delay="1weeks" --gc_disk_headroom="0.1" --hadoop_home="" --help="false"
--hostname_lookup="true" --http_command_executor="false" --http_credentials="/tmp/Endpoint_SlaveEndpointTest_UnauthorizedRequest_0_LZTxqD/http_credentials"
--http_heartbeat_interval="30secs" --initialize_driver_logging="true" --isolation="posix/cpu,posix/mem"
--launcher="posix" --launcher_dir="/mesos/mesos-1.5.0/_build/src" --logbufsecs="0" --logging_level="INFO"
--max_completed_executors_per_framework="150" --oversubscribed_resources_interval="15secs"
--perf_duration="10secs" --perf_interval="1mins" --port="5051" --qos_correction_interval_min="0ns"
--quiet="false" --recover="reconnect" --recovery_timeout="15mins" --registration_backoff_factor="10ms"
--resources="cpus:2;gpus:0;mem:1024;disk:1024;ports:[31000-32000]" --revocable_cpu_low_priority="true"
--runtime_dir="/tmp/Endpoint_SlaveEndpointTest_UnauthorizedRequest_0_LZTxqD" --sandbox_directory="/mnt/mesos/sandbox"
--strict="true" --switch_user="true" --systemd_enable_support="true" --systemd_runtime_directory="/run/systemd/system"
--version="false" --work_dir="/tmp/Endpoint_SlaveEndpointTest_UnauthorizedRequest_0_zDZE0j"
I0825 05:53:40.504218  6731 credentials.hpp:86] Loading credential for authentication from
'/tmp/Endpoint_SlaveEndpointTest_UnauthorizedRequest_0_LZTxqD/credential'
I0825 05:53:40.504406  6731 slave.cpp:285] Agent using credential for: test-principal
I0825 05:53:40.504444  6731 credentials.hpp:37] Loading credentials for authentication from
'/tmp/Endpoint_SlaveEndpointTest_UnauthorizedRequest_0_LZTxqD/http_credentials'
I0825 05:53:40.504806  6731 http.cpp:1026] Creating default 'basic' HTTP authenticator for
realm 'mesos-agent-readonly'
I0825 05:53:40.505093  6731 http.cpp:1026] Creating default 'basic' HTTP authenticator for
realm 'mesos-agent-readwrite'
I0825 05:53:40.507386  6731 slave.cpp:581] Agent resources: [{"name":"cpus","scalar":{"value":2.0},"type":"SCALAR"},{"name":"mem","scalar":{"value":1024.0},"type":"SCALAR"},{"name":"disk","scalar":{"value":1024.0},"type":"SCALAR"},{"name":"ports","ranges":{"range":[{"begin":31000,"end":32000}]},"type":"RANGES"}]
I0825 05:53:40.507804  6731 slave.cpp:589] Agent attributes: [  ]
I0825 05:53:40.507833  6731 slave.cpp:598] Agent hostname: 88fefbed62c5
I0825 05:53:40.508045  6722 status_update_manager.cpp:177] Pausing sending status updates
I0825 05:53:40.510785  6718 state.cpp:64] Recovering state from '/tmp/Endpoint_SlaveEndpointTest_UnauthorizedRequest_0_zDZE0j/meta'
I0825 05:53:40.511175  6724 status_update_manager.cpp:203] Recovering status update manager
I0825 05:53:40.511387  6710 containerizer.cpp:643] Recovering containerizer
I0825 05:53:40.513027  6729 provisioner.cpp:416] Provisioner recovery complete
I0825 05:53:40.513613  6731 slave.cpp:6264] Finished recovery
I0825 05:53:40.514072  6731 slave.cpp:6446] Querying resource estimator for oversubscribable
resources
I0825 05:53:40.514339  6712 slave.cpp:6460] Received oversubscribable resources {} from the
resource estimator
I0825 05:53:40.516794  6720 process.cpp:3933] Handling HTTP event for process 'slave(800)'
with path: '/slave(800)/monitor/statistics'
I0825 05:53:40.517966  6729 http.cpp:1166] HTTP GET for /slave(800)/monitor/statistics from
172.17.0.3:56352
I0825 05:53:40.518085  6729 http.cpp:957] Authorizing principal 'test-principal' to GET the
'/monitor/statistics' endpoint
I0825 05:53:40.520915  6725 slave.cpp:859] Agent terminating
[       OK ] Endpoint/SlaveEndpointTest.UnauthorizedRequest/0 (36 ms)
[ RUN      ] Endpoint/SlaveEndpointTest.UnauthorizedRequest/1
I0825 05:53:40.538763  6690 containerizer.cpp:288] Using isolation { environment_secret, posix/cpu,
posix/mem, filesystem/posix, network/cni }
W0825 05:53:40.539435  6690 backend.cpp:76] Failed to create 'aufs' backend: AufsBackend requires
root privileges
W0825 05:53:40.539600  6690 backend.cpp:76] Failed to create 'bind' backend: BindBackend requires
root privileges
I0825 05:53:40.539635  6690 provisioner.cpp:255] Using default backend 'copy'
I0825 05:53:40.546167  6723 slave.cpp:252] Mesos agent started on (801)@172.17.0.3:36008
I0825 05:53:40.546200  6723 slave.cpp:253] Flags at startup: --acls="" --appc_simple_discovery_uri_prefix="http://"
--appc_store_dir="/tmp/Endpoint_SlaveEndpointTest_UnauthorizedRequest_1_4elNoT/store/appc"
--authenticate_http_readonly="true" --authenticate_http_readwrite="true" --authenticatee="crammd5"
--authentication_backoff_factor="1secs" --authorizer="local" --cgroups_cpu_enable_pids_and_tids_count="false"
--cgroups_enable_cfs="false" --cgroups_hierarchy="/sys/fs/cgroup" --cgroups_limit_swap="false"
--cgroups_root="mesos" --container_disk_watch_interval="15secs" --containerizers="mesos" --credential="/tmp/Endpoint_SlaveEndpointTest_UnauthorizedRequest_1_4elNoT/credential"
--default_role="*" --disallow_sharing_agent_pid_namespace="false" --disk_watch_interval="1mins"
--docker="docker" --docker_kill_orphans="true" --docker_registry="https://registry-1.docker.io"
--docker_remove_delay="6hrs" --docker_socket="/var/run/docker.sock" --docker_stop_timeout="0ns"
--docker_store_dir="/tmp/Endpoint_SlaveEndpointTest_UnauthorizedRequest_1_4elNoT/store/docker"
--docker_volume_checkpoint_dir="/var/run/mesos/isolators/docker/volume" --enforce_container_disk_quota="false"
--executor_registration_timeout="1mins" --executor_reregistration_timeout="2secs" --executor_shutdown_grace_period="5secs"
--fetcher_cache_dir="/tmp/Endpoint_SlaveEndpointTest_UnauthorizedRequest_1_4elNoT/fetch" --fetcher_cache_size="2GB"
--frameworks_home="" --gc_delay="1weeks" --gc_disk_headroom="0.1" --hadoop_home="" --help="false"
--hostname_lookup="true" --http_command_executor="false" --http_credentials="/tmp/Endpoint_SlaveEndpointTest_UnauthorizedRequest_1_4elNoT/http_credentials"
--http_heartbeat_interval="30secs" --initialize_driver_logging="true" --isolation="posix/cpu,posix/mem"
--launcher="posix" --launcher_dir="/mesos/mesos-1.5.0/_build/src" --logbufsecs="0" --logging_level="INFO"
--max_completed_executors_per_framework="150" --oversubscribed_resources_interval="15secs"
--perf_duration="10secs" --perf_interval="1mins" --port="5051" --qos_correction_interval_min="0ns"
--quiet="false" --recover="reconnect" --recovery_timeout="15mins" --registration_backoff_factor="10ms"
--resources="cpus:2;gpus:0;mem:1024;disk:1024;ports:[31000-32000]" --revocable_cpu_low_priority="true"
--runtime_dir="/tmp/Endpoint_SlaveEndpointTest_UnauthorizedRequest_1_4elNoT" --sandbox_directory="/mnt/mesos/sandbox"
--strict="true" --switch_user="true" --systemd_enable_support="true" --systemd_runtime_directory="/run/systemd/system"
--version="false" --work_dir="/tmp/Endpoint_SlaveEndpointTest_UnauthorizedRequest_1_KWPmTz"
I0825 05:53:40.546756  6723 credentials.hpp:86] Loading credential for authentication from
'/tmp/Endpoint_SlaveEndpointTest_UnauthorizedRequest_1_4elNoT/credential'
I0825 05:53:40.546954  6723 slave.cpp:285] Agent using credential for: test-principal
I0825 05:53:40.546983  6723 credentials.hpp:37] Loading credentials for authentication from
'/tmp/Endpoint_SlaveEndpointTest_UnauthorizedRequest_1_4elNoT/http_credentials'
I0825 05:53:40.547284  6723 http.cpp:1026] Creating default 'basic' HTTP authenticator for
realm 'mesos-agent-readonly'
I0825 05:53:40.547478  6723 http.cpp:1026] Creating default 'basic' HTTP authenticator for
realm 'mesos-agent-readwrite'
I0825 05:53:40.549147  6723 slave.cpp:581] Agent resources: [{"name":"cpus","scalar":{"value":2.0},"type":"SCALAR"},{"name":"mem","scalar":{"value":1024.0},"type":"SCALAR"},{"name":"disk","scalar":{"value":1024.0},"type":"SCALAR"},{"name":"ports","ranges":{"range":[{"begin":31000,"end":32000}]},"type":"RANGES"}]
I0825 05:53:40.549432  6723 slave.cpp:589] Agent attributes: [  ]
I0825 05:53:40.549450  6723 slave.cpp:598] Agent hostname: 88fefbed62c5
I0825 05:53:40.549757  6725 status_update_manager.cpp:177] Pausing sending status updates
I0825 05:53:40.551268  6711 state.cpp:64] Recovering state from '/tmp/Endpoint_SlaveEndpointTest_UnauthorizedRequest_1_KWPmTz/meta'
I0825 05:53:40.551867  6728 status_update_manager.cpp:203] Recovering status update manager
I0825 05:53:40.552211  6722 containerizer.cpp:643] Recovering containerizer
I0825 05:53:40.554482  6725 provisioner.cpp:416] Provisioner recovery complete
I0825 05:53:40.555052  6710 slave.cpp:6264] Finished recovery
I0825 05:53:40.555471  6710 slave.cpp:6446] Querying resource estimator for oversubscribable
resources
I0825 05:53:40.555737  6718 slave.cpp:6460] Received oversubscribable resources {} from the
resource estimator
I0825 05:53:40.558641  6714 process.cpp:3933] Handling HTTP event for process 'slave(801)'
with path: '/slave(801)/monitor/statistics.json'
I0825 05:53:40.560161  6712 http.cpp:1166] HTTP GET for /slave(801)/monitor/statistics.json
from 172.17.0.3:56356
I0825 05:53:40.560241  6712 http.cpp:957] Authorizing principal 'test-principal' to GET the
'/monitor/statistics.json' endpoint
I0825 05:53:40.563427  6690 slave.cpp:859] Agent terminating
[       OK ] Endpoint/SlaveEndpointTest.UnauthorizedRequest/1 (40 ms)
[ RUN      ] Endpoint/SlaveEndpointTest.UnauthorizedRequest/2
I0825 05:53:40.577183  6690 containerizer.cpp:288] Using isolation { environment_secret, posix/cpu,
posix/mem, filesystem/posix, network/cni }
W0825 05:53:40.577718  6690 backend.cpp:76] Failed to create 'aufs' backend: AufsBackend requires
root privileges
W0825 05:53:40.577838  6690 backend.cpp:76] Failed to create 'bind' backend: BindBackend requires
root privileges
I0825 05:53:40.577883  6690 provisioner.cpp:255] Using default backend 'copy'
I0825 05:53:40.581887  6719 slave.cpp:252] Mesos agent started on (802)@172.17.0.3:36008
I0825 05:53:40.581918  6719 slave.cpp:253] Flags at startup: --acls="" --appc_simple_discovery_uri_prefix="http://"
--appc_store_dir="/tmp/Endpoint_SlaveEndpointTest_UnauthorizedRequest_2_ASb9K9/store/appc"
--authenticate_http_readonly="true" --authenticate_http_readwrite="true" --authenticatee="crammd5"
--authentication_backoff_factor="1secs" --authorizer="local" --cgroups_cpu_enable_pids_and_tids_count="false"
--cgroups_enable_cfs="false" --cgroups_hierarchy="/sys/fs/cgroup" --cgroups_limit_swap="false"
--cgroups_root="mesos" --container_disk_watch_interval="15secs" --containerizers="mesos" --credential="/tmp/Endpoint_SlaveEndpointTest_UnauthorizedRequest_2_ASb9K9/credential"
--default_role="*" --disallow_sharing_agent_pid_namespace="false" --disk_watch_interval="1mins"
--docker="docker" --docker_kill_orphans="true" --docker_registry="https://registry-1.docker.io"
--docker_remove_delay="6hrs" --docker_socket="/var/run/docker.sock" --docker_stop_timeout="0ns"
--docker_store_dir="/tmp/Endpoint_SlaveEndpointTest_UnauthorizedRequest_2_ASb9K9/store/docker"
--docker_volume_checkpoint_dir="/var/run/mesos/isolators/docker/volume" --enforce_container_disk_quota="false"
--executor_registration_timeout="1mins" --executor_reregistration_timeout="2secs" --executor_shutdown_grace_period="5secs"
--fetcher_cache_dir="/tmp/Endpoint_SlaveEndpointTest_UnauthorizedRequest_2_ASb9K9/fetch" --fetcher_cache_size="2GB"
--frameworks_home="" --gc_delay="1weeks" --gc_disk_headroom="0.1" --hadoop_home="" --help="false"
--hostname_lookup="true" --http_command_executor="false" --http_credentials="/tmp/Endpoint_SlaveEndpointTest_UnauthorizedRequest_2_ASb9K9/http_credentials"
--http_heartbeat_interval="30secs" --initialize_driver_logging="true" --isolation="posix/cpu,posix/mem"
--launcher="posix" --launcher_dir="/mesos/mesos-1.5.0/_build/src" --logbufsecs="0" --logging_level="INFO"
--max_completed_executors_per_framework="150" --oversubscribed_resources_interval="15secs"
--perf_duration="10secs" --perf_interval="1mins" --port="5051" --qos_correction_interval_min="0ns"
--quiet="false" --recover="reconnect" --recovery_timeout="15mins" --registration_backoff_factor="10ms"
--resources="cpus:2;gpus:0;mem:1024;disk:1024;ports:[31000-32000]" --revocable_cpu_low_priority="true"
--runtime_dir="/tmp/Endpoint_SlaveEndpointTest_UnauthorizedRequest_2_ASb9K9" --sandbox_directory="/mnt/mesos/sandbox"
--strict="true" --switch_user="true" --systemd_enable_support="true" --systemd_runtime_directory="/run/systemd/system"
--version="false" --work_dir="/tmp/Endpoint_SlaveEndpointTest_UnauthorizedRequest_2_UWWL9P"
I0825 05:53:40.582336  6719 credentials.hpp:86] Loading credential for authentication from
'/tmp/Endpoint_SlaveEndpointTest_UnauthorizedRequest_2_ASb9K9/credential'
I0825 05:53:40.582518  6719 slave.cpp:285] Agent using credential for: test-principal
I0825 05:53:40.582556  6719 credentials.hpp:37] Loading credentials for authentication from
'/tmp/Endpoint_SlaveEndpointTest_UnauthorizedRequest_2_ASb9K9/http_credentials'
I0825 05:53:40.582852  6719 http.cpp:1026] Creating default 'basic' HTTP authenticator for
realm 'mesos-agent-readonly'
I0825 05:53:40.583058  6719 http.cpp:1026] Creating default 'basic' HTTP authenticator for
realm 'mesos-agent-readwrite'
I0825 05:53:40.584574  6719 slave.cpp:581] Agent resources: [{"name":"cpus","scalar":{"value":2.0},"type":"SCALAR"},{"name":"mem","scalar":{"value":1024.0},"type":"SCALAR"},{"name":"disk","scalar":{"value":1024.0},"type":"SCALAR"},{"name":"ports","ranges":{"range":[{"begin":31000,"end":32000}]},"type":"RANGES"}]
I0825 05:53:40.584877  6719 slave.cpp:589] Agent attributes: [  ]
I0825 05:53:40.584893  6719 slave.cpp:598] Agent hostname: 88fefbed62c5
I0825 05:53:40.585125  6731 status_update_manager.cpp:177] Pausing sending status updates
I0825 05:53:40.586685  6729 state.cpp:64] Recovering state from '/tmp/Endpoint_SlaveEndpointTest_UnauthorizedRequest_2_UWWL9P/meta'
I0825 05:53:40.587062  6723 status_update_manager.cpp:203] Recovering status update manager
I0825 05:53:40.587265  6723 containerizer.cpp:643] Recovering containerizer
I0825 05:53:40.589167  6721 provisioner.cpp:416] Provisioner recovery complete
I0825 05:53:40.589663  6718 slave.cpp:6264] Finished recovery
I0825 05:53:40.590090  6718 slave.cpp:6446] Querying resource estimator for oversubscribable
resources
I0825 05:53:40.590337  6713 slave.cpp:6460] Received oversubscribable resources {} from the
resource estimator
I0825 05:53:40.593163  6720 process.cpp:3933] Handling HTTP event for process 'slave(802)'
with path: '/slave(802)/containers'
I0825 05:53:40.594343  6721 http.cpp:1166] HTTP GET for /slave(802)/containers from 172.17.0.3:56358
I0825 05:53:40.594413  6721 http.cpp:957] Authorizing principal 'test-principal' to GET the
'/containers' endpoint
I0825 05:53:40.597017  6690 slave.cpp:859] Agent terminating
[       OK ] Endpoint/SlaveEndpointTest.UnauthorizedRequest/2 (32 ms)
[ RUN      ] Endpoint/SlaveEndpointTest.NoAuthorizer/0
I0825 05:53:40.609416  6690 containerizer.cpp:288] Using isolation { environment_secret, posix/cpu,
posix/mem, filesystem/posix, network/cni }
W0825 05:53:40.609855  6690 backend.cpp:76] Failed to create 'aufs' backend: AufsBackend requires
root privileges
W0825 05:53:40.609962  6690 backend.cpp:76] Failed to create 'bind' backend: BindBackend requires
root privileges
I0825 05:53:40.609998  6690 provisioner.cpp:255] Using default backend 'copy'
I0825 05:53:40.611594  6690 cluster.cpp:448] Creating default 'local' authorizer
I0825 05:53:40.613620  6718 slave.cpp:252] Mesos agent started on (803)@172.17.0.3:36008
I0825 05:53:40.613646  6718 slave.cpp:253] Flags at startup: --acls="" --appc_simple_discovery_uri_prefix="http://"
--appc_store_dir="/tmp/Endpoint_SlaveEndpointTest_NoAuthorizer_0_Ild3qq/store/appc" --authenticate_http_readonly="true"
--authenticate_http_readwrite="true" --authenticatee="crammd5" --authentication_backoff_factor="1secs"
--authorizer="local" --cgroups_cpu_enable_pids_and_tids_count="false" --cgroups_enable_cfs="false"
--cgroups_hierarchy="/sys/fs/cgroup" --cgroups_limit_swap="false" --cgroups_root="mesos" --container_disk_watch_interval="15secs"
--containerizers="mesos" --credential="/tmp/Endpoint_SlaveEndpointTest_NoAuthorizer_0_Ild3qq/credential"
--default_role="*" --disallow_sharing_agent_pid_namespace="false" --disk_watch_interval="1mins"
--docker="docker" --docker_kill_orphans="true" --docker_registry="https://registry-1.docker.io"
--docker_remove_delay="6hrs" --docker_socket="/var/run/docker.sock" --docker_stop_timeout="0ns"
--docker_store_dir="/tmp/Endpoint_SlaveEndpointTest_NoAuthorizer_0_Ild3qq/store/docker" --docker_volume_checkpoint_dir="/var/run/mesos/isolators/docker/volume"
--enforce_container_disk_quota="false" --executor_registration_timeout="1mins" --executor_reregistration_timeout="2secs"
--executor_shutdown_grace_period="5secs" --fetcher_cache_dir="/tmp/Endpoint_SlaveEndpointTest_NoAuthorizer_0_Ild3qq/fetch"
--fetcher_cache_size="2GB" --frameworks_home="" --gc_delay="1weeks" --gc_disk_headroom="0.1"
--hadoop_home="" --help="false" --hostname_lookup="true" --http_command_executor="false" --http_credentials="/tmp/Endpoint_SlaveEndpointTest_NoAuthorizer_0_Ild3qq/http_credentials"
--http_heartbeat_interval="30secs" --initialize_driver_logging="true" --isolation="posix/cpu,posix/mem"
--launcher="posix" --launcher_dir="/mesos/mesos-1.5.0/_build/src" --logbufsecs="0" --logging_level="INFO"
--max_completed_executors_per_framework="150" --oversubscribed_resources_interval="15secs"
--perf_duration="10secs" --perf_interval="1mins" --port="5051" --qos_correction_interval_min="0ns"
--quiet="false" --recover="reconnect" --recovery_timeout="15mins" --registration_backoff_factor="10ms"
--resources="cpus:2;gpus:0;mem:1024;disk:1024;ports:[31000-32000]" --revocable_cpu_low_priority="true"
--runtime_dir="/tmp/Endpoint_SlaveEndpointTest_NoAuthorizer_0_Ild3qq" --sandbox_directory="/mnt/mesos/sandbox"
--strict="true" --switch_user="true" --systemd_enable_support="true" --systemd_runtime_directory="/run/systemd/system"
--version="false" --work_dir="/tmp/Endpoint_SlaveEndpointTest_NoAuthorizer_0_c3YSK6"
I0825 05:53:40.614310  6718 credentials.hpp:86] Loading credential for authentication from
'/tmp/Endpoint_SlaveEndpointTest_NoAuthorizer_0_Ild3qq/credential'
I0825 05:53:40.614509  6718 slave.cpp:285] Agent using credential for: test-principal
I0825 05:53:40.614533  6718 credentials.hpp:37] Loading credentials for authentication from
'/tmp/Endpoint_SlaveEndpointTest_NoAuthorizer_0_Ild3qq/http_credentials'
I0825 05:53:40.614858  6718 http.cpp:1026] Creating default 'basic' HTTP authenticator for
realm 'mesos-agent-readonly'
I0825 05:53:40.615119  6718 http.cpp:1026] Creating default 'basic' HTTP authenticator for
realm 'mesos-agent-readwrite'
I0825 05:53:40.617338  6718 slave.cpp:581] Agent resources: [{"name":"cpus","scalar":{"value":2.0},"type":"SCALAR"},{"name":"mem","scalar":{"value":1024.0},"type":"SCALAR"},{"name":"disk","scalar":{"value":1024.0},"type":"SCALAR"},{"name":"ports","ranges":{"range":[{"begin":31000,"end":32000}]},"type":"RANGES"}]
I0825 05:53:40.617743  6718 slave.cpp:589] Agent attributes: [  ]
I0825 05:53:40.617764  6718 slave.cpp:598] Agent hostname: 88fefbed62c5
I0825 05:53:40.617974  6713 status_update_manager.cpp:177] Pausing sending status updates
I0825 05:53:40.619916  6730 state.cpp:64] Recovering state from '/tmp/Endpoint_SlaveEndpointTest_NoAuthorizer_0_c3YSK6/meta'
I0825 05:53:40.620268  6730 status_update_manager.cpp:203] Recovering status update manager
I0825 05:53:40.620498  6710 containerizer.cpp:643] Recovering containerizer
I0825 05:53:40.622263  6713 provisioner.cpp:416] Provisioner recovery complete
I0825 05:53:40.622763  6712 slave.cpp:6264] Finished recovery
I0825 05:53:40.623179  6712 slave.cpp:6446] Querying resource estimator for oversubscribable
resources
I0825 05:53:40.623386  6720 slave.cpp:6460] Received oversubscribable resources {} from the
resource estimator
I0825 05:53:40.625892  6724 process.cpp:3933] Handling HTTP event for process 'slave(803)'
with path: '/slave(803)/monitor/statistics'
I0825 05:53:40.627326  6728 http.cpp:1166] HTTP GET for /slave(803)/monitor/statistics from
172.17.0.3:56360
I0825 05:53:40.627395  6728 http.cpp:957] Authorizing principal 'test-principal' to GET the
'/monitor/statistics' endpoint
I0825 05:53:40.630611  6730 slave.cpp:859] Agent terminating
[       OK ] Endpoint/SlaveEndpointTest.NoAuthorizer/0 (32 ms)
[ RUN      ] Endpoint/SlaveEndpointTest.NoAuthorizer/1
I0825 05:53:40.642043  6690 containerizer.cpp:288] Using isolation { environment_secret, posix/cpu,
posix/mem, filesystem/posix, network/cni }
W0825 05:53:40.642523  6690 backend.cpp:76] Failed to create 'aufs' backend: AufsBackend requires
root privileges
W0825 05:53:40.642659  6690 backend.cpp:76] Failed to create 'bind' backend: BindBackend requires
root privileges
I0825 05:53:40.642693  6690 provisioner.cpp:255] Using default backend 'copy'
I0825 05:53:40.644361  6690 cluster.cpp:448] Creating default 'local' authorizer
I0825 05:53:40.646265  6713 slave.cpp:252] Mesos agent started on (804)@172.17.0.3:36008
I0825 05:53:40.646298  6713 slave.cpp:253] Flags at startup: --acls="" --appc_simple_discovery_uri_prefix="http://"
--appc_store_dir="/tmp/Endpoint_SlaveEndpointTest_NoAuthorizer_1_EvbzqH/store/appc" --authenticate_http_readonly="true"
--authenticate_http_readwrite="true" --authenticatee="crammd5" --authentication_backoff_factor="1secs"
--authorizer="local" --cgroups_cpu_enable_pids_and_tids_count="false" --cgroups_enable_cfs="false"
--cgroups_hierarchy="/sys/fs/cgroup" --cgroups_limit_swap="false" --cgroups_root="mesos" --container_disk_watch_interval="15secs"
--containerizers="mesos" --credential="/tmp/Endpoint_SlaveEndpointTest_NoAuthorizer_1_EvbzqH/credential"
--default_role="*" --disallow_sharing_agent_pid_namespace="false" --disk_watch_interval="1mins"
--docker="docker" --docker_kill_orphans="true" --docker_registry="https://registry-1.docker.io"
--docker_remove_delay="6hrs" --docker_socket="/var/run/docker.sock" --docker_stop_timeout="0ns"
--docker_store_dir="/tmp/Endpoint_SlaveEndpointTest_NoAuthorizer_1_EvbzqH/store/docker" --docker_volume_checkpoint_dir="/var/run/mesos/isolators/docker/volume"
--enforce_container_disk_quota="false" --executor_registration_timeout="1mins" --executor_reregistration_timeout="2secs"
--executor_shutdown_grace_period="5secs" --fetcher_cache_dir="/tmp/Endpoint_SlaveEndpointTest_NoAuthorizer_1_EvbzqH/fetch"
--fetcher_cache_size="2GB" --frameworks_home="" --gc_delay="1weeks" --gc_disk_headroom="0.1"
--hadoop_home="" --help="false" --hostname_lookup="true" --http_command_executor="false" --http_credentials="/tmp/Endpoint_SlaveEndpointTest_NoAuthorizer_1_EvbzqH/http_credentials"
--http_heartbeat_interval="30secs" --initialize_driver_logging="true" --isolation="posix/cpu,posix/mem"
--launcher="posix" --launcher_dir="/mesos/mesos-1.5.0/_build/src" --logbufsecs="0" --logging_level="INFO"
--max_completed_executors_per_framework="150" --oversubscribed_resources_interval="15secs"
--perf_duration="10secs" --perf_interval="1mins" --port="5051" --qos_correction_interval_min="0ns"
--quiet="false" --recover="reconnect" --recovery_timeout="15mins" --registration_backoff_factor="10ms"
--resources="cpus:2;gpus:0;mem:1024;disk:1024;ports:[31000-32000]" --revocable_cpu_low_priority="true"
--runtime_dir="/tmp/Endpoint_SlaveEndpointTest_NoAuthorizer_1_EvbzqH" --sandbox_directory="/mnt/mesos/sandbox"
--strict="true" --switch_user="true" --systemd_enable_support="true" --systemd_runtime_directory="/run/systemd/system"
--version="false" --work_dir="/tmp/Endpoint_SlaveEndpointTest_NoAuthorizer_1_o55vFn"
I0825 05:53:40.646667  6713 credentials.hpp:86] Loading credential for authentication from
'/tmp/Endpoint_SlaveEndpointTest_NoAuthorizer_1_EvbzqH/credential'
I0825 05:53:40.646824  6713 slave.cpp:285] Agent using credential for: test-principal
I0825 05:53:40.646848  6713 credentials.hpp:37] Loading credentials for authentication from
'/tmp/Endpoint_SlaveEndpointTest_NoAuthorizer_1_EvbzqH/http_credentials'
I0825 05:53:40.647079  6713 http.cpp:1026] Creating default 'basic' HTTP authenticator for
realm 'mesos-agent-readonly'
I0825 05:53:40.647231  6713 http.cpp:1026] Creating default 'basic' HTTP authenticator for
realm 'mesos-agent-readwrite'
I0825 05:53:40.648542  6713 slave.cpp:581] Agent resources: [{"name":"cpus","scalar":{"value":2.0},"type":"SCALAR"},{"name":"mem","scalar":{"value":1024.0},"type":"SCALAR"},{"name":"disk","scalar":{"value":1024.0},"type":"SCALAR"},{"name":"ports","ranges":{"range":[{"begin":31000,"end":32000}]},"type":"RANGES"}]
I0825 05:53:40.648923  6713 slave.cpp:589] Agent attributes: [  ]
I0825 05:53:40.648955  6713 slave.cpp:598] Agent hostname: 88fefbed62c5
I0825 05:53:40.649081  6710 status_update_manager.cpp:177] Pausing sending status updates
I0825 05:53:40.650995  6721 state.cpp:64] Recovering state from '/tmp/Endpoint_SlaveEndpointTest_NoAuthorizer_1_o55vFn/meta'
I0825 05:53:40.651450  6732 status_update_manager.cpp:203] Recovering status update manager
I0825 05:53:40.651633  6732 containerizer.cpp:643] Recovering containerizer
I0825 05:53:40.653673  6716 provisioner.cpp:416] Provisioner recovery complete
I0825 05:53:40.654214  6713 slave.cpp:6264] Finished recovery
I0825 05:53:40.654613  6713 slave.cpp:6446] Querying resource estimator for oversubscribable
resources
I0825 05:53:40.654862  6732 slave.cpp:6460] Received oversubscribable resources {} from the
resource estimator
I0825 05:53:40.657222  6729 process.cpp:3933] Handling HTTP event for process 'slave(804)'
with path: '/slave(804)/monitor/statistics.json'
I0825 05:53:40.658639  6727 http.cpp:1166] HTTP GET for /slave(804)/monitor/statistics.json
from 172.17.0.3:56362
I0825 05:53:40.658709  6727 http.cpp:957] Authorizing principal 'test-principal' to GET the
'/monitor/statistics.json' endpoint
I0825 05:53:40.662923  6729 slave.cpp:859] Agent terminating
[       OK ] Endpoint/SlaveEndpointTest.NoAuthorizer/1 (33 ms)
[ RUN      ] Endpoint/SlaveEndpointTest.NoAuthorizer/2
I0825 05:53:40.675462  6690 containerizer.cpp:288] Using isolation { environment_secret, posix/cpu,
posix/mem, filesystem/posix, network/cni }
W0825 05:53:40.675904  6690 backend.cpp:76] Failed to create 'aufs' backend: AufsBackend requires
root privileges
W0825 05:53:40.676007  6690 backend.cpp:76] Failed to create 'bind' backend: BindBackend requires
root privileges
I0825 05:53:40.676036  6690 provisioner.cpp:255] Using default backend 'copy'
I0825 05:53:40.677711  6690 cluster.cpp:448] Creating default 'local' authorizer
I0825 05:53:40.679739  6710 slave.cpp:252] Mesos agent started on (805)@172.17.0.3:36008
I0825 05:53:40.679764  6710 slave.cpp:253] Flags at startup: --acls="" --appc_simple_discovery_uri_prefix="http://"
--appc_store_dir="/tmp/Endpoint_SlaveEndpointTest_NoAuthorizer_2_GSiGJY/store/appc" --authenticate_http_readonly="true"
--authenticate_http_readwrite="true" --authenticatee="crammd5" --authentication_backoff_factor="1secs"
--authorizer="local" --cgroups_cpu_enable_pids_and_tids_count="false" --cgroups_enable_cfs="false"
--cgroups_hierarchy="/sys/fs/cgroup" --cgroups_limit_swap="false" --cgroups_root="mesos" --container_disk_watch_interval="15secs"
--containerizers="mesos" --credential="/tmp/Endpoint_SlaveEndpointTest_NoAuthorizer_2_GSiGJY/credential"
--default_role="*" --disallow_sharing_agent_pid_namespace="false" --disk_watch_interval="1mins"
--docker="docker" --docker_kill_orphans="true" --docker_registry="https://registry-1.docker.io"
--docker_remove_delay="6hrs" --docker_socket="/var/run/docker.sock" --docker_stop_timeout="0ns"
--docker_store_dir="/tmp/Endpoint_SlaveEndpointTest_NoAuthorizer_2_GSiGJY/store/docker" --docker_volume_checkpoint_dir="/var/run/mesos/isolators/docker/volume"
--enforce_container_disk_quota="false" --executor_registration_timeout="1mins" --executor_reregistration_timeout="2secs"
--executor_shutdown_grace_period="5secs" --fetcher_cache_dir="/tmp/Endpoint_SlaveEndpointTest_NoAuthorizer_2_GSiGJY/fetch"
--fetcher_cache_size="2GB" --frameworks_home="" --gc_delay="1weeks" --gc_disk_headroom="0.1"
--hadoop_home="" --help="false" --hostname_lookup="true" --http_command_executor="false" --http_credentials="/tmp/Endpoint_SlaveEndpointTest_NoAuthorizer_2_GSiGJY/http_credentials"
--http_heartbeat_interval="30secs" --initialize_driver_logging="true" --isolation="posix/cpu,posix/mem"
--launcher="posix" --launcher_dir="/mesos/mesos-1.5.0/_build/src" --logbufsecs="0" --logging_level="INFO"
--max_completed_executors_per_framework="150" --oversubscribed_resources_interval="15secs"
--perf_duration="10secs" --perf_interval="1mins" --port="5051" --qos_correction_interval_min="0ns"
--quiet="false" --recover="reconnect" --recovery_timeout="15mins" --registration_backoff_factor="10ms"
--resources="cpus:2;gpus:0;mem:1024;disk:1024;ports:[31000-32000]" --revocable_cpu_low_priority="true"
--runtime_dir="/tmp/Endpoint_SlaveEndpointTest_NoAuthorizer_2_GSiGJY" --sandbox_directory="/mnt/mesos/sandbox"
--strict="true" --switch_user="true" --systemd_enable_support="true" --systemd_runtime_directory="/run/systemd/system"
--version="false" --work_dir="/tmp/Endpoint_SlaveEndpointTest_NoAuthorizer_2_IUQETE"
I0825 05:53:40.680130  6710 credentials.hpp:86] Loading credential for authentication from
'/tmp/Endpoint_SlaveEndpointTest_NoAuthorizer_2_GSiGJY/credential'
I0825 05:53:40.680279  6710 slave.cpp:285] Agent using credential for: test-principal
I0825 05:53:40.680300  6710 credentials.hpp:37] Loading credentials for authentication from
'/tmp/Endpoint_SlaveEndpointTest_NoAuthorizer_2_GSiGJY/http_credentials'
I0825 05:53:40.680526  6710 http.cpp:1026] Creating default 'basic' HTTP authenticator for
realm 'mesos-agent-readonly'
I0825 05:53:40.680699  6710 http.cpp:1026] Creating default 'basic' HTTP authenticator for
realm 'mesos-agent-readwrite'
I0825 05:53:40.681995  6710 slave.cpp:581] Agent resources: [{"name":"cpus","scalar":{"value":2.0},"type":"SCALAR"},{"name":"mem","scalar":{"value":1024.0},"type":"SCALAR"},{"name":"disk","scalar":{"value":1024.0},"type":"SCALAR"},{"name":"ports","ranges":{"range":[{"begin":31000,"end":32000}]},"type":"RANGES"}]
I0825 05:53:40.682217  6710 slave.cpp:589] Agent attributes: [  ]
I0825 05:53:40.682232  6710 slave.cpp:598] Agent hostname: 88fefbed62c5
I0825 05:53:40.682462  6715 status_update_manager.cpp:177] Pausing sending status updates
I0825 05:53:40.683729  6726 state.cpp:64] Recovering state from '/tmp/Endpoint_SlaveEndpointTest_NoAuthorizer_2_IUQETE/meta'
I0825 05:53:40.684134  6720 status_update_manager.cpp:203] Recovering status update manager
I0825 05:53:40.684423  6712 containerizer.cpp:643] Recovering containerizer
I0825 05:53:40.686336  6717 provisioner.cpp:416] Provisioner recovery complete
I0825 05:53:40.686774  6717 slave.cpp:6264] Finished recovery
I0825 05:53:40.687244  6717 slave.cpp:6446] Querying resource estimator for oversubscribable
resources
I0825 05:53:40.687481  6719 slave.cpp:6460] Received oversubscribable resources {} from the
resource estimator
I0825 05:53:40.690070  6724 process.cpp:3933] Handling HTTP event for process 'slave(805)'
with path: '/slave(805)/containers'
I0825 05:53:40.691689  6721 http.cpp:1166] HTTP GET for /slave(805)/containers from 172.17.0.3:56364
I0825 05:53:40.691807  6721 http.cpp:957] Authorizing principal 'test-principal' to GET the
'/containers' endpoint
I0825 05:53:40.696174  6729 slave.cpp:859] Agent terminating
[       OK ] Endpoint/SlaveEndpointTest.NoAuthorizer/2 (36 ms)
[----------] 9 tests from Endpoint/SlaveEndpointTest (318 ms total)

[----------] 2 tests from ContainerizerType/DefaultContainerDNSFlagTest
[ RUN      ] ContainerizerType/DefaultContainerDNSFlagTest.ValidateFlag/0
[       OK ] ContainerizerType/DefaultContainerDNSFlagTest.ValidateFlag/0 (17 ms)
[ RUN      ] ContainerizerType/DefaultContainerDNSFlagTest.ValidateFlag/1
[       OK ] ContainerizerType/DefaultContainerDNSFlagTest.ValidateFlag/1 (15 ms)
[----------] 2 tests from ContainerizerType/DefaultContainerDNSFlagTest (32 ms total)

[----------] Global test environment tear-down
[==========] 1657 tests from 182 test cases ran. (512941 ms total)
[  PASSED  ] 1655 tests.
[  FAILED  ] 2 tests, listed below:
[  FAILED  ] ExamplesTest.TestFramework
[  FAILED  ] ExamplesTest.PersistentVolumeFramework

 2 FAILED TESTS
  YOU HAVE 20 DISABLED TESTS

I0825 05:53:40.828799  6733 process.cpp:1072] Failed to accept socket: future discarded
make[4]: *** [check-local] Error 1
make[4]: Leaving directory `/mesos/mesos-1.5.0/_build/src'
make[3]: *** [check-am] Error 2
make[3]: Leaving directory `/mesos/mesos-1.5.0/_build/src'
make[2]: *** [check] Error 2
make[2]: Leaving directory `/mesos/mesos-1.5.0/_build/src'
make[1]: *** [check-recursive] Error 1
make[1]: Leaving directory `/mesos/mesos-1.5.0/_build'
make: *** [distcheck] Error 1
+ docker rmi mesos-1503637924-8027
Untagged: mesos-1503637924-8027:latest
Deleted: sha256:088843091ed1d6a9614b8076f7256a4ff41b260d926a307da845a34e04c53d08
Deleted: sha256:ce7b269d0558a89986796e50ef7a081f9e92224e12d30160f78d23523deb3886
Deleted: sha256:76e64e4014bb072f6882e731e53d56baff354c031df7840c569994b65e6b5d3b
Deleted: sha256:5e085e845eead1fe8e323f33a253463e5ee4adab1c42628644579e055679dd57
Deleted: sha256:f8485e9de08cf384972d3e5c2ee72b861e118f4adcf1c3f73d25703dc05127d2
Deleted: sha256:1b91fd877bafe8f152a2c44e493a37befe1773bb5835262eba60b4d629eef22d
Deleted: sha256:c6b77711793a0310515983524df91e87ab7e7c2e62b89d0351327de47fec6675
Deleted: sha256:23dd544326241cf92c44c00e4326e6342c15dbdef41a60e3b948c71fa38c0ffd
Deleted: sha256:46a77794dd943a7bd04806026424bda2228d0587f2db1714ce08ec19dc0002eb
Deleted: sha256:ae92c253317e0105697f6d7b8f286a4806f876259af2f447985d0172a34b07db
Deleted: sha256:3e6c91413ecc32d50dc26897fb242d887c136da684b58bc9e643a75f1fbdfec4
Deleted: sha256:4982a2ef20c5f00c2d188de93cfc9be5ec65d19dc41082be689bd893885873ad
Deleted: sha256:32974960a84422ac705192e05d4a04e35a2d42e62f2d6fc49b6d0a07f6bc55f0
Deleted: sha256:9dc837a8b7b1aa2713804a2aaa3039a51b0a32eb6d305592b514e30cb002ba85
Deleted: sha256:013dbee339e5970862c229ddb31258369770cead2b3ae5dc1560dbfd030b9d6c
Deleted: sha256:cf287147bc4c937342d58c8beeb386123a2173024faaa022477f0d5086a26af4
Deleted: sha256:ca8a2f3ceb70abe788b3a6b4db9b113411abcd1148713297f41f44c406a45ab8
Deleted: sha256:1f8cb2fc78692e8f393a78d1d04a4d99965db024fd42aa6caf4342e0dedb2b3d
Deleted: sha256:774a439ba559a19ec7d557e317bc20b487aab8e51f990a135c8ce006765a42e3
Deleted: sha256:7aa5bb8188fa0d20c0b75fe338d14587c264d7fa2fc9864607b42e72dc38242b
Deleted: sha256:54fc8e74a166c5d767aaf546e615492a852433b261f9e9a3f437a202eacc2133
Deleted: sha256:56c90b8c45aa484cdd275851253a29a6ff7fb52e84b10557c96683bc6b62fadf
Deleted: sha256:8c19d8c1599aa6d605537b4b256f911bbe2f213b46c17fb9ea5b4ffbd8f5334e
Deleted: sha256:e3480522971ef06b03fe098655884a8ce9440b2618a8170ec3bbc977c5e0cd22
Deleted: sha256:0d389b80b9fe6877263a8c3c64458d40dd830114152008fcb87af713b4220b23
Build step 'Execute shell' marked build as failure
Not sending mail to unregistered user yujie.jay@gmail.com
Not sending mail to unregistered user xujyan@apple.com

Mime
View raw message