mesos-builds mailing list archives

Site index · List index
Message view « Date » · « Thread »
Top « Date » · « Thread »
From Apache Jenkins Server <jenk...@builds.apache.org>
Subject Build failed in Jenkins: Mesos-Buildbot » autotools,gcc,--verbose,GLOG_v=1 MESOS_VERBOSE=1,centos:7,(ubuntu)&&(!ubuntu-us1)&&(!ubuntu-eu2) #4115
Date Wed, 16 Aug 2017 00:03:14 GMT
See <https://builds.apache.org/job/Mesos-Buildbot/BUILDTOOL=autotools,COMPILER=gcc,CONFIGURATION=--verbose,ENVIRONMENT=GLOG_v=1%20MESOS_VERBOSE=1,OS=centos%3A7,label_exp=(ubuntu)&&(!ubuntu-us1)&&(!ubuntu-eu2)/4115/display/redirect>

------------------------------------------
[...truncated 30.89 MB...]
I0816 00:02:56.199002  6122 http.cpp:1026] Creating default 'basic' HTTP authenticator for
realm 'mesos-agent-readwrite'
I0816 00:02:56.201370  6122 slave.cpp:565] Agent resources: [{"name":"cpus","scalar":{"value":2.0},"type":"SCALAR"},{"name":"mem","scalar":{"value":1024.0},"type":"SCALAR"},{"name":"disk","scalar":{"value":1024.0},"type":"SCALAR"},{"name":"ports","ranges":{"range":[{"begin":31000,"end":32000}]},"type":"RANGES"}]
I0816 00:02:56.201864  6122 slave.cpp:573] Agent attributes: [  ]
I0816 00:02:56.201908  6122 slave.cpp:582] Agent hostname: 44b3641af516
I0816 00:02:56.202412  6120 status_update_manager.cpp:177] Pausing sending status updates
I0816 00:02:56.204751  6116 state.cpp:64] Recovering state from '/tmp/Endpoint_SlaveEndpointTest_AuthorizedRequest_2_Sbf8Ri/meta'
I0816 00:02:56.205816  6121 status_update_manager.cpp:203] Recovering status update manager
I0816 00:02:56.206102  6122 containerizer.cpp:598] Recovering containerizer
I0816 00:02:56.208350  6121 provisioner.cpp:416] Provisioner recovery complete
I0816 00:02:56.208842  6120 slave.cpp:6210] Finished recovery
I0816 00:02:56.209486  6120 slave.cpp:6392] Querying resource estimator for oversubscribable
resources
I0816 00:02:56.209861  6116 slave.cpp:6406] Received oversubscribable resources {} from the
resource estimator
I0816 00:02:56.214249  6122 process.cpp:3933] Handling HTTP event for process 'slave(796)'
with path: '/slave(796)/containers'
I0816 00:02:56.216694  6116 http.cpp:1166] HTTP GET for /slave(796)/containers from 172.17.0.2:39614
I0816 00:02:56.216859  6116 http.cpp:957] Authorizing principal 'test-principal' to GET the
'/containers' endpoint
I0816 00:02:56.223645  6116 slave.cpp:843] Agent terminating
[       OK ] Endpoint/SlaveEndpointTest.AuthorizedRequest/2 (53 ms)
[ RUN      ] Endpoint/SlaveEndpointTest.UnauthorizedRequest/0
I0816 00:02:56.241660  6096 containerizer.cpp:246] Using isolation: posix/cpu,posix/mem,filesystem/posix,network/cni,environment_secret
W0816 00:02:56.242621  6096 backend.cpp:76] Failed to create 'overlay' backend: OverlayBackend
requires root privileges
W0816 00:02:56.242940  6096 backend.cpp:76] Failed to create 'bind' backend: BindBackend requires
root privileges
I0816 00:02:56.242992  6096 provisioner.cpp:255] Using default backend 'copy'
I0816 00:02:56.249020  6119 slave.cpp:250] Mesos agent started on (797)@172.17.0.2:36953
I0816 00:02:56.249064  6119 slave.cpp:251] Flags at startup: --acls="" --appc_simple_discovery_uri_prefix="http://"
--appc_store_dir="/tmp/Endpoint_SlaveEndpointTest_UnauthorizedRequest_0_ccslFo/store/appc"
--authenticate_http_readonly="true" --authenticate_http_readwrite="true" --authenticatee="crammd5"
--authentication_backoff_factor="1secs" --authorizer="local" --cgroups_cpu_enable_pids_and_tids_count="false"
--cgroups_enable_cfs="false" --cgroups_hierarchy="/sys/fs/cgroup" --cgroups_limit_swap="false"
--cgroups_root="mesos" --container_disk_watch_interval="15secs" --containerizers="mesos" --credential="/tmp/Endpoint_SlaveEndpointTest_UnauthorizedRequest_0_ccslFo/credential"
--default_role="*" --disallow_sharing_agent_pid_namespace="false" --disk_watch_interval="1mins"
--docker="docker" --docker_kill_orphans="true" --docker_registry="https://registry-1.docker.io"
--docker_remove_delay="6hrs" --docker_socket="/var/run/docker.sock" --docker_stop_timeout="0ns"
--docker_store_dir="/tmp/Endpoint_SlaveEndpointTest_UnauthorizedRequest_0_ccslFo/store/docker"
--docker_volume_checkpoint_dir="/var/run/mesos/isolators/docker/volume" --enforce_container_disk_quota="false"
--executor_registration_timeout="1mins" --executor_reregistration_timeout="2secs" --executor_shutdown_grace_period="5secs"
--fetcher_cache_dir="/tmp/Endpoint_SlaveEndpointTest_UnauthorizedRequest_0_ccslFo/fetch" --fetcher_cache_size="2GB"
--frameworks_home="" --gc_delay="1weeks" --gc_disk_headroom="0.1" --hadoop_home="" --help="false"
--hostname_lookup="true" --http_command_executor="false" --http_credentials="/tmp/Endpoint_SlaveEndpointTest_UnauthorizedRequest_0_ccslFo/http_credentials"
--http_heartbeat_interval="30secs" --initialize_driver_logging="true" --isolation="posix/cpu,posix/mem"
--launcher="posix" --launcher_dir="/mesos/mesos-1.4.0/_build/src" --logbufsecs="0" --logging_level="INFO"
--max_completed_executors_per_framework="150" --oversubscribed_resources_interval="15secs"
--perf_duration="10secs" --perf_interval="1mins" --port="5051" --qos_correction_interval_min="0ns"
--quiet="false" --recover="reconnect" --recovery_timeout="15mins" --registration_backoff_factor="10ms"
--resources="cpus:2;gpus:0;mem:1024;disk:1024;ports:[31000-32000]" --revocable_cpu_low_priority="true"
--runtime_dir="/tmp/Endpoint_SlaveEndpointTest_UnauthorizedRequest_0_ccslFo" --sandbox_directory="/mnt/mesos/sandbox"
--strict="true" --switch_user="true" --systemd_enable_support="true" --systemd_runtime_directory="/run/systemd/system"
--version="false" --work_dir="/tmp/Endpoint_SlaveEndpointTest_UnauthorizedRequest_0_swsbFY"
I0816 00:02:56.249812  6119 credentials.hpp:86] Loading credential for authentication from
'/tmp/Endpoint_SlaveEndpointTest_UnauthorizedRequest_0_ccslFo/credential'
I0816 00:02:56.250064  6119 slave.cpp:283] Agent using credential for: test-principal
I0816 00:02:56.250089  6119 credentials.hpp:37] Loading credentials for authentication from
'/tmp/Endpoint_SlaveEndpointTest_UnauthorizedRequest_0_ccslFo/http_credentials'
I0816 00:02:56.250449  6119 http.cpp:1026] Creating default 'basic' HTTP authenticator for
realm 'mesos-agent-readonly'
I0816 00:02:56.250730  6119 http.cpp:1026] Creating default 'basic' HTTP authenticator for
realm 'mesos-agent-readwrite'
I0816 00:02:56.252981  6119 slave.cpp:565] Agent resources: [{"name":"cpus","scalar":{"value":2.0},"type":"SCALAR"},{"name":"mem","scalar":{"value":1024.0},"type":"SCALAR"},{"name":"disk","scalar":{"value":1024.0},"type":"SCALAR"},{"name":"ports","ranges":{"range":[{"begin":31000,"end":32000}]},"type":"RANGES"}]
I0816 00:02:56.253422  6119 slave.cpp:573] Agent attributes: [  ]
I0816 00:02:56.253448  6119 slave.cpp:582] Agent hostname: 44b3641af516
I0816 00:02:56.253662  6120 status_update_manager.cpp:177] Pausing sending status updates
I0816 00:02:56.255990  6122 state.cpp:64] Recovering state from '/tmp/Endpoint_SlaveEndpointTest_UnauthorizedRequest_0_swsbFY/meta'
I0816 00:02:56.256434  6118 status_update_manager.cpp:203] Recovering status update manager
I0816 00:02:56.256826  6119 containerizer.cpp:598] Recovering containerizer
I0816 00:02:56.259110  6119 provisioner.cpp:416] Provisioner recovery complete
I0816 00:02:56.259773  6119 slave.cpp:6210] Finished recovery
I0816 00:02:56.260397  6119 slave.cpp:6392] Querying resource estimator for oversubscribable
resources
I0816 00:02:56.260752  6120 slave.cpp:6406] Received oversubscribable resources {} from the
resource estimator
I0816 00:02:56.264945  6120 process.cpp:3933] Handling HTTP event for process 'slave(797)'
with path: '/slave(797)/monitor/statistics'
I0816 00:02:56.266821  6116 http.cpp:1166] HTTP GET for /slave(797)/monitor/statistics from
172.17.0.2:39616
I0816 00:02:56.266945  6116 http.cpp:957] Authorizing principal 'test-principal' to GET the
'/monitor/statistics' endpoint
I0816 00:02:56.270773  6096 slave.cpp:843] Agent terminating
[       OK ] Endpoint/SlaveEndpointTest.UnauthorizedRequest/0 (52 ms)
[ RUN      ] Endpoint/SlaveEndpointTest.UnauthorizedRequest/1
I0816 00:02:56.295236  6096 containerizer.cpp:246] Using isolation: posix/cpu,posix/mem,filesystem/posix,network/cni,environment_secret
W0816 00:02:56.296252  6096 backend.cpp:76] Failed to create 'overlay' backend: OverlayBackend
requires root privileges
W0816 00:02:56.296663  6096 backend.cpp:76] Failed to create 'bind' backend: BindBackend requires
root privileges
I0816 00:02:56.296717  6096 provisioner.cpp:255] Using default backend 'copy'
I0816 00:02:56.303068  6121 slave.cpp:250] Mesos agent started on (798)@172.17.0.2:36953
I0816 00:02:56.303148  6121 slave.cpp:251] Flags at startup: --acls="" --appc_simple_discovery_uri_prefix="http://"
--appc_store_dir="/tmp/Endpoint_SlaveEndpointTest_UnauthorizedRequest_1_OFv784/store/appc"
--authenticate_http_readonly="true" --authenticate_http_readwrite="true" --authenticatee="crammd5"
--authentication_backoff_factor="1secs" --authorizer="local" --cgroups_cpu_enable_pids_and_tids_count="false"
--cgroups_enable_cfs="false" --cgroups_hierarchy="/sys/fs/cgroup" --cgroups_limit_swap="false"
--cgroups_root="mesos" --container_disk_watch_interval="15secs" --containerizers="mesos" --credential="/tmp/Endpoint_SlaveEndpointTest_UnauthorizedRequest_1_OFv784/credential"
--default_role="*" --disallow_sharing_agent_pid_namespace="false" --disk_watch_interval="1mins"
--docker="docker" --docker_kill_orphans="true" --docker_registry="https://registry-1.docker.io"
--docker_remove_delay="6hrs" --docker_socket="/var/run/docker.sock" --docker_stop_timeout="0ns"
--docker_store_dir="/tmp/Endpoint_SlaveEndpointTest_UnauthorizedRequest_1_OFv784/store/docker"
--docker_volume_checkpoint_dir="/var/run/mesos/isolators/docker/volume" --enforce_container_disk_quota="false"
--executor_registration_timeout="1mins" --executor_reregistration_timeout="2secs" --executor_shutdown_grace_period="5secs"
--fetcher_cache_dir="/tmp/Endpoint_SlaveEndpointTest_UnauthorizedRequest_1_OFv784/fetch" --fetcher_cache_size="2GB"
--frameworks_home="" --gc_delay="1weeks" --gc_disk_headroom="0.1" --hadoop_home="" --help="false"
--hostname_lookup="true" --http_command_executor="false" --http_credentials="/tmp/Endpoint_SlaveEndpointTest_UnauthorizedRequest_1_OFv784/http_credentials"
--http_heartbeat_interval="30secs" --initialize_driver_logging="true" --isolation="posix/cpu,posix/mem"
--launcher="posix" --launcher_dir="/mesos/mesos-1.4.0/_build/src" --logbufsecs="0" --logging_level="INFO"
--max_completed_executors_per_framework="150" --oversubscribed_resources_interval="15secs"
--perf_duration="10secs" --perf_interval="1mins" --port="5051" --qos_correction_interval_min="0ns"
--quiet="false" --recover="reconnect" --recovery_timeout="15mins" --registration_backoff_factor="10ms"
--resources="cpus:2;gpus:0;mem:1024;disk:1024;ports:[31000-32000]" --revocable_cpu_low_priority="true"
--runtime_dir="/tmp/Endpoint_SlaveEndpointTest_UnauthorizedRequest_1_OFv784" --sandbox_directory="/mnt/mesos/sandbox"
--strict="true" --switch_user="true" --systemd_enable_support="true" --systemd_runtime_directory="/run/systemd/system"
--version="false" --work_dir="/tmp/Endpoint_SlaveEndpointTest_UnauthorizedRequest_1_EoBj0E"
I0816 00:02:56.303946  6121 credentials.hpp:86] Loading credential for authentication from
'/tmp/Endpoint_SlaveEndpointTest_UnauthorizedRequest_1_OFv784/credential'
I0816 00:02:56.304229  6121 slave.cpp:283] Agent using credential for: test-principal
I0816 00:02:56.304283  6121 credentials.hpp:37] Loading credentials for authentication from
'/tmp/Endpoint_SlaveEndpointTest_UnauthorizedRequest_1_OFv784/http_credentials'
I0816 00:02:56.304668  6121 http.cpp:1026] Creating default 'basic' HTTP authenticator for
realm 'mesos-agent-readonly'
I0816 00:02:56.304988  6121 http.cpp:1026] Creating default 'basic' HTTP authenticator for
realm 'mesos-agent-readwrite'
I0816 00:02:56.307236  6121 slave.cpp:565] Agent resources: [{"name":"cpus","scalar":{"value":2.0},"type":"SCALAR"},{"name":"mem","scalar":{"value":1024.0},"type":"SCALAR"},{"name":"disk","scalar":{"value":1024.0},"type":"SCALAR"},{"name":"ports","ranges":{"range":[{"begin":31000,"end":32000}]},"type":"RANGES"}]
I0816 00:02:56.307749  6121 slave.cpp:573] Agent attributes: [  ]
I0816 00:02:56.307796  6121 slave.cpp:582] Agent hostname: 44b3641af516
I0816 00:02:56.308106  6122 status_update_manager.cpp:177] Pausing sending status updates
I0816 00:02:56.310559  6121 state.cpp:64] Recovering state from '/tmp/Endpoint_SlaveEndpointTest_UnauthorizedRequest_1_EoBj0E/meta'
I0816 00:02:56.311079  6116 status_update_manager.cpp:203] Recovering status update manager
I0816 00:02:56.311362  6121 containerizer.cpp:598] Recovering containerizer
I0816 00:02:56.313565  6121 provisioner.cpp:416] Provisioner recovery complete
I0816 00:02:56.314131  6119 slave.cpp:6210] Finished recovery
I0816 00:02:56.314784  6119 slave.cpp:6392] Querying resource estimator for oversubscribable
resources
I0816 00:02:56.315171  6118 slave.cpp:6406] Received oversubscribable resources {} from the
resource estimator
I0816 00:02:56.319377  6116 process.cpp:3933] Handling HTTP event for process 'slave(798)'
with path: '/slave(798)/monitor/statistics.json'
I0816 00:02:56.321692  6118 http.cpp:1166] HTTP GET for /slave(798)/monitor/statistics.json
from 172.17.0.2:39618
I0816 00:02:56.321822  6118 http.cpp:957] Authorizing principal 'test-principal' to GET the
'/monitor/statistics.json' endpoint
I0816 00:02:56.327338  6096 slave.cpp:843] Agent terminating
[       OK ] Endpoint/SlaveEndpointTest.UnauthorizedRequest/1 (64 ms)
[ RUN      ] Endpoint/SlaveEndpointTest.UnauthorizedRequest/2
I0816 00:02:56.360707  6096 containerizer.cpp:246] Using isolation: posix/cpu,posix/mem,filesystem/posix,network/cni,environment_secret
W0816 00:02:56.361569  6096 backend.cpp:76] Failed to create 'overlay' backend: OverlayBackend
requires root privileges
W0816 00:02:56.361907  6096 backend.cpp:76] Failed to create 'bind' backend: BindBackend requires
root privileges
I0816 00:02:56.361953  6096 provisioner.cpp:255] Using default backend 'copy'
I0816 00:02:56.367774  6122 slave.cpp:250] Mesos agent started on (799)@172.17.0.2:36953
I0816 00:02:56.367818  6122 slave.cpp:251] Flags at startup: --acls="" --appc_simple_discovery_uri_prefix="http://"
--appc_store_dir="/tmp/Endpoint_SlaveEndpointTest_UnauthorizedRequest_2_kybwhM/store/appc"
--authenticate_http_readonly="true" --authenticate_http_readwrite="true" --authenticatee="crammd5"
--authentication_backoff_factor="1secs" --authorizer="local" --cgroups_cpu_enable_pids_and_tids_count="false"
--cgroups_enable_cfs="false" --cgroups_hierarchy="/sys/fs/cgroup" --cgroups_limit_swap="false"
--cgroups_root="mesos" --container_disk_watch_interval="15secs" --containerizers="mesos" --credential="/tmp/Endpoint_SlaveEndpointTest_UnauthorizedRequest_2_kybwhM/credential"
--default_role="*" --disallow_sharing_agent_pid_namespace="false" --disk_watch_interval="1mins"
--docker="docker" --docker_kill_orphans="true" --docker_registry="https://registry-1.docker.io"
--docker_remove_delay="6hrs" --docker_socket="/var/run/docker.sock" --docker_stop_timeout="0ns"
--docker_store_dir="/tmp/Endpoint_SlaveEndpointTest_UnauthorizedRequest_2_kybwhM/store/docker"
--docker_volume_checkpoint_dir="/var/run/mesos/isolators/docker/volume" --enforce_container_disk_quota="false"
--executor_registration_timeout="1mins" --executor_reregistration_timeout="2secs" --executor_shutdown_grace_period="5secs"
--fetcher_cache_dir="/tmp/Endpoint_SlaveEndpointTest_UnauthorizedRequest_2_kybwhM/fetch" --fetcher_cache_size="2GB"
--frameworks_home="" --gc_delay="1weeks" --gc_disk_headroom="0.1" --hadoop_home="" --help="false"
--hostname_lookup="true" --http_command_executor="false" --http_credentials="/tmp/Endpoint_SlaveEndpointTest_UnauthorizedRequest_2_kybwhM/http_credentials"
--http_heartbeat_interval="30secs" --initialize_driver_logging="true" --isolation="posix/cpu,posix/mem"
--launcher="posix" --launcher_dir="/mesos/mesos-1.4.0/_build/src" --logbufsecs="0" --logging_level="INFO"
--max_completed_executors_per_framework="150" --oversubscribed_resources_interval="15secs"
--perf_duration="10secs" --perf_interval="1mins" --port="5051" --qos_correction_interval_min="0ns"
--quiet="false" --recover="reconnect" --recovery_timeout="15mins" --registration_backoff_factor="10ms"
--resources="cpus:2;gpus:0;mem:1024;disk:1024;ports:[31000-32000]" --revocable_cpu_low_priority="true"
--runtime_dir="/tmp/Endpoint_SlaveEndpointTest_UnauthorizedRequest_2_kybwhM" --sandbox_directory="/mnt/mesos/sandbox"
--strict="true" --switch_user="true" --systemd_enable_support="true" --systemd_runtime_directory="/run/systemd/system"
--version="false" --work_dir="/tmp/Endpoint_SlaveEndpointTest_UnauthorizedRequest_2_C5Z4Xl"
I0816 00:02:56.368677  6122 credentials.hpp:86] Loading credential for authentication from
'/tmp/Endpoint_SlaveEndpointTest_UnauthorizedRequest_2_kybwhM/credential'
I0816 00:02:56.369074  6122 slave.cpp:283] Agent using credential for: test-principal
I0816 00:02:56.369107  6122 credentials.hpp:37] Loading credentials for authentication from
'/tmp/Endpoint_SlaveEndpointTest_UnauthorizedRequest_2_kybwhM/http_credentials'
I0816 00:02:56.369635  6122 http.cpp:1026] Creating default 'basic' HTTP authenticator for
realm 'mesos-agent-readonly'
I0816 00:02:56.370041  6122 http.cpp:1026] Creating default 'basic' HTTP authenticator for
realm 'mesos-agent-readwrite'
I0816 00:02:56.372448  6122 slave.cpp:565] Agent resources: [{"name":"cpus","scalar":{"value":2.0},"type":"SCALAR"},{"name":"mem","scalar":{"value":1024.0},"type":"SCALAR"},{"name":"disk","scalar":{"value":1024.0},"type":"SCALAR"},{"name":"ports","ranges":{"range":[{"begin":31000,"end":32000}]},"type":"RANGES"}]
I0816 00:02:56.372890  6122 slave.cpp:573] Agent attributes: [  ]
I0816 00:02:56.372913  6122 slave.cpp:582] Agent hostname: 44b3641af516
I0816 00:02:56.373162  6121 status_update_manager.cpp:177] Pausing sending status updates
I0816 00:02:56.375409  6116 state.cpp:64] Recovering state from '/tmp/Endpoint_SlaveEndpointTest_UnauthorizedRequest_2_C5Z4Xl/meta'
I0816 00:02:56.375913  6116 status_update_manager.cpp:203] Recovering status update manager
I0816 00:02:56.376323  6122 containerizer.cpp:598] Recovering containerizer
I0816 00:02:56.378592  6118 provisioner.cpp:416] Provisioner recovery complete
I0816 00:02:56.379065  6120 slave.cpp:6210] Finished recovery
I0816 00:02:56.379663  6120 slave.cpp:6392] Querying resource estimator for oversubscribable
resources
I0816 00:02:56.380045  6116 slave.cpp:6406] Received oversubscribable resources {} from the
resource estimator
I0816 00:02:56.384096  6121 process.cpp:3933] Handling HTTP event for process 'slave(799)'
with path: '/slave(799)/containers'
I0816 00:02:56.386356  6116 http.cpp:1166] HTTP GET for /slave(799)/containers from 172.17.0.2:39620
I0816 00:02:56.386485  6116 http.cpp:957] Authorizing principal 'test-principal' to GET the
'/containers' endpoint
I0816 00:02:56.390452  6116 slave.cpp:843] Agent terminating
[       OK ] Endpoint/SlaveEndpointTest.UnauthorizedRequest/2 (48 ms)
[ RUN      ] Endpoint/SlaveEndpointTest.NoAuthorizer/0
I0816 00:02:56.408761  6096 containerizer.cpp:246] Using isolation: posix/cpu,posix/mem,filesystem/posix,network/cni,environment_secret
W0816 00:02:56.409596  6096 backend.cpp:76] Failed to create 'overlay' backend: OverlayBackend
requires root privileges
W0816 00:02:56.409909  6096 backend.cpp:76] Failed to create 'bind' backend: BindBackend requires
root privileges
I0816 00:02:56.410022  6096 provisioner.cpp:255] Using default backend 'copy'
I0816 00:02:56.412942  6096 cluster.cpp:448] Creating default 'local' authorizer
I0816 00:02:56.416297  6122 slave.cpp:250] Mesos agent started on (800)@172.17.0.2:36953
I0816 00:02:56.416338  6122 slave.cpp:251] Flags at startup: --acls="" --appc_simple_discovery_uri_prefix="http://"
--appc_store_dir="/tmp/Endpoint_SlaveEndpointTest_NoAuthorizer_0_adxJXt/store/appc" --authenticate_http_readonly="true"
--authenticate_http_readwrite="true" --authenticatee="crammd5" --authentication_backoff_factor="1secs"
--authorizer="local" --cgroups_cpu_enable_pids_and_tids_count="false" --cgroups_enable_cfs="false"
--cgroups_hierarchy="/sys/fs/cgroup" --cgroups_limit_swap="false" --cgroups_root="mesos" --container_disk_watch_interval="15secs"
--containerizers="mesos" --credential="/tmp/Endpoint_SlaveEndpointTest_NoAuthorizer_0_adxJXt/credential"
--default_role="*" --disallow_sharing_agent_pid_namespace="false" --disk_watch_interval="1mins"
--docker="docker" --docker_kill_orphans="true" --docker_registry="https://registry-1.docker.io"
--docker_remove_delay="6hrs" --docker_socket="/var/run/docker.sock" --docker_stop_timeout="0ns"
--docker_store_dir="/tmp/Endpoint_SlaveEndpointTest_NoAuthorizer_0_adxJXt/store/docker" --docker_volume_checkpoint_dir="/var/run/mesos/isolators/docker/volume"
--enforce_container_disk_quota="false" --executor_registration_timeout="1mins" --executor_reregistration_timeout="2secs"
--executor_shutdown_grace_period="5secs" --fetcher_cache_dir="/tmp/Endpoint_SlaveEndpointTest_NoAuthorizer_0_adxJXt/fetch"
--fetcher_cache_size="2GB" --frameworks_home="" --gc_delay="1weeks" --gc_disk_headroom="0.1"
--hadoop_home="" --help="false" --hostname_lookup="true" --http_command_executor="false" --http_credentials="/tmp/Endpoint_SlaveEndpointTest_NoAuthorizer_0_adxJXt/http_credentials"
--http_heartbeat_interval="30secs" --initialize_driver_logging="true" --isolation="posix/cpu,posix/mem"
--launcher="posix" --launcher_dir="/mesos/mesos-1.4.0/_build/src" --logbufsecs="0" --logging_level="INFO"
--max_completed_executors_per_framework="150" --oversubscribed_resources_interval="15secs"
--perf_duration="10secs" --perf_interval="1mins" --port="5051" --qos_correction_interval_min="0ns"
--quiet="false" --recover="reconnect" --recovery_timeout="15mins" --registration_backoff_factor="10ms"
--resources="cpus:2;gpus:0;mem:1024;disk:1024;ports:[31000-32000]" --revocable_cpu_low_priority="true"
--runtime_dir="/tmp/Endpoint_SlaveEndpointTest_NoAuthorizer_0_adxJXt" --sandbox_directory="/mnt/mesos/sandbox"
--strict="true" --switch_user="true" --systemd_enable_support="true" --systemd_runtime_directory="/run/systemd/system"
--version="false" --work_dir="/tmp/Endpoint_SlaveEndpointTest_NoAuthorizer_0_6MaAw3"
I0816 00:02:56.417135  6122 credentials.hpp:86] Loading credential for authentication from
'/tmp/Endpoint_SlaveEndpointTest_NoAuthorizer_0_adxJXt/credential'
I0816 00:02:56.417433  6122 slave.cpp:283] Agent using credential for: test-principal
I0816 00:02:56.417465  6122 credentials.hpp:37] Loading credentials for authentication from
'/tmp/Endpoint_SlaveEndpointTest_NoAuthorizer_0_adxJXt/http_credentials'
I0816 00:02:56.417943  6122 http.cpp:1026] Creating default 'basic' HTTP authenticator for
realm 'mesos-agent-readonly'
I0816 00:02:56.418236  6122 http.cpp:1026] Creating default 'basic' HTTP authenticator for
realm 'mesos-agent-readwrite'
I0816 00:02:56.420572  6122 slave.cpp:565] Agent resources: [{"name":"cpus","scalar":{"value":2.0},"type":"SCALAR"},{"name":"mem","scalar":{"value":1024.0},"type":"SCALAR"},{"name":"disk","scalar":{"value":1024.0},"type":"SCALAR"},{"name":"ports","ranges":{"range":[{"begin":31000,"end":32000}]},"type":"RANGES"}]
I0816 00:02:56.421277  6122 slave.cpp:573] Agent attributes: [  ]
I0816 00:02:56.421303  6122 slave.cpp:582] Agent hostname: 44b3641af516
I0816 00:02:56.421533  6118 status_update_manager.cpp:177] Pausing sending status updates
I0816 00:02:56.423859  6119 state.cpp:64] Recovering state from '/tmp/Endpoint_SlaveEndpointTest_NoAuthorizer_0_6MaAw3/meta'
I0816 00:02:56.424371  6115 status_update_manager.cpp:203] Recovering status update manager
I0816 00:02:56.424752  6119 containerizer.cpp:598] Recovering containerizer
I0816 00:02:56.427081  6119 provisioner.cpp:416] Provisioner recovery complete
I0816 00:02:56.427834  6118 slave.cpp:6210] Finished recovery
I0816 00:02:56.428438  6118 slave.cpp:6392] Querying resource estimator for oversubscribable
resources
I0816 00:02:56.428913  6122 slave.cpp:6406] Received oversubscribable resources {} from the
resource estimator
I0816 00:02:56.432811  6117 process.cpp:3933] Handling HTTP event for process 'slave(800)'
with path: '/slave(800)/monitor/statistics'
I0816 00:02:56.434895  6116 http.cpp:1166] HTTP GET for /slave(800)/monitor/statistics from
172.17.0.2:39622
I0816 00:02:56.435024  6116 http.cpp:957] Authorizing principal 'test-principal' to GET the
'/monitor/statistics' endpoint
I0816 00:02:56.440134  6096 slave.cpp:843] Agent terminating
[       OK ] Endpoint/SlaveEndpointTest.NoAuthorizer/0 (49 ms)
[ RUN      ] Endpoint/SlaveEndpointTest.NoAuthorizer/1
I0816 00:02:56.457983  6096 containerizer.cpp:246] Using isolation: posix/cpu,posix/mem,filesystem/posix,network/cni,environment_secret
W0816 00:02:56.458768  6096 backend.cpp:76] Failed to create 'overlay' backend: OverlayBackend
requires root privileges
W0816 00:02:56.458963  6096 backend.cpp:76] Failed to create 'bind' backend: BindBackend requires
root privileges
I0816 00:02:56.459005  6096 provisioner.cpp:255] Using default backend 'copy'
I0816 00:02:56.461716  6096 cluster.cpp:448] Creating default 'local' authorizer
I0816 00:02:56.464783  6122 slave.cpp:250] Mesos agent started on (801)@172.17.0.2:36953
I0816 00:02:56.464825  6122 slave.cpp:251] Flags at startup: --acls="" --appc_simple_discovery_uri_prefix="http://"
--appc_store_dir="/tmp/Endpoint_SlaveEndpointTest_NoAuthorizer_1_cgEQ9b/store/appc" --authenticate_http_readonly="true"
--authenticate_http_readwrite="true" --authenticatee="crammd5" --authentication_backoff_factor="1secs"
--authorizer="local" --cgroups_cpu_enable_pids_and_tids_count="false" --cgroups_enable_cfs="false"
--cgroups_hierarchy="/sys/fs/cgroup" --cgroups_limit_swap="false" --cgroups_root="mesos" --container_disk_watch_interval="15secs"
--containerizers="mesos" --credential="/tmp/Endpoint_SlaveEndpointTest_NoAuthorizer_1_cgEQ9b/credential"
--default_role="*" --disallow_sharing_agent_pid_namespace="false" --disk_watch_interval="1mins"
--docker="docker" --docker_kill_orphans="true" --docker_registry="https://registry-1.docker.io"
--docker_remove_delay="6hrs" --docker_socket="/var/run/docker.sock" --docker_stop_timeout="0ns"
--docker_store_dir="/tmp/Endpoint_SlaveEndpointTest_NoAuthorizer_1_cgEQ9b/store/docker" --docker_volume_checkpoint_dir="/var/run/mesos/isolators/docker/volume"
--enforce_container_disk_quota="false" --executor_registration_timeout="1mins" --executor_reregistration_timeout="2secs"
--executor_shutdown_grace_period="5secs" --fetcher_cache_dir="/tmp/Endpoint_SlaveEndpointTest_NoAuthorizer_1_cgEQ9b/fetch"
--fetcher_cache_size="2GB" --frameworks_home="" --gc_delay="1weeks" --gc_disk_headroom="0.1"
--hadoop_home="" --help="false" --hostname_lookup="true" --http_command_executor="false" --http_credentials="/tmp/Endpoint_SlaveEndpointTest_NoAuthorizer_1_cgEQ9b/http_credentials"
--http_heartbeat_interval="30secs" --initialize_driver_logging="true" --isolation="posix/cpu,posix/mem"
--launcher="posix" --launcher_dir="/mesos/mesos-1.4.0/_build/src" --logbufsecs="0" --logging_level="INFO"
--max_completed_executors_per_framework="150" --oversubscribed_resources_interval="15secs"
--perf_duration="10secs" --perf_interval="1mins" --port="5051" --qos_correction_interval_min="0ns"
--quiet="false" --recover="reconnect" --recovery_timeout="15mins" --registration_backoff_factor="10ms"
--resources="cpus:2;gpus:0;mem:1024;disk:1024;ports:[31000-32000]" --revocable_cpu_low_priority="true"
--runtime_dir="/tmp/Endpoint_SlaveEndpointTest_NoAuthorizer_1_cgEQ9b" --sandbox_directory="/mnt/mesos/sandbox"
--strict="true" --switch_user="true" --systemd_enable_support="true" --systemd_runtime_directory="/run/systemd/system"
--version="false" --work_dir="/tmp/Endpoint_SlaveEndpointTest_NoAuthorizer_1_adjHAL"
I0816 00:02:56.465584  6122 credentials.hpp:86] Loading credential for authentication from
'/tmp/Endpoint_SlaveEndpointTest_NoAuthorizer_1_cgEQ9b/credential'
I0816 00:02:56.465853  6122 slave.cpp:283] Agent using credential for: test-principal
I0816 00:02:56.465878  6122 credentials.hpp:37] Loading credentials for authentication from
'/tmp/Endpoint_SlaveEndpointTest_NoAuthorizer_1_cgEQ9b/http_credentials'
I0816 00:02:56.466243  6122 http.cpp:1026] Creating default 'basic' HTTP authenticator for
realm 'mesos-agent-readonly'
I0816 00:02:56.466528  6122 http.cpp:1026] Creating default 'basic' HTTP authenticator for
realm 'mesos-agent-readwrite'
I0816 00:02:56.468793  6122 slave.cpp:565] Agent resources: [{"name":"cpus","scalar":{"value":2.0},"type":"SCALAR"},{"name":"mem","scalar":{"value":1024.0},"type":"SCALAR"},{"name":"disk","scalar":{"value":1024.0},"type":"SCALAR"},{"name":"ports","ranges":{"range":[{"begin":31000,"end":32000}]},"type":"RANGES"}]
I0816 00:02:56.469235  6122 slave.cpp:573] Agent attributes: [  ]
I0816 00:02:56.469256  6122 slave.cpp:582] Agent hostname: 44b3641af516
I0816 00:02:56.469581  6115 status_update_manager.cpp:177] Pausing sending status updates
I0816 00:02:56.471592  6116 state.cpp:64] Recovering state from '/tmp/Endpoint_SlaveEndpointTest_NoAuthorizer_1_adjHAL/meta'
I0816 00:02:56.472133  6120 status_update_manager.cpp:203] Recovering status update manager
I0816 00:02:56.472560  6119 containerizer.cpp:598] Recovering containerizer
I0816 00:02:56.474833  6119 provisioner.cpp:416] Provisioner recovery complete
I0816 00:02:56.475319  6122 slave.cpp:6210] Finished recovery
I0816 00:02:56.475913  6122 slave.cpp:6392] Querying resource estimator for oversubscribable
resources
I0816 00:02:56.476327  6120 slave.cpp:6406] Received oversubscribable resources {} from the
resource estimator
I0816 00:02:56.480387  6116 process.cpp:3933] Handling HTTP event for process 'slave(801)'
with path: '/slave(801)/monitor/statistics.json'
I0816 00:02:56.482344  6120 http.cpp:1166] HTTP GET for /slave(801)/monitor/statistics.json
from 172.17.0.2:39624
I0816 00:02:56.482483  6120 http.cpp:957] Authorizing principal 'test-principal' to GET the
'/monitor/statistics.json' endpoint
I0816 00:02:56.487290  6117 slave.cpp:843] Agent terminating
[       OK ] Endpoint/SlaveEndpointTest.NoAuthorizer/1 (51 ms)
[ RUN      ] Endpoint/SlaveEndpointTest.NoAuthorizer/2
I0816 00:02:56.510187  6096 containerizer.cpp:246] Using isolation: posix/cpu,posix/mem,filesystem/posix,network/cni,environment_secret
W0816 00:02:56.510965  6096 backend.cpp:76] Failed to create 'overlay' backend: OverlayBackend
requires root privileges
W0816 00:02:56.511162  6096 backend.cpp:76] Failed to create 'bind' backend: BindBackend requires
root privileges
I0816 00:02:56.511204  6096 provisioner.cpp:255] Using default backend 'copy'
I0816 00:02:56.513957  6096 cluster.cpp:448] Creating default 'local' authorizer
I0816 00:02:56.517072  6120 slave.cpp:250] Mesos agent started on (802)@172.17.0.2:36953
I0816 00:02:56.517117  6120 slave.cpp:251] Flags at startup: --acls="" --appc_simple_discovery_uri_prefix="http://"
--appc_store_dir="/tmp/Endpoint_SlaveEndpointTest_NoAuthorizer_2_A6WUSU/store/appc" --authenticate_http_readonly="true"
--authenticate_http_readwrite="true" --authenticatee="crammd5" --authentication_backoff_factor="1secs"
--authorizer="local" --cgroups_cpu_enable_pids_and_tids_count="false" --cgroups_enable_cfs="false"
--cgroups_hierarchy="/sys/fs/cgroup" --cgroups_limit_swap="false" --cgroups_root="mesos" --container_disk_watch_interval="15secs"
--containerizers="mesos" --credential="/tmp/Endpoint_SlaveEndpointTest_NoAuthorizer_2_A6WUSU/credential"
--default_role="*" --disallow_sharing_agent_pid_namespace="false" --disk_watch_interval="1mins"
--docker="docker" --docker_kill_orphans="true" --docker_registry="https://registry-1.docker.io"
--docker_remove_delay="6hrs" --docker_socket="/var/run/docker.sock" --docker_stop_timeout="0ns"
--docker_store_dir="/tmp/Endpoint_SlaveEndpointTest_NoAuthorizer_2_A6WUSU/store/docker" --docker_volume_checkpoint_dir="/var/run/mesos/isolators/docker/volume"
--enforce_container_disk_quota="false" --executor_registration_timeout="1mins" --executor_reregistration_timeout="2secs"
--executor_shutdown_grace_period="5secs" --fetcher_cache_dir="/tmp/Endpoint_SlaveEndpointTest_NoAuthorizer_2_A6WUSU/fetch"
--fetcher_cache_size="2GB" --frameworks_home="" --gc_delay="1weeks" --gc_disk_headroom="0.1"
--hadoop_home="" --help="false" --hostname_lookup="true" --http_command_executor="false" --http_credentials="/tmp/Endpoint_SlaveEndpointTest_NoAuthorizer_2_A6WUSU/http_credentials"
--http_heartbeat_interval="30secs" --initialize_driver_logging="true" --isolation="posix/cpu,posix/mem"
--launcher="posix" --launcher_dir="/mesos/mesos-1.4.0/_build/src" --logbufsecs="0" --logging_level="INFO"
--max_completed_executors_per_framework="150" --oversubscribed_resources_interval="15secs"
--perf_duration="10secs" --perf_interval="1mins" --port="5051" --qos_correction_interval_min="0ns"
--quiet="false" --recover="reconnect" --recovery_timeout="15mins" --registration_backoff_factor="10ms"
--resources="cpus:2;gpus:0;mem:1024;disk:1024;ports:[31000-32000]" --revocable_cpu_low_priority="true"
--runtime_dir="/tmp/Endpoint_SlaveEndpointTest_NoAuthorizer_2_A6WUSU" --sandbox_directory="/mnt/mesos/sandbox"
--strict="true" --switch_user="true" --systemd_enable_support="true" --systemd_runtime_directory="/run/systemd/system"
--version="false" --work_dir="/tmp/Endpoint_SlaveEndpointTest_NoAuthorizer_2_cWvlbu"
I0816 00:02:56.518107  6120 credentials.hpp:86] Loading credential for authentication from
'/tmp/Endpoint_SlaveEndpointTest_NoAuthorizer_2_A6WUSU/credential'
I0816 00:02:56.518369  6120 slave.cpp:283] Agent using credential for: test-principal
I0816 00:02:56.518390  6120 credentials.hpp:37] Loading credentials for authentication from
'/tmp/Endpoint_SlaveEndpointTest_NoAuthorizer_2_A6WUSU/http_credentials'
I0816 00:02:56.519039  6120 http.cpp:1026] Creating default 'basic' HTTP authenticator for
realm 'mesos-agent-readonly'
I0816 00:02:56.519429  6120 http.cpp:1026] Creating default 'basic' HTTP authenticator for
realm 'mesos-agent-readwrite'
I0816 00:02:56.521888  6120 slave.cpp:565] Agent resources: [{"name":"cpus","scalar":{"value":2.0},"type":"SCALAR"},{"name":"mem","scalar":{"value":1024.0},"type":"SCALAR"},{"name":"disk","scalar":{"value":1024.0},"type":"SCALAR"},{"name":"ports","ranges":{"range":[{"begin":31000,"end":32000}]},"type":"RANGES"}]
I0816 00:02:56.522330  6120 slave.cpp:573] Agent attributes: [  ]
I0816 00:02:56.522352  6120 slave.cpp:582] Agent hostname: 44b3641af516
I0816 00:02:56.522737  6119 status_update_manager.cpp:177] Pausing sending status updates
I0816 00:02:56.524981  6118 state.cpp:64] Recovering state from '/tmp/Endpoint_SlaveEndpointTest_NoAuthorizer_2_cWvlbu/meta'
I0816 00:02:56.525382  6115 status_update_manager.cpp:203] Recovering status update manager
I0816 00:02:56.525697  6121 containerizer.cpp:598] Recovering containerizer
I0816 00:02:56.527966  6118 provisioner.cpp:416] Provisioner recovery complete
I0816 00:02:56.528632  6119 slave.cpp:6210] Finished recovery
I0816 00:02:56.529594  6119 slave.cpp:6392] Querying resource estimator for oversubscribable
resources
I0816 00:02:56.529986  6116 slave.cpp:6406] Received oversubscribable resources {} from the
resource estimator
I0816 00:02:56.533924  6117 process.cpp:3933] Handling HTTP event for process 'slave(802)'
with path: '/slave(802)/containers'
I0816 00:02:56.535991  6122 http.cpp:1166] HTTP GET for /slave(802)/containers from 172.17.0.2:39626
I0816 00:02:56.536118  6122 http.cpp:957] Authorizing principal 'test-principal' to GET the
'/containers' endpoint
I0816 00:02:56.542785  6096 slave.cpp:843] Agent terminating
[       OK ] Endpoint/SlaveEndpointTest.NoAuthorizer/2 (54 ms)
[----------] 9 tests from Endpoint/SlaveEndpointTest (479 ms total)

[----------] 2 tests from ContainerizerType/DefaultContainerDNSFlagTest
[ RUN      ] ContainerizerType/DefaultContainerDNSFlagTest.ValidateFlag/0
[       OK ] ContainerizerType/DefaultContainerDNSFlagTest.ValidateFlag/0 (20 ms)
[ RUN      ] ContainerizerType/DefaultContainerDNSFlagTest.ValidateFlag/1
[       OK ] ContainerizerType/DefaultContainerDNSFlagTest.ValidateFlag/1 (20 ms)
[----------] 2 tests from ContainerizerType/DefaultContainerDNSFlagTest (40 ms total)

[----------] Global test environment tear-down
[==========] 1652 tests from 182 test cases ran. (801752 ms total)
[  PASSED  ] 1646 tests.
[  FAILED  ] 6 tests, listed below:
[  FAILED  ] CommandExecutorCheckTest.CommandCheckDeliveredAndReconciled
[  FAILED  ] DefaultExecutorCheckTest.CommandCheckDeliveredAndReconciled
[  FAILED  ] DefaultExecutorCheckTest.CommandCheckStatusChange
[  FAILED  ] DefaultExecutorCheckTest.CommandCheckSeesParentsEnv
[  FAILED  ] DefaultExecutorCheckTest.CommandCheckSharesWorkDirWithTask
[  FAILED  ] MasterTest.IgnoreOldAgentReregistration

 6 FAILED TESTS
  YOU HAVE 20 DISABLED TESTS

I0816 00:02:56.740470  6123 process.cpp:1072] Failed to accept socket: future discarded
make[4]: *** [check-local] Error 1
make[4]: Leaving directory `/mesos/mesos-1.4.0/_build/src'
make[3]: *** [check-am] Error 2
make[3]: Leaving directory `/mesos/mesos-1.4.0/_build/src'
make[2]: *** [check] Error 2
make[2]: Leaving directory `/mesos/mesos-1.4.0/_build/src'
make[1]: *** [check-recursive] Error 1
make[1]: Leaving directory `/mesos/mesos-1.4.0/_build'
make: *** [distcheck] Error 1
+ docker rmi mesos-1502836649-7220
Untagged: mesos-1502836649-7220:latest
Deleted: sha256:37a63e7a9d30a45a0b760d807d60909c6d45d1bd80bafa5cdd8eabba3235a985
Deleted: sha256:8dded5afda5e90ae260101117765dbc6b1b6bb37a3cfa96076226d990cf44fa2
Deleted: sha256:28f029d18580b95274b05b9d9ab6f085e25e1a0eb265e1be97dee2f3a03a5a06
Deleted: sha256:7ae2889d817ecdea8d509c307b61504a78b52d93b237abaa658fa981aedd30a2
Deleted: sha256:6689084ba52f29463bd66894e8a75f5eecefbef38b141af079475d9566007e8c
Deleted: sha256:362a9fc1ab0e228af231b44227e4cf9a41babfdcf33b1373f81649c0c99488f0
Deleted: sha256:5b40a49fb03b07631e6f1b6e3489b411f9007b3cd84aeaefcadbe14c328601e7
Deleted: sha256:459390b12566c01744d1be0466c992ce86fcb82dc0e29fa4f7e32ccfb607e738
Deleted: sha256:60210844b3e4230467e1a8088ca9f2eabbaacf3802ea1eaeb6bdc0e230fbf3b8
Deleted: sha256:dfcb2f6091503622161015fbf621f7cc887b18cabe0c727c17962352d82d3732
Deleted: sha256:1272a430ebee09f0eba5039351ed582fc5d5019a0bc3f4541a5158a3b58c7486
Deleted: sha256:a7fe0e6b0c23b8ef3eb7f5acde905e705810cc1254ebe4fd485b3235d140ebdd
Deleted: sha256:0480a754f7966a04431c95c5cd40e36c5d00756950fa308a17fd3e7a416fb9ce
Deleted: sha256:b9c1fd94b3fb85c66c81af24e7bdeefa7b68050ab4fee3ebddf1678e9666e774
Deleted: sha256:041189f06757f5e6b890149533c10d964e7e2c76af0c6e756f67243ea8518042
Deleted: sha256:32794f691bba955176ee03a433850aea25b3bfd1084efad3c31f952e859c542d
Deleted: sha256:92b9e5548d1cbbfb132b30ae7f918f16579e39867cdecde98da686634f8a9aba
Deleted: sha256:1535f1d90c64f784b9eba020c19fa88291581f9beb3cfbc5e73ffd657ef07708
Deleted: sha256:eb6e2bb24c35bd80af60a4a52f8916b2e53d3d06cce9f1629fb6b1217258d429
Deleted: sha256:15b98ad23564362b83dd44fc4712c35ea680154ee5a89d755fe717c6315889e8
Deleted: sha256:a6f519c75ef116a787572452e3e8c7821e4e0f1f212ab8541f251efac9733143
Deleted: sha256:f3c7222b9aaf1ca0ec686e8a3579b44f2cf668d2cf9e73b2f93b56c3b0531247
Deleted: sha256:fe3419bfce17ee02f7fa83daa2820816d03f3e11324cd027bc74522d6a9bc886
Deleted: sha256:677b5391e237a11d939a4afa9a0f8cc5a7abeeacb646a52ef33205455958ae35
Deleted: sha256:c5e5cb6a4f4f29dff6e0cf4ea4f0d88905c5221452a68963b038bb466f7dd278
Build step 'Execute shell' marked build as failure

Mime
View raw message