mesos-builds mailing list archives

Site index · List index
Message view « Date » · « Thread »
Top « Date » · « Thread »
From Apache Jenkins Server <jenk...@builds.apache.org>
Subject Build failed in Jenkins: Mesos-Reviewbot #19116
Date Tue, 29 Aug 2017 20:32:15 GMT
See <https://builds.apache.org/job/Mesos-Reviewbot/19116/display/redirect>

------------------------------------------
[...truncated 30.81 MB...]
I0829 20:32:10.078677  5806 slave.cpp:252] Mesos agent started on (806)@172.17.0.7:33671
I0829 20:32:10.078698  5806 slave.cpp:253] Flags at startup: --acls="" --appc_simple_discovery_uri_prefix="http://"
--appc_store_dir="/tmp/Endpoint_SlaveEndpointTest_AuthorizedRequest_2_4Kd21K/store/appc" --authenticate_http_readonly="true"
--authenticate_http_readwrite="true" --authenticatee="crammd5" --authentication_backoff_factor="1secs"
--authorizer="local" --cgroups_cpu_enable_pids_and_tids_count="false" --cgroups_enable_cfs="false"
--cgroups_hierarchy="/sys/fs/cgroup" --cgroups_limit_swap="false" --cgroups_root="mesos" --container_disk_watch_interval="15secs"
--containerizers="mesos" --credential="/tmp/Endpoint_SlaveEndpointTest_AuthorizedRequest_2_4Kd21K/credential"
--default_role="*" --disallow_sharing_agent_pid_namespace="false" --disk_watch_interval="1mins"
--docker="docker" --docker_kill_orphans="true" --docker_registry="https://registry-1.docker.io"
--docker_remove_delay="6hrs" --docker_socket="/var/run/docker.sock" --docker_stop_timeout="0ns"
--docker_store_dir="/tmp/Endpoint_SlaveEndpointTest_AuthorizedRequest_2_4Kd21K/store/docker"
--docker_volume_checkpoint_dir="/var/run/mesos/isolators/docker/volume" --enforce_container_disk_quota="false"
--executor_registration_timeout="1mins" --executor_reregistration_timeout="2secs" --executor_shutdown_grace_period="5secs"
--fetcher_cache_dir="/tmp/Endpoint_SlaveEndpointTest_AuthorizedRequest_2_4Kd21K/fetch" --fetcher_cache_size="2GB"
--frameworks_home="" --gc_delay="1weeks" --gc_disk_headroom="0.1" --hadoop_home="" --help="false"
--hostname_lookup="true" --http_command_executor="false" --http_credentials="/tmp/Endpoint_SlaveEndpointTest_AuthorizedRequest_2_4Kd21K/http_credentials"
--http_heartbeat_interval="30secs" --initialize_driver_logging="true" --isolation="posix/cpu,posix/mem"
--launcher="posix" --launcher_dir="/mesos/mesos-1.5.0/_build/src" --logbufsecs="0" --logging_level="INFO"
--max_completed_executors_per_framework="150" --oversubscribed_resources_interval="15secs"
--perf_duration="10secs" --perf_interval="1mins" --port="5051" --qos_correction_interval_min="0ns"
--quiet="false" --recover="reconnect" --recovery_timeout="15mins" --registration_backoff_factor="10ms"
--resources="cpus:2;gpus:0;mem:1024;disk:1024;ports:[31000-32000]" --revocable_cpu_low_priority="true"
--runtime_dir="/tmp/Endpoint_SlaveEndpointTest_AuthorizedRequest_2_4Kd21K" --sandbox_directory="/mnt/mesos/sandbox"
--strict="true" --switch_user="true" --systemd_enable_support="true" --systemd_runtime_directory="/run/systemd/system"
--version="false" --work_dir="/tmp/Endpoint_SlaveEndpointTest_AuthorizedRequest_2_jk9r39"
I0829 20:32:10.079041  5806 credentials.hpp:86] Loading credential for authentication from
'/tmp/Endpoint_SlaveEndpointTest_AuthorizedRequest_2_4Kd21K/credential'
I0829 20:32:10.079237  5806 slave.cpp:285] Agent using credential for: test-principal
I0829 20:32:10.079265  5806 credentials.hpp:37] Loading credentials for authentication from
'/tmp/Endpoint_SlaveEndpointTest_AuthorizedRequest_2_4Kd21K/http_credentials'
I0829 20:32:10.079520  5806 http.cpp:1045] Creating default 'basic' HTTP authenticator for
realm 'mesos-agent-readonly'
I0829 20:32:10.079694  5806 http.cpp:1045] Creating default 'basic' HTTP authenticator for
realm 'mesos-agent-readwrite'
I0829 20:32:10.081037  5806 slave.cpp:581] Agent resources: [{"name":"cpus","scalar":{"value":2.0},"type":"SCALAR"},{"name":"mem","scalar":{"value":1024.0},"type":"SCALAR"},{"name":"disk","scalar":{"value":1024.0},"type":"SCALAR"},{"name":"ports","ranges":{"range":[{"begin":31000,"end":32000}]},"type":"RANGES"}]
I0829 20:32:10.081275  5806 slave.cpp:589] Agent attributes: [  ]
I0829 20:32:10.081290  5806 slave.cpp:598] Agent hostname: 8fed21414ff3
I0829 20:32:10.081492  5816 status_update_manager.cpp:177] Pausing sending status updates
I0829 20:32:10.083086  5813 state.cpp:64] Recovering state from '/tmp/Endpoint_SlaveEndpointTest_AuthorizedRequest_2_jk9r39/meta'
I0829 20:32:10.083319  5808 status_update_manager.cpp:203] Recovering status update manager
I0829 20:32:10.083653  5808 containerizer.cpp:646] Recovering containerizer
I0829 20:32:10.085305  5814 provisioner.cpp:416] Provisioner recovery complete
I0829 20:32:10.085639  5806 slave.cpp:6296] Finished recovery
I0829 20:32:10.086055  5806 slave.cpp:6478] Querying resource estimator for oversubscribable
resources
I0829 20:32:10.086316  5804 slave.cpp:6492] Received oversubscribable resources {} from the
resource estimator
I0829 20:32:10.088644  5801 process.cpp:3933] Handling HTTP event for process 'slave(806)'
with path: '/slave(806)/containers'
I0829 20:32:10.090275  5816 http.cpp:1185] HTTP GET for /slave(806)/containers from 172.17.0.7:40348
I0829 20:32:10.090346  5816 http.cpp:976] Authorizing principal 'test-principal' to GET the
'/containers' endpoint
I0829 20:32:10.093590  5774 slave.cpp:859] Agent terminating
[       OK ] Endpoint/SlaveEndpointTest.AuthorizedRequest/2 (30 ms)
[ RUN      ] Endpoint/SlaveEndpointTest.UnauthorizedRequest/0
I0829 20:32:10.105085  5774 containerizer.cpp:290] Using isolation { environment_secret, posix/cpu,
posix/mem, filesystem/posix, network/cni }
W0829 20:32:10.105546  5774 backend.cpp:76] Failed to create 'aufs' backend: AufsBackend requires
root privileges
W0829 20:32:10.105660  5774 backend.cpp:76] Failed to create 'bind' backend: BindBackend requires
root privileges
I0829 20:32:10.105697  5774 provisioner.cpp:255] Using default backend 'copy'
I0829 20:32:10.109113  5802 slave.cpp:252] Mesos agent started on (807)@172.17.0.7:33671
I0829 20:32:10.109133  5802 slave.cpp:253] Flags at startup: --acls="" --appc_simple_discovery_uri_prefix="http://"
--appc_store_dir="/tmp/Endpoint_SlaveEndpointTest_UnauthorizedRequest_0_xUNyb9/store/appc"
--authenticate_http_readonly="true" --authenticate_http_readwrite="true" --authenticatee="crammd5"
--authentication_backoff_factor="1secs" --authorizer="local" --cgroups_cpu_enable_pids_and_tids_count="false"
--cgroups_enable_cfs="false" --cgroups_hierarchy="/sys/fs/cgroup" --cgroups_limit_swap="false"
--cgroups_root="mesos" --container_disk_watch_interval="15secs" --containerizers="mesos" --credential="/tmp/Endpoint_SlaveEndpointTest_UnauthorizedRequest_0_xUNyb9/credential"
--default_role="*" --disallow_sharing_agent_pid_namespace="false" --disk_watch_interval="1mins"
--docker="docker" --docker_kill_orphans="true" --docker_registry="https://registry-1.docker.io"
--docker_remove_delay="6hrs" --docker_socket="/var/run/docker.sock" --docker_stop_timeout="0ns"
--docker_store_dir="/tmp/Endpoint_SlaveEndpointTest_UnauthorizedRequest_0_xUNyb9/store/docker"
--docker_volume_checkpoint_dir="/var/run/mesos/isolators/docker/volume" --enforce_container_disk_quota="false"
--executor_registration_timeout="1mins" --executor_reregistration_timeout="2secs" --executor_shutdown_grace_period="5secs"
--fetcher_cache_dir="/tmp/Endpoint_SlaveEndpointTest_UnauthorizedRequest_0_xUNyb9/fetch" --fetcher_cache_size="2GB"
--frameworks_home="" --gc_delay="1weeks" --gc_disk_headroom="0.1" --hadoop_home="" --help="false"
--hostname_lookup="true" --http_command_executor="false" --http_credentials="/tmp/Endpoint_SlaveEndpointTest_UnauthorizedRequest_0_xUNyb9/http_credentials"
--http_heartbeat_interval="30secs" --initialize_driver_logging="true" --isolation="posix/cpu,posix/mem"
--launcher="posix" --launcher_dir="/mesos/mesos-1.5.0/_build/src" --logbufsecs="0" --logging_level="INFO"
--max_completed_executors_per_framework="150" --oversubscribed_resources_interval="15secs"
--perf_duration="10secs" --perf_interval="1mins" --port="5051" --qos_correction_interval_min="0ns"
--quiet="false" --recover="reconnect" --recovery_timeout="15mins" --registration_backoff_factor="10ms"
--resources="cpus:2;gpus:0;mem:1024;disk:1024;ports:[31000-32000]" --revocable_cpu_low_priority="true"
--runtime_dir="/tmp/Endpoint_SlaveEndpointTest_UnauthorizedRequest_0_xUNyb9" --sandbox_directory="/mnt/mesos/sandbox"
--strict="true" --switch_user="true" --systemd_enable_support="true" --systemd_runtime_directory="/run/systemd/system"
--version="false" --work_dir="/tmp/Endpoint_SlaveEndpointTest_UnauthorizedRequest_0_EMOt8x"
I0829 20:32:10.109495  5802 credentials.hpp:86] Loading credential for authentication from
'/tmp/Endpoint_SlaveEndpointTest_UnauthorizedRequest_0_xUNyb9/credential'
I0829 20:32:10.109663  5802 slave.cpp:285] Agent using credential for: test-principal
I0829 20:32:10.109693  5802 credentials.hpp:37] Loading credentials for authentication from
'/tmp/Endpoint_SlaveEndpointTest_UnauthorizedRequest_0_xUNyb9/http_credentials'
I0829 20:32:10.109966  5802 http.cpp:1045] Creating default 'basic' HTTP authenticator for
realm 'mesos-agent-readonly'
I0829 20:32:10.110136  5802 http.cpp:1045] Creating default 'basic' HTTP authenticator for
realm 'mesos-agent-readwrite'
I0829 20:32:10.111371  5802 slave.cpp:581] Agent resources: [{"name":"cpus","scalar":{"value":2.0},"type":"SCALAR"},{"name":"mem","scalar":{"value":1024.0},"type":"SCALAR"},{"name":"disk","scalar":{"value":1024.0},"type":"SCALAR"},{"name":"ports","ranges":{"range":[{"begin":31000,"end":32000}]},"type":"RANGES"}]
I0829 20:32:10.111577  5802 slave.cpp:589] Agent attributes: [  ]
I0829 20:32:10.111598  5802 slave.cpp:598] Agent hostname: 8fed21414ff3
I0829 20:32:10.111834  5810 status_update_manager.cpp:177] Pausing sending status updates
I0829 20:32:10.113194  5816 state.cpp:64] Recovering state from '/tmp/Endpoint_SlaveEndpointTest_UnauthorizedRequest_0_EMOt8x/meta'
I0829 20:32:10.113487  5796 status_update_manager.cpp:203] Recovering status update manager
I0829 20:32:10.113729  5796 containerizer.cpp:646] Recovering containerizer
I0829 20:32:10.115115  5810 provisioner.cpp:416] Provisioner recovery complete
I0829 20:32:10.115483  5802 slave.cpp:6296] Finished recovery
I0829 20:32:10.115939  5802 slave.cpp:6478] Querying resource estimator for oversubscribable
resources
I0829 20:32:10.116194  5795 slave.cpp:6492] Received oversubscribable resources {} from the
resource estimator
I0829 20:32:10.119504  5806 process.cpp:3933] Handling HTTP event for process 'slave(807)'
with path: '/slave(807)/monitor/statistics'
I0829 20:32:10.120900  5814 http.cpp:1185] HTTP GET for /slave(807)/monitor/statistics from
172.17.0.7:40350
I0829 20:32:10.120975  5814 http.cpp:976] Authorizing principal 'test-principal' to GET the
'/monitor/statistics' endpoint
I0829 20:32:10.123643  5774 slave.cpp:859] Agent terminating
[       OK ] Endpoint/SlaveEndpointTest.UnauthorizedRequest/0 (29 ms)
[ RUN      ] Endpoint/SlaveEndpointTest.UnauthorizedRequest/1
I0829 20:32:10.134192  5774 containerizer.cpp:290] Using isolation { environment_secret, posix/cpu,
posix/mem, filesystem/posix, network/cni }
W0829 20:32:10.134649  5774 backend.cpp:76] Failed to create 'aufs' backend: AufsBackend requires
root privileges
W0829 20:32:10.134763  5774 backend.cpp:76] Failed to create 'bind' backend: BindBackend requires
root privileges
I0829 20:32:10.134801  5774 provisioner.cpp:255] Using default backend 'copy'
I0829 20:32:10.138437  5793 slave.cpp:252] Mesos agent started on (808)@172.17.0.7:33671
I0829 20:32:10.138455  5793 slave.cpp:253] Flags at startup: --acls="" --appc_simple_discovery_uri_prefix="http://"
--appc_store_dir="/tmp/Endpoint_SlaveEndpointTest_UnauthorizedRequest_1_fxEACx/store/appc"
--authenticate_http_readonly="true" --authenticate_http_readwrite="true" --authenticatee="crammd5"
--authentication_backoff_factor="1secs" --authorizer="local" --cgroups_cpu_enable_pids_and_tids_count="false"
--cgroups_enable_cfs="false" --cgroups_hierarchy="/sys/fs/cgroup" --cgroups_limit_swap="false"
--cgroups_root="mesos" --container_disk_watch_interval="15secs" --containerizers="mesos" --credential="/tmp/Endpoint_SlaveEndpointTest_UnauthorizedRequest_1_fxEACx/credential"
--default_role="*" --disallow_sharing_agent_pid_namespace="false" --disk_watch_interval="1mins"
--docker="docker" --docker_kill_orphans="true" --docker_registry="https://registry-1.docker.io"
--docker_remove_delay="6hrs" --docker_socket="/var/run/docker.sock" --docker_stop_timeout="0ns"
--docker_store_dir="/tmp/Endpoint_SlaveEndpointTest_UnauthorizedRequest_1_fxEACx/store/docker"
--docker_volume_checkpoint_dir="/var/run/mesos/isolators/docker/volume" --enforce_container_disk_quota="false"
--executor_registration_timeout="1mins" --executor_reregistration_timeout="2secs" --executor_shutdown_grace_period="5secs"
--fetcher_cache_dir="/tmp/Endpoint_SlaveEndpointTest_UnauthorizedRequest_1_fxEACx/fetch" --fetcher_cache_size="2GB"
--frameworks_home="" --gc_delay="1weeks" --gc_disk_headroom="0.1" --hadoop_home="" --help="false"
--hostname_lookup="true" --http_command_executor="false" --http_credentials="/tmp/Endpoint_SlaveEndpointTest_UnauthorizedRequest_1_fxEACx/http_credentials"
--http_heartbeat_interval="30secs" --initialize_driver_logging="true" --isolation="posix/cpu,posix/mem"
--launcher="posix" --launcher_dir="/mesos/mesos-1.5.0/_build/src" --logbufsecs="0" --logging_level="INFO"
--max_completed_executors_per_framework="150" --oversubscribed_resources_interval="15secs"
--perf_duration="10secs" --perf_interval="1mins" --port="5051" --qos_correction_interval_min="0ns"
--quiet="false" --recover="reconnect" --recovery_timeout="15mins" --registration_backoff_factor="10ms"
--resources="cpus:2;gpus:0;mem:1024;disk:1024;ports:[31000-32000]" --revocable_cpu_low_priority="true"
--runtime_dir="/tmp/Endpoint_SlaveEndpointTest_UnauthorizedRequest_1_fxEACx" --sandbox_directory="/mnt/mesos/sandbox"
--strict="true" --switch_user="true" --systemd_enable_support="true" --systemd_runtime_directory="/run/systemd/system"
--version="false" --work_dir="/tmp/Endpoint_SlaveEndpointTest_UnauthorizedRequest_1_Vl19uW"
I0829 20:32:10.138792  5793 credentials.hpp:86] Loading credential for authentication from
'/tmp/Endpoint_SlaveEndpointTest_UnauthorizedRequest_1_fxEACx/credential'
I0829 20:32:10.138939  5793 slave.cpp:285] Agent using credential for: test-principal
I0829 20:32:10.138958  5793 credentials.hpp:37] Loading credentials for authentication from
'/tmp/Endpoint_SlaveEndpointTest_UnauthorizedRequest_1_fxEACx/http_credentials'
I0829 20:32:10.139166  5793 http.cpp:1045] Creating default 'basic' HTTP authenticator for
realm 'mesos-agent-readonly'
I0829 20:32:10.139323  5793 http.cpp:1045] Creating default 'basic' HTTP authenticator for
realm 'mesos-agent-readwrite'
I0829 20:32:10.140578  5793 slave.cpp:581] Agent resources: [{"name":"cpus","scalar":{"value":2.0},"type":"SCALAR"},{"name":"mem","scalar":{"value":1024.0},"type":"SCALAR"},{"name":"disk","scalar":{"value":1024.0},"type":"SCALAR"},{"name":"ports","ranges":{"range":[{"begin":31000,"end":32000}]},"type":"RANGES"}]
I0829 20:32:10.140799  5793 slave.cpp:589] Agent attributes: [  ]
I0829 20:32:10.140812  5793 slave.cpp:598] Agent hostname: 8fed21414ff3
I0829 20:32:10.140983  5816 status_update_manager.cpp:177] Pausing sending status updates
I0829 20:32:10.142313  5801 state.cpp:64] Recovering state from '/tmp/Endpoint_SlaveEndpointTest_UnauthorizedRequest_1_Vl19uW/meta'
I0829 20:32:10.142567  5798 status_update_manager.cpp:203] Recovering status update manager
I0829 20:32:10.142746  5807 containerizer.cpp:646] Recovering containerizer
I0829 20:32:10.144138  5812 provisioner.cpp:416] Provisioner recovery complete
I0829 20:32:10.144459  5797 slave.cpp:6296] Finished recovery
I0829 20:32:10.144956  5797 slave.cpp:6478] Querying resource estimator for oversubscribable
resources
I0829 20:32:10.145217  5804 slave.cpp:6492] Received oversubscribable resources {} from the
resource estimator
I0829 20:32:10.147842  5814 process.cpp:3933] Handling HTTP event for process 'slave(808)'
with path: '/slave(808)/monitor/statistics.json'
I0829 20:32:10.149062  5795 http.cpp:1185] HTTP GET for /slave(808)/monitor/statistics.json
from 172.17.0.7:40352
I0829 20:32:10.149142  5795 http.cpp:976] Authorizing principal 'test-principal' to GET the
'/monitor/statistics.json' endpoint
I0829 20:32:10.151031  5796 slave.cpp:859] Agent terminating
[       OK ] Endpoint/SlaveEndpointTest.UnauthorizedRequest/1 (29 ms)
[ RUN      ] Endpoint/SlaveEndpointTest.UnauthorizedRequest/2
I0829 20:32:10.167595  5774 containerizer.cpp:290] Using isolation { environment_secret, posix/cpu,
posix/mem, filesystem/posix, network/cni }
W0829 20:32:10.168406  5774 backend.cpp:76] Failed to create 'aufs' backend: AufsBackend requires
root privileges
W0829 20:32:10.168606  5774 backend.cpp:76] Failed to create 'bind' backend: BindBackend requires
root privileges
I0829 20:32:10.168655  5774 provisioner.cpp:255] Using default backend 'copy'
I0829 20:32:10.173734  5814 slave.cpp:252] Mesos agent started on (809)@172.17.0.7:33671
I0829 20:32:10.173763  5814 slave.cpp:253] Flags at startup: --acls="" --appc_simple_discovery_uri_prefix="http://"
--appc_store_dir="/tmp/Endpoint_SlaveEndpointTest_UnauthorizedRequest_2_yeewlW/store/appc"
--authenticate_http_readonly="true" --authenticate_http_readwrite="true" --authenticatee="crammd5"
--authentication_backoff_factor="1secs" --authorizer="local" --cgroups_cpu_enable_pids_and_tids_count="false"
--cgroups_enable_cfs="false" --cgroups_hierarchy="/sys/fs/cgroup" --cgroups_limit_swap="false"
--cgroups_root="mesos" --container_disk_watch_interval="15secs" --containerizers="mesos" --credential="/tmp/Endpoint_SlaveEndpointTest_UnauthorizedRequest_2_yeewlW/credential"
--default_role="*" --disallow_sharing_agent_pid_namespace="false" --disk_watch_interval="1mins"
--docker="docker" --docker_kill_orphans="true" --docker_registry="https://registry-1.docker.io"
--docker_remove_delay="6hrs" --docker_socket="/var/run/docker.sock" --docker_stop_timeout="0ns"
--docker_store_dir="/tmp/Endpoint_SlaveEndpointTest_UnauthorizedRequest_2_yeewlW/store/docker"
--docker_volume_checkpoint_dir="/var/run/mesos/isolators/docker/volume" --enforce_container_disk_quota="false"
--executor_registration_timeout="1mins" --executor_reregistration_timeout="2secs" --executor_shutdown_grace_period="5secs"
--fetcher_cache_dir="/tmp/Endpoint_SlaveEndpointTest_UnauthorizedRequest_2_yeewlW/fetch" --fetcher_cache_size="2GB"
--frameworks_home="" --gc_delay="1weeks" --gc_disk_headroom="0.1" --hadoop_home="" --help="false"
--hostname_lookup="true" --http_command_executor="false" --http_credentials="/tmp/Endpoint_SlaveEndpointTest_UnauthorizedRequest_2_yeewlW/http_credentials"
--http_heartbeat_interval="30secs" --initialize_driver_logging="true" --isolation="posix/cpu,posix/mem"
--launcher="posix" --launcher_dir="/mesos/mesos-1.5.0/_build/src" --logbufsecs="0" --logging_level="INFO"
--max_completed_executors_per_framework="150" --oversubscribed_resources_interval="15secs"
--perf_duration="10secs" --perf_interval="1mins" --port="5051" --qos_correction_interval_min="0ns"
--quiet="false" --recover="reconnect" --recovery_timeout="15mins" --registration_backoff_factor="10ms"
--resources="cpus:2;gpus:0;mem:1024;disk:1024;ports:[31000-32000]" --revocable_cpu_low_priority="true"
--runtime_dir="/tmp/Endpoint_SlaveEndpointTest_UnauthorizedRequest_2_yeewlW" --sandbox_directory="/mnt/mesos/sandbox"
--strict="true" --switch_user="true" --systemd_enable_support="true" --systemd_runtime_directory="/run/systemd/system"
--version="false" --work_dir="/tmp/Endpoint_SlaveEndpointTest_UnauthorizedRequest_2_m7gu9k"
I0829 20:32:10.174176  5814 credentials.hpp:86] Loading credential for authentication from
'/tmp/Endpoint_SlaveEndpointTest_UnauthorizedRequest_2_yeewlW/credential'
I0829 20:32:10.174366  5814 slave.cpp:285] Agent using credential for: test-principal
I0829 20:32:10.174389  5814 credentials.hpp:37] Loading credentials for authentication from
'/tmp/Endpoint_SlaveEndpointTest_UnauthorizedRequest_2_yeewlW/http_credentials'
I0829 20:32:10.174684  5814 http.cpp:1045] Creating default 'basic' HTTP authenticator for
realm 'mesos-agent-readonly'
I0829 20:32:10.174859  5814 http.cpp:1045] Creating default 'basic' HTTP authenticator for
realm 'mesos-agent-readwrite'
I0829 20:32:10.176358  5814 slave.cpp:581] Agent resources: [{"name":"cpus","scalar":{"value":2.0},"type":"SCALAR"},{"name":"mem","scalar":{"value":1024.0},"type":"SCALAR"},{"name":"disk","scalar":{"value":1024.0},"type":"SCALAR"},{"name":"ports","ranges":{"range":[{"begin":31000,"end":32000}]},"type":"RANGES"}]
I0829 20:32:10.176612  5814 slave.cpp:589] Agent attributes: [  ]
I0829 20:32:10.176627  5814 slave.cpp:598] Agent hostname: 8fed21414ff3
I0829 20:32:10.176843  5798 status_update_manager.cpp:177] Pausing sending status updates
I0829 20:32:10.178822  5808 state.cpp:64] Recovering state from '/tmp/Endpoint_SlaveEndpointTest_UnauthorizedRequest_2_m7gu9k/meta'
I0829 20:32:10.179198  5815 status_update_manager.cpp:203] Recovering status update manager
I0829 20:32:10.179389  5815 containerizer.cpp:646] Recovering containerizer
I0829 20:32:10.181093  5810 provisioner.cpp:416] Provisioner recovery complete
I0829 20:32:10.181560  5814 slave.cpp:6296] Finished recovery
I0829 20:32:10.182060  5814 slave.cpp:6478] Querying resource estimator for oversubscribable
resources
I0829 20:32:10.182313  5797 slave.cpp:6492] Received oversubscribable resources {} from the
resource estimator
I0829 20:32:10.184847  5796 process.cpp:3933] Handling HTTP event for process 'slave(809)'
with path: '/slave(809)/containers'
I0829 20:32:10.186182  5808 http.cpp:1185] HTTP GET for /slave(809)/containers from 172.17.0.7:40354
I0829 20:32:10.186254  5808 http.cpp:976] Authorizing principal 'test-principal' to GET the
'/containers' endpoint
I0829 20:32:10.188815  5774 slave.cpp:859] Agent terminating
[       OK ] Endpoint/SlaveEndpointTest.UnauthorizedRequest/2 (36 ms)
[ RUN      ] Endpoint/SlaveEndpointTest.NoAuthorizer/0
I0829 20:32:10.201531  5774 containerizer.cpp:290] Using isolation { environment_secret, posix/cpu,
posix/mem, filesystem/posix, network/cni }
W0829 20:32:10.202069  5774 backend.cpp:76] Failed to create 'aufs' backend: AufsBackend requires
root privileges
W0829 20:32:10.202180  5774 backend.cpp:76] Failed to create 'bind' backend: BindBackend requires
root privileges
I0829 20:32:10.202224  5774 provisioner.cpp:255] Using default backend 'copy'
I0829 20:32:10.204113  5774 cluster.cpp:448] Creating default 'local' authorizer
I0829 20:32:10.206351  5799 slave.cpp:252] Mesos agent started on (810)@172.17.0.7:33671
I0829 20:32:10.206374  5799 slave.cpp:253] Flags at startup: --acls="" --appc_simple_discovery_uri_prefix="http://"
--appc_store_dir="/tmp/Endpoint_SlaveEndpointTest_NoAuthorizer_0_azs6pl/store/appc" --authenticate_http_readonly="true"
--authenticate_http_readwrite="true" --authenticatee="crammd5" --authentication_backoff_factor="1secs"
--authorizer="local" --cgroups_cpu_enable_pids_and_tids_count="false" --cgroups_enable_cfs="false"
--cgroups_hierarchy="/sys/fs/cgroup" --cgroups_limit_swap="false" --cgroups_root="mesos" --container_disk_watch_interval="15secs"
--containerizers="mesos" --credential="/tmp/Endpoint_SlaveEndpointTest_NoAuthorizer_0_azs6pl/credential"
--default_role="*" --disallow_sharing_agent_pid_namespace="false" --disk_watch_interval="1mins"
--docker="docker" --docker_kill_orphans="true" --docker_registry="https://registry-1.docker.io"
--docker_remove_delay="6hrs" --docker_socket="/var/run/docker.sock" --docker_stop_timeout="0ns"
--docker_store_dir="/tmp/Endpoint_SlaveEndpointTest_NoAuthorizer_0_azs6pl/store/docker" --docker_volume_checkpoint_dir="/var/run/mesos/isolators/docker/volume"
--enforce_container_disk_quota="false" --executor_registration_timeout="1mins" --executor_reregistration_timeout="2secs"
--executor_shutdown_grace_period="5secs" --fetcher_cache_dir="/tmp/Endpoint_SlaveEndpointTest_NoAuthorizer_0_azs6pl/fetch"
--fetcher_cache_size="2GB" --frameworks_home="" --gc_delay="1weeks" --gc_disk_headroom="0.1"
--hadoop_home="" --help="false" --hostname_lookup="true" --http_command_executor="false" --http_credentials="/tmp/Endpoint_SlaveEndpointTest_NoAuthorizer_0_azs6pl/http_credentials"
--http_heartbeat_interval="30secs" --initialize_driver_logging="true" --isolation="posix/cpu,posix/mem"
--launcher="posix" --launcher_dir="/mesos/mesos-1.5.0/_build/src" --logbufsecs="0" --logging_level="INFO"
--max_completed_executors_per_framework="150" --oversubscribed_resources_interval="15secs"
--perf_duration="10secs" --perf_interval="1mins" --port="5051" --qos_correction_interval_min="0ns"
--quiet="false" --recover="reconnect" --recovery_timeout="15mins" --registration_backoff_factor="10ms"
--resources="cpus:2;gpus:0;mem:1024;disk:1024;ports:[31000-32000]" --revocable_cpu_low_priority="true"
--runtime_dir="/tmp/Endpoint_SlaveEndpointTest_NoAuthorizer_0_azs6pl" --sandbox_directory="/mnt/mesos/sandbox"
--strict="true" --switch_user="true" --systemd_enable_support="true" --systemd_runtime_directory="/run/systemd/system"
--version="false" --work_dir="/tmp/Endpoint_SlaveEndpointTest_NoAuthorizer_0_WooL8J"
I0829 20:32:10.206699  5799 credentials.hpp:86] Loading credential for authentication from
'/tmp/Endpoint_SlaveEndpointTest_NoAuthorizer_0_azs6pl/credential'
I0829 20:32:10.206852  5799 slave.cpp:285] Agent using credential for: test-principal
I0829 20:32:10.206873  5799 credentials.hpp:37] Loading credentials for authentication from
'/tmp/Endpoint_SlaveEndpointTest_NoAuthorizer_0_azs6pl/http_credentials'
I0829 20:32:10.207093  5799 http.cpp:1045] Creating default 'basic' HTTP authenticator for
realm 'mesos-agent-readonly'
I0829 20:32:10.207237  5799 http.cpp:1045] Creating default 'basic' HTTP authenticator for
realm 'mesos-agent-readwrite'
I0829 20:32:10.208480  5799 slave.cpp:581] Agent resources: [{"name":"cpus","scalar":{"value":2.0},"type":"SCALAR"},{"name":"mem","scalar":{"value":1024.0},"type":"SCALAR"},{"name":"disk","scalar":{"value":1024.0},"type":"SCALAR"},{"name":"ports","ranges":{"range":[{"begin":31000,"end":32000}]},"type":"RANGES"}]
I0829 20:32:10.208698  5799 slave.cpp:589] Agent attributes: [  ]
I0829 20:32:10.208711  5799 slave.cpp:598] Agent hostname: 8fed21414ff3
I0829 20:32:10.208868  5809 status_update_manager.cpp:177] Pausing sending status updates
I0829 20:32:10.210260  5795 state.cpp:64] Recovering state from '/tmp/Endpoint_SlaveEndpointTest_NoAuthorizer_0_WooL8J/meta'
I0829 20:32:10.210551  5798 status_update_manager.cpp:203] Recovering status update manager
I0829 20:32:10.210747  5796 containerizer.cpp:646] Recovering containerizer
I0829 20:32:10.212136  5814 provisioner.cpp:416] Provisioner recovery complete
I0829 20:32:10.212476  5811 slave.cpp:6296] Finished recovery
I0829 20:32:10.213026  5811 slave.cpp:6478] Querying resource estimator for oversubscribable
resources
I0829 20:32:10.213327  5805 slave.cpp:6492] Received oversubscribable resources {} from the
resource estimator
I0829 20:32:10.216025  5794 process.cpp:3933] Handling HTTP event for process 'slave(810)'
with path: '/slave(810)/monitor/statistics'
I0829 20:32:10.217360  5799 http.cpp:1185] HTTP GET for /slave(810)/monitor/statistics from
172.17.0.7:40356
I0829 20:32:10.217464  5799 http.cpp:976] Authorizing principal 'test-principal' to GET the
'/monitor/statistics' endpoint
I0829 20:32:10.221071  5808 slave.cpp:859] Agent terminating
[       OK ] Endpoint/SlaveEndpointTest.NoAuthorizer/0 (31 ms)
[ RUN      ] Endpoint/SlaveEndpointTest.NoAuthorizer/1
I0829 20:32:10.236246  5774 containerizer.cpp:290] Using isolation { environment_secret, posix/cpu,
posix/mem, filesystem/posix, network/cni }
W0829 20:32:10.237074  5774 backend.cpp:76] Failed to create 'aufs' backend: AufsBackend requires
root privileges
W0829 20:32:10.237283  5774 backend.cpp:76] Failed to create 'bind' backend: BindBackend requires
root privileges
I0829 20:32:10.237332  5774 provisioner.cpp:255] Using default backend 'copy'
I0829 20:32:10.240124  5774 cluster.cpp:448] Creating default 'local' authorizer
I0829 20:32:10.242426  5798 slave.cpp:252] Mesos agent started on (811)@172.17.0.7:33671
I0829 20:32:10.242451  5798 slave.cpp:253] Flags at startup: --acls="" --appc_simple_discovery_uri_prefix="http://"
--appc_store_dir="/tmp/Endpoint_SlaveEndpointTest_NoAuthorizer_1_6PAKNK/store/appc" --authenticate_http_readonly="true"
--authenticate_http_readwrite="true" --authenticatee="crammd5" --authentication_backoff_factor="1secs"
--authorizer="local" --cgroups_cpu_enable_pids_and_tids_count="false" --cgroups_enable_cfs="false"
--cgroups_hierarchy="/sys/fs/cgroup" --cgroups_limit_swap="false" --cgroups_root="mesos" --container_disk_watch_interval="15secs"
--containerizers="mesos" --credential="/tmp/Endpoint_SlaveEndpointTest_NoAuthorizer_1_6PAKNK/credential"
--default_role="*" --disallow_sharing_agent_pid_namespace="false" --disk_watch_interval="1mins"
--docker="docker" --docker_kill_orphans="true" --docker_registry="https://registry-1.docker.io"
--docker_remove_delay="6hrs" --docker_socket="/var/run/docker.sock" --docker_stop_timeout="0ns"
--docker_store_dir="/tmp/Endpoint_SlaveEndpointTest_NoAuthorizer_1_6PAKNK/store/docker" --docker_volume_checkpoint_dir="/var/run/mesos/isolators/docker/volume"
--enforce_container_disk_quota="false" --executor_registration_timeout="1mins" --executor_reregistration_timeout="2secs"
--executor_shutdown_grace_period="5secs" --fetcher_cache_dir="/tmp/Endpoint_SlaveEndpointTest_NoAuthorizer_1_6PAKNK/fetch"
--fetcher_cache_size="2GB" --frameworks_home="" --gc_delay="1weeks" --gc_disk_headroom="0.1"
--hadoop_home="" --help="false" --hostname_lookup="true" --http_command_executor="false" --http_credentials="/tmp/Endpoint_SlaveEndpointTest_NoAuthorizer_1_6PAKNK/http_credentials"
--http_heartbeat_interval="30secs" --initialize_driver_logging="true" --isolation="posix/cpu,posix/mem"
--launcher="posix" --launcher_dir="/mesos/mesos-1.5.0/_build/src" --logbufsecs="0" --logging_level="INFO"
--max_completed_executors_per_framework="150" --oversubscribed_resources_interval="15secs"
--perf_duration="10secs" --perf_interval="1mins" --port="5051" --qos_correction_interval_min="0ns"
--quiet="false" --recover="reconnect" --recovery_timeout="15mins" --registration_backoff_factor="10ms"
--resources="cpus:2;gpus:0;mem:1024;disk:1024;ports:[31000-32000]" --revocable_cpu_low_priority="true"
--runtime_dir="/tmp/Endpoint_SlaveEndpointTest_NoAuthorizer_1_6PAKNK" --sandbox_directory="/mnt/mesos/sandbox"
--strict="true" --switch_user="true" --systemd_enable_support="true" --systemd_runtime_directory="/run/systemd/system"
--version="false" --work_dir="/tmp/Endpoint_SlaveEndpointTest_NoAuthorizer_1_PNbyr9"
I0829 20:32:10.242785  5798 credentials.hpp:86] Loading credential for authentication from
'/tmp/Endpoint_SlaveEndpointTest_NoAuthorizer_1_6PAKNK/credential'
I0829 20:32:10.242928  5798 slave.cpp:285] Agent using credential for: test-principal
I0829 20:32:10.242949  5798 credentials.hpp:37] Loading credentials for authentication from
'/tmp/Endpoint_SlaveEndpointTest_NoAuthorizer_1_6PAKNK/http_credentials'
I0829 20:32:10.243163  5798 http.cpp:1045] Creating default 'basic' HTTP authenticator for
realm 'mesos-agent-readonly'
I0829 20:32:10.243324  5798 http.cpp:1045] Creating default 'basic' HTTP authenticator for
realm 'mesos-agent-readwrite'
I0829 20:32:10.244701  5798 slave.cpp:581] Agent resources: [{"name":"cpus","scalar":{"value":2.0},"type":"SCALAR"},{"name":"mem","scalar":{"value":1024.0},"type":"SCALAR"},{"name":"disk","scalar":{"value":1024.0},"type":"SCALAR"},{"name":"ports","ranges":{"range":[{"begin":31000,"end":32000}]},"type":"RANGES"}]
I0829 20:32:10.244963  5798 slave.cpp:589] Agent attributes: [  ]
I0829 20:32:10.244977  5798 slave.cpp:598] Agent hostname: 8fed21414ff3
I0829 20:32:10.245137  5809 status_update_manager.cpp:177] Pausing sending status updates
I0829 20:32:10.246412  5793 state.cpp:64] Recovering state from '/tmp/Endpoint_SlaveEndpointTest_NoAuthorizer_1_PNbyr9/meta'
I0829 20:32:10.246731  5795 status_update_manager.cpp:203] Recovering status update manager
I0829 20:32:10.246943  5813 containerizer.cpp:646] Recovering containerizer
I0829 20:32:10.248227  5806 provisioner.cpp:416] Provisioner recovery complete
I0829 20:32:10.248555  5798 slave.cpp:6296] Finished recovery
I0829 20:32:10.249034  5798 slave.cpp:6478] Querying resource estimator for oversubscribable
resources
I0829 20:32:10.249330  5804 slave.cpp:6492] Received oversubscribable resources {} from the
resource estimator
I0829 20:32:10.251868  5801 process.cpp:3933] Handling HTTP event for process 'slave(811)'
with path: '/slave(811)/monitor/statistics.json'
I0829 20:32:10.253079  5794 http.cpp:1185] HTTP GET for /slave(811)/monitor/statistics.json
from 172.17.0.7:40358
I0829 20:32:10.253149  5794 http.cpp:976] Authorizing principal 'test-principal' to GET the
'/monitor/statistics.json' endpoint
I0829 20:32:10.255906  5807 slave.cpp:859] Agent terminating
[       OK ] Endpoint/SlaveEndpointTest.NoAuthorizer/1 (33 ms)
[ RUN      ] Endpoint/SlaveEndpointTest.NoAuthorizer/2
I0829 20:32:10.267482  5774 containerizer.cpp:290] Using isolation { environment_secret, posix/cpu,
posix/mem, filesystem/posix, network/cni }
W0829 20:32:10.267983  5774 backend.cpp:76] Failed to create 'aufs' backend: AufsBackend requires
root privileges
W0829 20:32:10.268101  5774 backend.cpp:76] Failed to create 'bind' backend: BindBackend requires
root privileges
I0829 20:32:10.268144  5774 provisioner.cpp:255] Using default backend 'copy'
I0829 20:32:10.269855  5774 cluster.cpp:448] Creating default 'local' authorizer
I0829 20:32:10.271900  5801 slave.cpp:252] Mesos agent started on (812)@172.17.0.7:33671
I0829 20:32:10.271926  5801 slave.cpp:253] Flags at startup: --acls="" --appc_simple_discovery_uri_prefix="http://"
--appc_store_dir="/tmp/Endpoint_SlaveEndpointTest_NoAuthorizer_2_YAlSva/store/appc" --authenticate_http_readonly="true"
--authenticate_http_readwrite="true" --authenticatee="crammd5" --authentication_backoff_factor="1secs"
--authorizer="local" --cgroups_cpu_enable_pids_and_tids_count="false" --cgroups_enable_cfs="false"
--cgroups_hierarchy="/sys/fs/cgroup" --cgroups_limit_swap="false" --cgroups_root="mesos" --container_disk_watch_interval="15secs"
--containerizers="mesos" --credential="/tmp/Endpoint_SlaveEndpointTest_NoAuthorizer_2_YAlSva/credential"
--default_role="*" --disallow_sharing_agent_pid_namespace="false" --disk_watch_interval="1mins"
--docker="docker" --docker_kill_orphans="true" --docker_registry="https://registry-1.docker.io"
--docker_remove_delay="6hrs" --docker_socket="/var/run/docker.sock" --docker_stop_timeout="0ns"
--docker_store_dir="/tmp/Endpoint_SlaveEndpointTest_NoAuthorizer_2_YAlSva/store/docker" --docker_volume_checkpoint_dir="/var/run/mesos/isolators/docker/volume"
--enforce_container_disk_quota="false" --executor_registration_timeout="1mins" --executor_reregistration_timeout="2secs"
--executor_shutdown_grace_period="5secs" --fetcher_cache_dir="/tmp/Endpoint_SlaveEndpointTest_NoAuthorizer_2_YAlSva/fetch"
--fetcher_cache_size="2GB" --frameworks_home="" --gc_delay="1weeks" --gc_disk_headroom="0.1"
--hadoop_home="" --help="false" --hostname_lookup="true" --http_command_executor="false" --http_credentials="/tmp/Endpoint_SlaveEndpointTest_NoAuthorizer_2_YAlSva/http_credentials"
--http_heartbeat_interval="30secs" --initialize_driver_logging="true" --isolation="posix/cpu,posix/mem"
--launcher="posix" --launcher_dir="/mesos/mesos-1.5.0/_build/src" --logbufsecs="0" --logging_level="INFO"
--max_completed_executors_per_framework="150" --oversubscribed_resources_interval="15secs"
--perf_duration="10secs" --perf_interval="1mins" --port="5051" --qos_correction_interval_min="0ns"
--quiet="false" --recover="reconnect" --recovery_timeout="15mins" --registration_backoff_factor="10ms"
--resources="cpus:2;gpus:0;mem:1024;disk:1024;ports:[31000-32000]" --revocable_cpu_low_priority="true"
--runtime_dir="/tmp/Endpoint_SlaveEndpointTest_NoAuthorizer_2_YAlSva" --sandbox_directory="/mnt/mesos/sandbox"
--strict="true" --switch_user="true" --systemd_enable_support="true" --systemd_runtime_directory="/run/systemd/system"
--version="false" --work_dir="/tmp/Endpoint_SlaveEndpointTest_NoAuthorizer_2_KTjG4y"
I0829 20:32:10.272370  5801 credentials.hpp:86] Loading credential for authentication from
'/tmp/Endpoint_SlaveEndpointTest_NoAuthorizer_2_YAlSva/credential'
I0829 20:32:10.272583  5801 slave.cpp:285] Agent using credential for: test-principal
I0829 20:32:10.272604  5801 credentials.hpp:37] Loading credentials for authentication from
'/tmp/Endpoint_SlaveEndpointTest_NoAuthorizer_2_YAlSva/http_credentials'
I0829 20:32:10.272855  5801 http.cpp:1045] Creating default 'basic' HTTP authenticator for
realm 'mesos-agent-readonly'
I0829 20:32:10.273043  5801 http.cpp:1045] Creating default 'basic' HTTP authenticator for
realm 'mesos-agent-readwrite'
I0829 20:32:10.274296  5801 slave.cpp:581] Agent resources: [{"name":"cpus","scalar":{"value":2.0},"type":"SCALAR"},{"name":"mem","scalar":{"value":1024.0},"type":"SCALAR"},{"name":"disk","scalar":{"value":1024.0},"type":"SCALAR"},{"name":"ports","ranges":{"range":[{"begin":31000,"end":32000}]},"type":"RANGES"}]
I0829 20:32:10.274504  5801 slave.cpp:589] Agent attributes: [  ]
I0829 20:32:10.274518  5801 slave.cpp:598] Agent hostname: 8fed21414ff3
I0829 20:32:10.274639  5797 status_update_manager.cpp:177] Pausing sending status updates
I0829 20:32:10.276017  5813 state.cpp:64] Recovering state from '/tmp/Endpoint_SlaveEndpointTest_NoAuthorizer_2_KTjG4y/meta'
I0829 20:32:10.276263  5808 status_update_manager.cpp:203] Recovering status update manager
I0829 20:32:10.276427  5802 containerizer.cpp:646] Recovering containerizer
I0829 20:32:10.277742  5795 provisioner.cpp:416] Provisioner recovery complete
I0829 20:32:10.278045  5805 slave.cpp:6296] Finished recovery
I0829 20:32:10.278514  5805 slave.cpp:6478] Querying resource estimator for oversubscribable
resources
I0829 20:32:10.278761  5807 slave.cpp:6492] Received oversubscribable resources {} from the
resource estimator
I0829 20:32:10.281476  5803 process.cpp:3933] Handling HTTP event for process 'slave(812)'
with path: '/slave(812)/containers'
I0829 20:32:10.282744  5794 http.cpp:1185] HTTP GET for /slave(812)/containers from 172.17.0.7:40360
I0829 20:32:10.282841  5794 http.cpp:976] Authorizing principal 'test-principal' to GET the
'/containers' endpoint
I0829 20:32:10.286236  5774 slave.cpp:859] Agent terminating
[       OK ] Endpoint/SlaveEndpointTest.NoAuthorizer/2 (29 ms)
[----------] 9 tests from Endpoint/SlaveEndpointTest (280 ms total)

[----------] 2 tests from ContainerizerType/DefaultContainerDNSFlagTest
[ RUN      ] ContainerizerType/DefaultContainerDNSFlagTest.ValidateFlag/0
[       OK ] ContainerizerType/DefaultContainerDNSFlagTest.ValidateFlag/0 (9 ms)
[ RUN      ] ContainerizerType/DefaultContainerDNSFlagTest.ValidateFlag/1
[       OK ] ContainerizerType/DefaultContainerDNSFlagTest.ValidateFlag/1 (8 ms)
[----------] 2 tests from ContainerizerType/DefaultContainerDNSFlagTest (17 ms total)

[----------] Global test environment tear-down
[==========] 1663 tests from 183 test cases ran. (486032 ms total)
[  PASSED  ] 1662 tests.
[  FAILED  ] 1 test, listed below:
[  FAILED  ] ExamplesTest.PersistentVolumeFramework

 1 FAILED TEST
  YOU HAVE 20 DISABLED TESTS

I0829 20:32:10.359241  5817 process.cpp:1072] Failed to accept socket: future discarded
make[4]: *** [check-local] Error 1
make[4]: Leaving directory `/mesos/mesos-1.5.0/_build/src'
make[3]: *** [check-am] Error 2
make[3]: Leaving directory `/mesos/mesos-1.5.0/_build/src'
make[2]: *** [check] Error 2
make[2]: Leaving directory `/mesos/mesos-1.5.0/_build/src'
make[1]: *** [check-recursive] Error 1
make[1]: Leaving directory `/mesos/mesos-1.5.0/_build'
make: *** [distcheck] Error 1
+ docker rmi mesos-1504035692-3667
Untagged: mesos-1504035692-3667:latest
Deleted: sha256:913b0748f05c8d5595b211c2a53a97acbce4bcbedb5ce2fe4e84fa381e284d9e
Deleted: sha256:95d9dc322b434ee351b573e33a21772f278c33044fae12723c02c2cdd01a91e9
Deleted: sha256:45010466cf2e5cba054ef6eff8946637d7e8cc2cd771a71d81927dd212506cad
Deleted: sha256:27e4cfb04e4251ccfb4336586b7f78a04a0c5c755ef8539bea9b1208a973f1c0
Deleted: sha256:c360b1f7fbacdb90ba58cf31ecca6c9de81e1830ab60c3b7b061f45cda33eccd
Deleted: sha256:e324ad1353c38b4960fb3091dc37316736bd7944c340726c46b9e4402c56076f
Deleted: sha256:958027b41a5b2fdcc97a746b1ef6c472bd900d291fc3048d7e445a0c57d1d976
Deleted: sha256:dfdde394ec10aa01b494ee2df78ea3c88127df663543ff21c9a08af64dd3edfd
Deleted: sha256:0731eec4fae83fea459ff9d6813f09f986010bcb6857794ea953c85a97230620
Deleted: sha256:3b080d9df1d91ec7a037e348e768477b0894f4a8f530078d319e99240be05c06
Deleted: sha256:a0eda4eac23515ff9aa5c6e86c376c0024ed32f879741f0d409fd02189163be8
Deleted: sha256:ac119cd7d3646b195011a716b8c8a89333baee55b8f6940529f2bcbb8a919bed
Deleted: sha256:11e80fb5f8c300aa31797ebcb24c7f4b470e87b58e1490a4f7700f2d9935297a
Deleted: sha256:5701eaa4794600f862238014d25530ea874ff95408989cc55526e2a86613bdd8
Deleted: sha256:2e33da6857940e626f91f1b741e072531324fafa7a42c4e106c514774704966a
Deleted: sha256:1f8298a663e67ece346d955fbf161256c0c218d29b53de9e3550ba7dde63e4db
Deleted: sha256:fc8746f01a1dfb4f8ef79de6554f1698e340a8800fbf1e26ad1643d61725576f
Deleted: sha256:9a78b101263b0cf2a1fe4ff1e4e46be743295dd18b2ab9b67ac22b2c32afa9d9
Deleted: sha256:6b13dd5e46a328b0dbdc95104d0f4e4ff58ae3d2d86dea31ac88f317cd184326
Deleted: sha256:27be9ee09399356f33a8a510a934273184837aaabe5eff005053faa5794cf302
Deleted: sha256:e12ddfda8c795610baf04da9a38071f8c0e55e43c5604c23f592c36046244010
Deleted: sha256:97e7aec3b323ce8804c073ff9a95e37d659e368d2e09aceaa5764e0b1e6cb387
Deleted: sha256:b2ec62c028782ef7f57fc6ae13a3773b51def799cd6aa4e867366fe6caa9822c
Deleted: sha256:7d0ba8f55a7d150419d64dbe433dae70bb35d673f1ee1c48a8a87075a23e3769
Build step 'Execute shell' marked build as failure

Mime
View raw message