mesos-builds mailing list archives

Site index · List index
Message view « Date » · « Thread »
Top « Date » · « Thread »
From Apache Jenkins Server <jenk...@builds.apache.org>
Subject Build failed in Jenkins: Mesos-Reviewbot #19067
Date Fri, 25 Aug 2017 17:40:18 GMT
See <https://builds.apache.org/job/Mesos-Reviewbot/19067/display/redirect>

------------------------------------------
[URLTrigger] A change within the response URL invocation (log)
[EnvInject] - Loading node environment variables.
Building remotely on qnode3 (ubuntu) in workspace <https://builds.apache.org/job/Mesos-Reviewbot/ws/>
 > git rev-parse --is-inside-work-tree # timeout=10
Fetching changes from the remote Git repository
 > git config remote.origin.url https://git-wip-us.apache.org/repos/asf/mesos.git # timeout=10
Fetching upstream changes from https://git-wip-us.apache.org/repos/asf/mesos.git
 > git --version # timeout=10
 > git fetch --tags --progress https://git-wip-us.apache.org/repos/asf/mesos.git +refs/heads/*:refs/remotes/origin/*
 > git rev-parse origin/master^{commit} # timeout=10
Checking out Revision e17be192519bd8b4fde45b833ac26d5a7a11e688 (origin/master)
Commit message: "Fixed a rmdir test missed by be8d7c2a6."
 > git config core.sparsecheckout # timeout=10
 > git checkout -f e17be192519bd8b4fde45b833ac26d5a7a11e688
 > git rev-list e17be192519bd8b4fde45b833ac26d5a7a11e688 # timeout=10
 > git tag -a -f -m Jenkins Build #19067 jenkins-Mesos-Reviewbot-19067 # timeout=10
[EnvInject] - Executing scripts and injecting environment variables after the SCM step.
[EnvInject] - Injecting as environment variables the properties content 
USERNAME=mesos-review

[EnvInject] - Variables injected successfully.
[EnvInject] - Mask passwords that will be passed as build parameters.
FATAL: Unable to produce a script file
java.io.IOException: No space left on device
	at java.io.FileOutputStream.writeBytes(Native Method)
	at java.io.FileOutputStream.write(FileOutputStream.java:326)
	at sun.nio.cs.StreamEncoder.writeBytes(StreamEncoder.java:221)
	at sun.nio.cs.StreamEncoder.implClose(StreamEncoder.java:316)
	at sun.nio.cs.StreamEncoder.close(StreamEncoder.java:149)
	at java.io.OutputStreamWriter.close(OutputStreamWriter.java:233)
	at hudson.FilePath$17.invoke(FilePath.java:1380)
	at hudson.FilePath$17.invoke(FilePath.java:1363)
	at hudson.FilePath$FileCallableWrapper.call(FilePath.java:2739)
	at hudson.remoting.UserRequest.perform(UserRequest.java:153)
	at hudson.remoting.UserRequest.perform(UserRequest.java:50)
	at hudson.remoting.Request$2.run(Request.java:336)
	at hudson.remoting.InterceptingExecutorService$1.call(InterceptingExecutorService.java:68)
	at java.util.concurrent.FutureTask.run(FutureTask.java:266)
	at java.util.concurrent.ThreadPoolExecutor.runWorker(ThreadPoolExecutor.java:1142)
	at java.util.concurrent.ThreadPoolExecutor$Worker.run(ThreadPoolExecutor.java:617)
	at java.lang.Thread.run(Thread.java:745)
	at ......remote call to qnode3(Native Method)
	at hudson.remoting.Channel.attachCallSiteStackTrace(Channel.java:1545)
	at hudson.remoting.UserResponse.retrieve(UserRequest.java:253)
	at hudson.remoting.Channel.call(Channel.java:830)
	at hudson.FilePath.act(FilePath.java:986)
Caused: java.io.IOException: remote file operation failed: <https://builds.apache.org/job/Mesos-Reviewbot/ws/>
at hudson.remoting.Channel@33f9323b:qnode3
	at hudson.FilePath.act(FilePath.java:993)
	at hudson.FilePath.act(FilePath.java:975)
	at hudson.FilePath.createTextTempFile(FilePath.java:1363)
Caused: java.io.IOException: Failed to create a temp file on <https://builds.apache.org/job/Mesos-Reviewbot/ws/>
	at hudson.FilePath.createTextTempFile(FilePath.java:1386)
	at hudson.tasks.CommandInterpreter.createScriptFile(CommandInterpreter.java:162)
	at hudson.tasks.CommandInterpreter.perform(CommandInterpreter.java:94)
	at hudson.tasks.CommandInterpreter.perform(CommandInterpreter.java:66)
	at hudson.tasks.BuildStepMonitor$1.perform(BuildStepMonitor.java:20)
	at hudson.model.AbstractBuild$AbstractBuildExecution.perform(AbstractBuild.java:735)
	at hudson.model.Build$BuildExecution.build(Build.java:206)
	at hudson.model.Build$BuildExecution.doRun(Build.java:163)
	at hudson.model.AbstractBuild$AbstractBuildExecution.run(AbstractBuild.java:490)
	at hudson.model.Run.execute(Run.java:1735)
	at hudson.model.FreeStyleBuild.run(FreeStyleBuild.java:43)
	at hudson.model.ResourceController.execute(ResourceController.java:97)
	at hudson.model.Executor.run(Executor.java:405)
Build step 'Execute shell' marked build as failure

Mime
View raw message