mesos-builds mailing list archives

Site index · List index
Message view « Date » · « Thread »
Top « Date » · « Thread »
From Apache Jenkins Server <jenk...@builds.apache.org>
Subject Build failed in Jenkins: Mesos-Buildbot » autotools,gcc,--verbose,GLOG_v=1 MESOS_VERBOSE=1,centos:7,(ubuntu)&&(!ubuntu-us1)&&(!ubuntu-eu2) #4172
Date Wed, 30 Aug 2017 19:27:27 GMT
See <https://builds.apache.org/job/Mesos-Buildbot/BUILDTOOL=autotools,COMPILER=gcc,CONFIGURATION=--verbose,ENVIRONMENT=GLOG_v=1%20MESOS_VERBOSE=1,OS=centos%3A7,label_exp=(ubuntu)&&(!ubuntu-us1)&&(!ubuntu-eu2)/4172/display/redirect?page=changes>

Changes:

[xujyan] Removed an unused function argument.

------------------------------------------
[...truncated 31.00 MB...]
I0830 19:27:17.633275  6801 credentials.hpp:37] Loading credentials for authentication from
'/tmp/Endpoint_SlaveEndpointTest_AuthorizedRequest_2_HsfGRZ/http_credentials'
I0830 19:27:17.633579  6801 http.cpp:1045] Creating default 'basic' HTTP authenticator for
realm 'mesos-agent-readonly'
I0830 19:27:17.633848  6801 http.cpp:1045] Creating default 'basic' HTTP authenticator for
realm 'mesos-agent-readwrite'
I0830 19:27:17.635891  6801 slave.cpp:581] Agent resources: [{"name":"cpus","scalar":{"value":2.0},"type":"SCALAR"},{"name":"mem","scalar":{"value":1024.0},"type":"SCALAR"},{"name":"disk","scalar":{"value":1024.0},"type":"SCALAR"},{"name":"ports","ranges":{"range":[{"begin":31000,"end":32000}]},"type":"RANGES"}]
I0830 19:27:17.636121  6801 slave.cpp:589] Agent attributes: [  ]
I0830 19:27:17.636137  6801 slave.cpp:598] Agent hostname: 9dbf26c66ad8
I0830 19:27:17.636279  6820 status_update_manager.cpp:177] Pausing sending status updates
I0830 19:27:17.638233  6817 state.cpp:64] Recovering state from '/tmp/Endpoint_SlaveEndpointTest_AuthorizedRequest_2_T7gUQG/meta'
I0830 19:27:17.638545  6809 status_update_manager.cpp:203] Recovering status update manager
I0830 19:27:17.638733  6810 containerizer.cpp:646] Recovering containerizer
I0830 19:27:17.640283  6819 provisioner.cpp:416] Provisioner recovery complete
I0830 19:27:17.640707  6801 slave.cpp:6296] Finished recovery
I0830 19:27:17.641165  6801 slave.cpp:6478] Querying resource estimator for oversubscribable
resources
I0830 19:27:17.641412  6821 slave.cpp:6492] Received oversubscribable resources {} from the
resource estimator
I0830 19:27:17.644060  6812 process.cpp:3956] Handling HTTP event for process 'slave(803)'
with path: '/slave(803)/containers'
I0830 19:27:17.645478  6819 http.cpp:1185] HTTP GET for /slave(803)/containers from 172.17.0.3:33720
I0830 19:27:17.645617  6819 http.cpp:976] Authorizing principal 'test-principal' to GET the
'/containers' endpoint
I0830 19:27:17.649247  6780 slave.cpp:859] Agent terminating
[       OK ] Endpoint/SlaveEndpointTest.AuthorizedRequest/2 (32 ms)
[ RUN      ] Endpoint/SlaveEndpointTest.UnauthorizedRequest/0
I0830 19:27:17.660567  6780 containerizer.cpp:290] Using isolation { environment_secret, posix/cpu,
posix/mem, filesystem/posix, network/cni }
W0830 19:27:17.661125  6780 backend.cpp:76] Failed to create 'aufs' backend: AufsBackend requires
root privileges
W0830 19:27:17.661248  6780 backend.cpp:76] Failed to create 'bind' backend: BindBackend requires
root privileges
I0830 19:27:17.661285  6780 provisioner.cpp:255] Using default backend 'copy'
I0830 19:27:17.664777  6801 slave.cpp:252] Mesos agent started on (804)@172.17.0.3:33910
I0830 19:27:17.664801  6801 slave.cpp:253] Flags at startup: --acls="" --appc_simple_discovery_uri_prefix="http://"
--appc_store_dir="/tmp/Endpoint_SlaveEndpointTest_UnauthorizedRequest_0_Xps4ae/store/appc"
--authenticate_http_readonly="true" --authenticate_http_readwrite="true" --authenticatee="crammd5"
--authentication_backoff_factor="1secs" --authorizer="local" --cgroups_cpu_enable_pids_and_tids_count="false"
--cgroups_enable_cfs="false" --cgroups_hierarchy="/sys/fs/cgroup" --cgroups_limit_swap="false"
--cgroups_root="mesos" --container_disk_watch_interval="15secs" --containerizers="mesos" --credential="/tmp/Endpoint_SlaveEndpointTest_UnauthorizedRequest_0_Xps4ae/credential"
--default_role="*" --disallow_sharing_agent_pid_namespace="false" --disk_watch_interval="1mins"
--docker="docker" --docker_kill_orphans="true" --docker_registry="https://registry-1.docker.io"
--docker_remove_delay="6hrs" --docker_socket="/var/run/docker.sock" --docker_stop_timeout="0ns"
--docker_store_dir="/tmp/Endpoint_SlaveEndpointTest_UnauthorizedRequest_0_Xps4ae/store/docker"
--docker_volume_checkpoint_dir="/var/run/mesos/isolators/docker/volume" --enforce_container_disk_quota="false"
--executor_registration_timeout="1mins" --executor_reregistration_timeout="2secs" --executor_shutdown_grace_period="5secs"
--fetcher_cache_dir="/tmp/Endpoint_SlaveEndpointTest_UnauthorizedRequest_0_Xps4ae/fetch" --fetcher_cache_size="2GB"
--frameworks_home="" --gc_delay="1weeks" --gc_disk_headroom="0.1" --hadoop_home="" --help="false"
--hostname_lookup="true" --http_command_executor="false" --http_credentials="/tmp/Endpoint_SlaveEndpointTest_UnauthorizedRequest_0_Xps4ae/http_credentials"
--http_heartbeat_interval="30secs" --initialize_driver_logging="true" --isolation="posix/cpu,posix/mem"
--launcher="posix" --launcher_dir="/mesos/mesos-1.5.0/_build/src" --logbufsecs="0" --logging_level="INFO"
--max_completed_executors_per_framework="150" --oversubscribed_resources_interval="15secs"
--perf_duration="10secs" --perf_interval="1mins" --port="5051" --qos_correction_interval_min="0ns"
--quiet="false" --recover="reconnect" --recovery_timeout="15mins" --registration_backoff_factor="10ms"
--resources="cpus:2;gpus:0;mem:1024;disk:1024;ports:[31000-32000]" --revocable_cpu_low_priority="true"
--runtime_dir="/tmp/Endpoint_SlaveEndpointTest_UnauthorizedRequest_0_Xps4ae" --sandbox_directory="/mnt/mesos/sandbox"
--strict="true" --switch_user="true" --systemd_enable_support="true" --systemd_runtime_directory="/run/systemd/system"
--version="false" --work_dir="/tmp/Endpoint_SlaveEndpointTest_UnauthorizedRequest_0_vBFv5U"
--zk_session_timeout="10secs"
I0830 19:27:17.665241  6801 credentials.hpp:86] Loading credential for authentication from
'/tmp/Endpoint_SlaveEndpointTest_UnauthorizedRequest_0_Xps4ae/credential'
I0830 19:27:17.665410  6801 slave.cpp:285] Agent using credential for: test-principal
I0830 19:27:17.665432  6801 credentials.hpp:37] Loading credentials for authentication from
'/tmp/Endpoint_SlaveEndpointTest_UnauthorizedRequest_0_Xps4ae/http_credentials'
I0830 19:27:17.665681  6801 http.cpp:1045] Creating default 'basic' HTTP authenticator for
realm 'mesos-agent-readonly'
I0830 19:27:17.665849  6801 http.cpp:1045] Creating default 'basic' HTTP authenticator for
realm 'mesos-agent-readwrite'
I0830 19:27:17.667233  6801 slave.cpp:581] Agent resources: [{"name":"cpus","scalar":{"value":2.0},"type":"SCALAR"},{"name":"mem","scalar":{"value":1024.0},"type":"SCALAR"},{"name":"disk","scalar":{"value":1024.0},"type":"SCALAR"},{"name":"ports","ranges":{"range":[{"begin":31000,"end":32000}]},"type":"RANGES"}]
I0830 19:27:17.667460  6801 slave.cpp:589] Agent attributes: [  ]
I0830 19:27:17.667475  6801 slave.cpp:598] Agent hostname: 9dbf26c66ad8
I0830 19:27:17.667601  6822 status_update_manager.cpp:177] Pausing sending status updates
I0830 19:27:17.669266  6809 state.cpp:64] Recovering state from '/tmp/Endpoint_SlaveEndpointTest_UnauthorizedRequest_0_vBFv5U/meta'
I0830 19:27:17.669553  6805 status_update_manager.cpp:203] Recovering status update manager
I0830 19:27:17.669734  6806 containerizer.cpp:646] Recovering containerizer
I0830 19:27:17.670969  6816 provisioner.cpp:416] Provisioner recovery complete
I0830 19:27:17.671262  6801 slave.cpp:6296] Finished recovery
I0830 19:27:17.671670  6801 slave.cpp:6478] Querying resource estimator for oversubscribable
resources
I0830 19:27:17.671881  6811 slave.cpp:6492] Received oversubscribable resources {} from the
resource estimator
I0830 19:27:17.674156  6817 process.cpp:3956] Handling HTTP event for process 'slave(804)'
with path: '/slave(804)/monitor/statistics'
I0830 19:27:17.675243  6805 http.cpp:1185] HTTP GET for /slave(804)/monitor/statistics from
172.17.0.3:33722
I0830 19:27:17.675310  6805 http.cpp:976] Authorizing principal 'test-principal' to GET the
'/monitor/statistics' endpoint
I0830 19:27:17.677500  6809 slave.cpp:859] Agent terminating
[       OK ] Endpoint/SlaveEndpointTest.UnauthorizedRequest/0 (27 ms)
[ RUN      ] Endpoint/SlaveEndpointTest.UnauthorizedRequest/1
I0830 19:27:17.688259  6780 containerizer.cpp:290] Using isolation { environment_secret, posix/cpu,
posix/mem, filesystem/posix, network/cni }
W0830 19:27:17.688799  6780 backend.cpp:76] Failed to create 'aufs' backend: AufsBackend requires
root privileges
W0830 19:27:17.688926  6780 backend.cpp:76] Failed to create 'bind' backend: BindBackend requires
root privileges
I0830 19:27:17.688964  6780 provisioner.cpp:255] Using default backend 'copy'
I0830 19:27:17.692675  6799 slave.cpp:252] Mesos agent started on (805)@172.17.0.3:33910
I0830 19:27:17.692698  6799 slave.cpp:253] Flags at startup: --acls="" --appc_simple_discovery_uri_prefix="http://"
--appc_store_dir="/tmp/Endpoint_SlaveEndpointTest_UnauthorizedRequest_1_B8FpLs/store/appc"
--authenticate_http_readonly="true" --authenticate_http_readwrite="true" --authenticatee="crammd5"
--authentication_backoff_factor="1secs" --authorizer="local" --cgroups_cpu_enable_pids_and_tids_count="false"
--cgroups_enable_cfs="false" --cgroups_hierarchy="/sys/fs/cgroup" --cgroups_limit_swap="false"
--cgroups_root="mesos" --container_disk_watch_interval="15secs" --containerizers="mesos" --credential="/tmp/Endpoint_SlaveEndpointTest_UnauthorizedRequest_1_B8FpLs/credential"
--default_role="*" --disallow_sharing_agent_pid_namespace="false" --disk_watch_interval="1mins"
--docker="docker" --docker_kill_orphans="true" --docker_registry="https://registry-1.docker.io"
--docker_remove_delay="6hrs" --docker_socket="/var/run/docker.sock" --docker_stop_timeout="0ns"
--docker_store_dir="/tmp/Endpoint_SlaveEndpointTest_UnauthorizedRequest_1_B8FpLs/store/docker"
--docker_volume_checkpoint_dir="/var/run/mesos/isolators/docker/volume" --enforce_container_disk_quota="false"
--executor_registration_timeout="1mins" --executor_reregistration_timeout="2secs" --executor_shutdown_grace_period="5secs"
--fetcher_cache_dir="/tmp/Endpoint_SlaveEndpointTest_UnauthorizedRequest_1_B8FpLs/fetch" --fetcher_cache_size="2GB"
--frameworks_home="" --gc_delay="1weeks" --gc_disk_headroom="0.1" --hadoop_home="" --help="false"
--hostname_lookup="true" --http_command_executor="false" --http_credentials="/tmp/Endpoint_SlaveEndpointTest_UnauthorizedRequest_1_B8FpLs/http_credentials"
--http_heartbeat_interval="30secs" --initialize_driver_logging="true" --isolation="posix/cpu,posix/mem"
--launcher="posix" --launcher_dir="/mesos/mesos-1.5.0/_build/src" --logbufsecs="0" --logging_level="INFO"
--max_completed_executors_per_framework="150" --oversubscribed_resources_interval="15secs"
--perf_duration="10secs" --perf_interval="1mins" --port="5051" --qos_correction_interval_min="0ns"
--quiet="false" --recover="reconnect" --recovery_timeout="15mins" --registration_backoff_factor="10ms"
--resources="cpus:2;gpus:0;mem:1024;disk:1024;ports:[31000-32000]" --revocable_cpu_low_priority="true"
--runtime_dir="/tmp/Endpoint_SlaveEndpointTest_UnauthorizedRequest_1_B8FpLs" --sandbox_directory="/mnt/mesos/sandbox"
--strict="true" --switch_user="true" --systemd_enable_support="true" --systemd_runtime_directory="/run/systemd/system"
--version="false" --work_dir="/tmp/Endpoint_SlaveEndpointTest_UnauthorizedRequest_1_bDSIB9"
--zk_session_timeout="10secs"
I0830 19:27:17.693058  6799 credentials.hpp:86] Loading credential for authentication from
'/tmp/Endpoint_SlaveEndpointTest_UnauthorizedRequest_1_B8FpLs/credential'
I0830 19:27:17.693202  6799 slave.cpp:285] Agent using credential for: test-principal
I0830 19:27:17.693222  6799 credentials.hpp:37] Loading credentials for authentication from
'/tmp/Endpoint_SlaveEndpointTest_UnauthorizedRequest_1_B8FpLs/http_credentials'
I0830 19:27:17.693449  6799 http.cpp:1045] Creating default 'basic' HTTP authenticator for
realm 'mesos-agent-readonly'
I0830 19:27:17.693598  6799 http.cpp:1045] Creating default 'basic' HTTP authenticator for
realm 'mesos-agent-readwrite'
I0830 19:27:17.694921  6799 slave.cpp:581] Agent resources: [{"name":"cpus","scalar":{"value":2.0},"type":"SCALAR"},{"name":"mem","scalar":{"value":1024.0},"type":"SCALAR"},{"name":"disk","scalar":{"value":1024.0},"type":"SCALAR"},{"name":"ports","ranges":{"range":[{"begin":31000,"end":32000}]},"type":"RANGES"}]
I0830 19:27:17.695147  6799 slave.cpp:589] Agent attributes: [  ]
I0830 19:27:17.695161  6799 slave.cpp:598] Agent hostname: 9dbf26c66ad8
I0830 19:27:17.695291  6813 status_update_manager.cpp:177] Pausing sending status updates
I0830 19:27:17.696614  6812 state.cpp:64] Recovering state from '/tmp/Endpoint_SlaveEndpointTest_UnauthorizedRequest_1_bDSIB9/meta'
I0830 19:27:17.696882  6807 status_update_manager.cpp:203] Recovering status update manager
I0830 19:27:17.697101  6800 containerizer.cpp:646] Recovering containerizer
I0830 19:27:17.698403  6810 provisioner.cpp:416] Provisioner recovery complete
I0830 19:27:17.698711  6803 slave.cpp:6296] Finished recovery
I0830 19:27:17.699124  6803 slave.cpp:6478] Querying resource estimator for oversubscribable
resources
I0830 19:27:17.699337  6806 slave.cpp:6492] Received oversubscribable resources {} from the
resource estimator
I0830 19:27:17.701519  6822 process.cpp:3956] Handling HTTP event for process 'slave(805)'
with path: '/slave(805)/monitor/statistics.json'
I0830 19:27:17.702627  6812 http.cpp:1185] HTTP GET for /slave(805)/monitor/statistics.json
from 172.17.0.3:33724
I0830 19:27:17.702740  6812 http.cpp:976] Authorizing principal 'test-principal' to GET the
'/monitor/statistics.json' endpoint
I0830 19:27:17.704712  6807 slave.cpp:859] Agent terminating
[       OK ] Endpoint/SlaveEndpointTest.UnauthorizedRequest/1 (27 ms)
[ RUN      ] Endpoint/SlaveEndpointTest.UnauthorizedRequest/2
I0830 19:27:17.715788  6780 containerizer.cpp:290] Using isolation { environment_secret, posix/cpu,
posix/mem, filesystem/posix, network/cni }
W0830 19:27:17.716333  6780 backend.cpp:76] Failed to create 'aufs' backend: AufsBackend requires
root privileges
W0830 19:27:17.716440  6780 backend.cpp:76] Failed to create 'bind' backend: BindBackend requires
root privileges
I0830 19:27:17.716471  6780 provisioner.cpp:255] Using default backend 'copy'
I0830 19:27:17.719909  6802 slave.cpp:252] Mesos agent started on (806)@172.17.0.3:33910
I0830 19:27:17.719933  6802 slave.cpp:253] Flags at startup: --acls="" --appc_simple_discovery_uri_prefix="http://"
--appc_store_dir="/tmp/Endpoint_SlaveEndpointTest_UnauthorizedRequest_2_3AM1BH/store/appc"
--authenticate_http_readonly="true" --authenticate_http_readwrite="true" --authenticatee="crammd5"
--authentication_backoff_factor="1secs" --authorizer="local" --cgroups_cpu_enable_pids_and_tids_count="false"
--cgroups_enable_cfs="false" --cgroups_hierarchy="/sys/fs/cgroup" --cgroups_limit_swap="false"
--cgroups_root="mesos" --container_disk_watch_interval="15secs" --containerizers="mesos" --credential="/tmp/Endpoint_SlaveEndpointTest_UnauthorizedRequest_2_3AM1BH/credential"
--default_role="*" --disallow_sharing_agent_pid_namespace="false" --disk_watch_interval="1mins"
--docker="docker" --docker_kill_orphans="true" --docker_registry="https://registry-1.docker.io"
--docker_remove_delay="6hrs" --docker_socket="/var/run/docker.sock" --docker_stop_timeout="0ns"
--docker_store_dir="/tmp/Endpoint_SlaveEndpointTest_UnauthorizedRequest_2_3AM1BH/store/docker"
--docker_volume_checkpoint_dir="/var/run/mesos/isolators/docker/volume" --enforce_container_disk_quota="false"
--executor_registration_timeout="1mins" --executor_reregistration_timeout="2secs" --executor_shutdown_grace_period="5secs"
--fetcher_cache_dir="/tmp/Endpoint_SlaveEndpointTest_UnauthorizedRequest_2_3AM1BH/fetch" --fetcher_cache_size="2GB"
--frameworks_home="" --gc_delay="1weeks" --gc_disk_headroom="0.1" --hadoop_home="" --help="false"
--hostname_lookup="true" --http_command_executor="false" --http_credentials="/tmp/Endpoint_SlaveEndpointTest_UnauthorizedRequest_2_3AM1BH/http_credentials"
--http_heartbeat_interval="30secs" --initialize_driver_logging="true" --isolation="posix/cpu,posix/mem"
--launcher="posix" --launcher_dir="/mesos/mesos-1.5.0/_build/src" --logbufsecs="0" --logging_level="INFO"
--max_completed_executors_per_framework="150" --oversubscribed_resources_interval="15secs"
--perf_duration="10secs" --perf_interval="1mins" --port="5051" --qos_correction_interval_min="0ns"
--quiet="false" --recover="reconnect" --recovery_timeout="15mins" --registration_backoff_factor="10ms"
--resources="cpus:2;gpus:0;mem:1024;disk:1024;ports:[31000-32000]" --revocable_cpu_low_priority="true"
--runtime_dir="/tmp/Endpoint_SlaveEndpointTest_UnauthorizedRequest_2_3AM1BH" --sandbox_directory="/mnt/mesos/sandbox"
--strict="true" --switch_user="true" --systemd_enable_support="true" --systemd_runtime_directory="/run/systemd/system"
--version="false" --work_dir="/tmp/Endpoint_SlaveEndpointTest_UnauthorizedRequest_2_DSbhoo"
--zk_session_timeout="10secs"
I0830 19:27:17.720281  6802 credentials.hpp:86] Loading credential for authentication from
'/tmp/Endpoint_SlaveEndpointTest_UnauthorizedRequest_2_3AM1BH/credential'
I0830 19:27:17.720422  6802 slave.cpp:285] Agent using credential for: test-principal
I0830 19:27:17.720443  6802 credentials.hpp:37] Loading credentials for authentication from
'/tmp/Endpoint_SlaveEndpointTest_UnauthorizedRequest_2_3AM1BH/http_credentials'
I0830 19:27:17.720700  6802 http.cpp:1045] Creating default 'basic' HTTP authenticator for
realm 'mesos-agent-readonly'
I0830 19:27:17.720845  6802 http.cpp:1045] Creating default 'basic' HTTP authenticator for
realm 'mesos-agent-readwrite'
I0830 19:27:17.722174  6802 slave.cpp:581] Agent resources: [{"name":"cpus","scalar":{"value":2.0},"type":"SCALAR"},{"name":"mem","scalar":{"value":1024.0},"type":"SCALAR"},{"name":"disk","scalar":{"value":1024.0},"type":"SCALAR"},{"name":"ports","ranges":{"range":[{"begin":31000,"end":32000}]},"type":"RANGES"}]
I0830 19:27:17.722399  6802 slave.cpp:589] Agent attributes: [  ]
I0830 19:27:17.722411  6802 slave.cpp:598] Agent hostname: 9dbf26c66ad8
I0830 19:27:17.722540  6811 status_update_manager.cpp:177] Pausing sending status updates
I0830 19:27:17.723889  6820 state.cpp:64] Recovering state from '/tmp/Endpoint_SlaveEndpointTest_UnauthorizedRequest_2_DSbhoo/meta'
I0830 19:27:17.724140  6819 status_update_manager.cpp:203] Recovering status update manager
I0830 19:27:17.724334  6813 containerizer.cpp:646] Recovering containerizer
I0830 19:27:17.725579  6803 provisioner.cpp:416] Provisioner recovery complete
I0830 19:27:17.725859  6804 slave.cpp:6296] Finished recovery
I0830 19:27:17.726284  6804 slave.cpp:6478] Querying resource estimator for oversubscribable
resources
I0830 19:27:17.726521  6815 slave.cpp:6492] Received oversubscribable resources {} from the
resource estimator
I0830 19:27:17.728715  6810 process.cpp:3956] Handling HTTP event for process 'slave(806)'
with path: '/slave(806)/containers'
I0830 19:27:17.729918  6820 http.cpp:1185] HTTP GET for /slave(806)/containers from 172.17.0.3:33726
I0830 19:27:17.729984  6820 http.cpp:976] Authorizing principal 'test-principal' to GET the
'/containers' endpoint
I0830 19:27:17.731828  6807 slave.cpp:859] Agent terminating
[       OK ] Endpoint/SlaveEndpointTest.UnauthorizedRequest/2 (27 ms)
[ RUN      ] Endpoint/SlaveEndpointTest.NoAuthorizer/0
I0830 19:27:17.742812  6780 containerizer.cpp:290] Using isolation { environment_secret, posix/cpu,
posix/mem, filesystem/posix, network/cni }
W0830 19:27:17.743337  6780 backend.cpp:76] Failed to create 'aufs' backend: AufsBackend requires
root privileges
W0830 19:27:17.743443  6780 backend.cpp:76] Failed to create 'bind' backend: BindBackend requires
root privileges
I0830 19:27:17.743475  6780 provisioner.cpp:255] Using default backend 'copy'
I0830 19:27:17.745174  6780 cluster.cpp:448] Creating default 'local' authorizer
I0830 19:27:17.747193  6805 slave.cpp:252] Mesos agent started on (807)@172.17.0.3:33910
I0830 19:27:17.747215  6805 slave.cpp:253] Flags at startup: --acls="" --appc_simple_discovery_uri_prefix="http://"
--appc_store_dir="/tmp/Endpoint_SlaveEndpointTest_NoAuthorizer_0_XYyJIW/store/appc" --authenticate_http_readonly="true"
--authenticate_http_readwrite="true" --authenticatee="crammd5" --authentication_backoff_factor="1secs"
--authorizer="local" --cgroups_cpu_enable_pids_and_tids_count="false" --cgroups_enable_cfs="false"
--cgroups_hierarchy="/sys/fs/cgroup" --cgroups_limit_swap="false" --cgroups_root="mesos" --container_disk_watch_interval="15secs"
--containerizers="mesos" --credential="/tmp/Endpoint_SlaveEndpointTest_NoAuthorizer_0_XYyJIW/credential"
--default_role="*" --disallow_sharing_agent_pid_namespace="false" --disk_watch_interval="1mins"
--docker="docker" --docker_kill_orphans="true" --docker_registry="https://registry-1.docker.io"
--docker_remove_delay="6hrs" --docker_socket="/var/run/docker.sock" --docker_stop_timeout="0ns"
--docker_store_dir="/tmp/Endpoint_SlaveEndpointTest_NoAuthorizer_0_XYyJIW/store/docker" --docker_volume_checkpoint_dir="/var/run/mesos/isolators/docker/volume"
--enforce_container_disk_quota="false" --executor_registration_timeout="1mins" --executor_reregistration_timeout="2secs"
--executor_shutdown_grace_period="5secs" --fetcher_cache_dir="/tmp/Endpoint_SlaveEndpointTest_NoAuthorizer_0_XYyJIW/fetch"
--fetcher_cache_size="2GB" --frameworks_home="" --gc_delay="1weeks" --gc_disk_headroom="0.1"
--hadoop_home="" --help="false" --hostname_lookup="true" --http_command_executor="false" --http_credentials="/tmp/Endpoint_SlaveEndpointTest_NoAuthorizer_0_XYyJIW/http_credentials"
--http_heartbeat_interval="30secs" --initialize_driver_logging="true" --isolation="posix/cpu,posix/mem"
--launcher="posix" --launcher_dir="/mesos/mesos-1.5.0/_build/src" --logbufsecs="0" --logging_level="INFO"
--max_completed_executors_per_framework="150" --oversubscribed_resources_interval="15secs"
--perf_duration="10secs" --perf_interval="1mins" --port="5051" --qos_correction_interval_min="0ns"
--quiet="false" --recover="reconnect" --recovery_timeout="15mins" --registration_backoff_factor="10ms"
--resources="cpus:2;gpus:0;mem:1024;disk:1024;ports:[31000-32000]" --revocable_cpu_low_priority="true"
--runtime_dir="/tmp/Endpoint_SlaveEndpointTest_NoAuthorizer_0_XYyJIW" --sandbox_directory="/mnt/mesos/sandbox"
--strict="true" --switch_user="true" --systemd_enable_support="true" --systemd_runtime_directory="/run/systemd/system"
--version="false" --work_dir="/tmp/Endpoint_SlaveEndpointTest_NoAuthorizer_0_9RiYqD" --zk_session_timeout="10secs"
I0830 19:27:17.747607  6805 credentials.hpp:86] Loading credential for authentication from
'/tmp/Endpoint_SlaveEndpointTest_NoAuthorizer_0_XYyJIW/credential'
I0830 19:27:17.747756  6805 slave.cpp:285] Agent using credential for: test-principal
I0830 19:27:17.747787  6805 credentials.hpp:37] Loading credentials for authentication from
'/tmp/Endpoint_SlaveEndpointTest_NoAuthorizer_0_XYyJIW/http_credentials'
I0830 19:27:17.748054  6805 http.cpp:1045] Creating default 'basic' HTTP authenticator for
realm 'mesos-agent-readonly'
I0830 19:27:17.748219  6805 http.cpp:1045] Creating default 'basic' HTTP authenticator for
realm 'mesos-agent-readwrite'
I0830 19:27:17.749604  6805 slave.cpp:581] Agent resources: [{"name":"cpus","scalar":{"value":2.0},"type":"SCALAR"},{"name":"mem","scalar":{"value":1024.0},"type":"SCALAR"},{"name":"disk","scalar":{"value":1024.0},"type":"SCALAR"},{"name":"ports","ranges":{"range":[{"begin":31000,"end":32000}]},"type":"RANGES"}]
I0830 19:27:17.749835  6805 slave.cpp:589] Agent attributes: [  ]
I0830 19:27:17.749851  6805 slave.cpp:598] Agent hostname: 9dbf26c66ad8
I0830 19:27:17.750011  6817 status_update_manager.cpp:177] Pausing sending status updates
I0830 19:27:17.751385  6816 state.cpp:64] Recovering state from '/tmp/Endpoint_SlaveEndpointTest_NoAuthorizer_0_9RiYqD/meta'
I0830 19:27:17.751670  6799 status_update_manager.cpp:203] Recovering status update manager
I0830 19:27:17.751842  6813 containerizer.cpp:646] Recovering containerizer
I0830 19:27:17.753278  6807 provisioner.cpp:416] Provisioner recovery complete
I0830 19:27:17.753577  6805 slave.cpp:6296] Finished recovery
I0830 19:27:17.754001  6805 slave.cpp:6478] Querying resource estimator for oversubscribable
resources
I0830 19:27:17.754204  6803 slave.cpp:6492] Received oversubscribable resources {} from the
resource estimator
I0830 19:27:17.756259  6806 process.cpp:3956] Handling HTTP event for process 'slave(807)'
with path: '/slave(807)/monitor/statistics'
I0830 19:27:17.757369  6804 http.cpp:1185] HTTP GET for /slave(807)/monitor/statistics from
172.17.0.3:33728
I0830 19:27:17.757447  6804 http.cpp:976] Authorizing principal 'test-principal' to GET the
'/monitor/statistics' endpoint
I0830 19:27:17.760293  6818 slave.cpp:859] Agent terminating
[       OK ] Endpoint/SlaveEndpointTest.NoAuthorizer/0 (28 ms)
[ RUN      ] Endpoint/SlaveEndpointTest.NoAuthorizer/1
I0830 19:27:17.771317  6780 containerizer.cpp:290] Using isolation { environment_secret, posix/cpu,
posix/mem, filesystem/posix, network/cni }
W0830 19:27:17.771797  6780 backend.cpp:76] Failed to create 'aufs' backend: AufsBackend requires
root privileges
W0830 19:27:17.771904  6780 backend.cpp:76] Failed to create 'bind' backend: BindBackend requires
root privileges
I0830 19:27:17.771936  6780 provisioner.cpp:255] Using default backend 'copy'
I0830 19:27:17.773581  6780 cluster.cpp:448] Creating default 'local' authorizer
I0830 19:27:17.775463  6819 slave.cpp:252] Mesos agent started on (808)@172.17.0.3:33910
I0830 19:27:17.775486  6819 slave.cpp:253] Flags at startup: --acls="" --appc_simple_discovery_uri_prefix="http://"
--appc_store_dir="/tmp/Endpoint_SlaveEndpointTest_NoAuthorizer_1_50Uh6b/store/appc" --authenticate_http_readonly="true"
--authenticate_http_readwrite="true" --authenticatee="crammd5" --authentication_backoff_factor="1secs"
--authorizer="local" --cgroups_cpu_enable_pids_and_tids_count="false" --cgroups_enable_cfs="false"
--cgroups_hierarchy="/sys/fs/cgroup" --cgroups_limit_swap="false" --cgroups_root="mesos" --container_disk_watch_interval="15secs"
--containerizers="mesos" --credential="/tmp/Endpoint_SlaveEndpointTest_NoAuthorizer_1_50Uh6b/credential"
--default_role="*" --disallow_sharing_agent_pid_namespace="false" --disk_watch_interval="1mins"
--docker="docker" --docker_kill_orphans="true" --docker_registry="https://registry-1.docker.io"
--docker_remove_delay="6hrs" --docker_socket="/var/run/docker.sock" --docker_stop_timeout="0ns"
--docker_store_dir="/tmp/Endpoint_SlaveEndpointTest_NoAuthorizer_1_50Uh6b/store/docker" --docker_volume_checkpoint_dir="/var/run/mesos/isolators/docker/volume"
--enforce_container_disk_quota="false" --executor_registration_timeout="1mins" --executor_reregistration_timeout="2secs"
--executor_shutdown_grace_period="5secs" --fetcher_cache_dir="/tmp/Endpoint_SlaveEndpointTest_NoAuthorizer_1_50Uh6b/fetch"
--fetcher_cache_size="2GB" --frameworks_home="" --gc_delay="1weeks" --gc_disk_headroom="0.1"
--hadoop_home="" --help="false" --hostname_lookup="true" --http_command_executor="false" --http_credentials="/tmp/Endpoint_SlaveEndpointTest_NoAuthorizer_1_50Uh6b/http_credentials"
--http_heartbeat_interval="30secs" --initialize_driver_logging="true" --isolation="posix/cpu,posix/mem"
--launcher="posix" --launcher_dir="/mesos/mesos-1.5.0/_build/src" --logbufsecs="0" --logging_level="INFO"
--max_completed_executors_per_framework="150" --oversubscribed_resources_interval="15secs"
--perf_duration="10secs" --perf_interval="1mins" --port="5051" --qos_correction_interval_min="0ns"
--quiet="false" --recover="reconnect" --recovery_timeout="15mins" --registration_backoff_factor="10ms"
--resources="cpus:2;gpus:0;mem:1024;disk:1024;ports:[31000-32000]" --revocable_cpu_low_priority="true"
--runtime_dir="/tmp/Endpoint_SlaveEndpointTest_NoAuthorizer_1_50Uh6b" --sandbox_directory="/mnt/mesos/sandbox"
--strict="true" --switch_user="true" --systemd_enable_support="true" --systemd_runtime_directory="/run/systemd/system"
--version="false" --work_dir="/tmp/Endpoint_SlaveEndpointTest_NoAuthorizer_1_FJAhKS" --zk_session_timeout="10secs"
I0830 19:27:17.775847  6819 credentials.hpp:86] Loading credential for authentication from
'/tmp/Endpoint_SlaveEndpointTest_NoAuthorizer_1_50Uh6b/credential'
I0830 19:27:17.775996  6819 slave.cpp:285] Agent using credential for: test-principal
I0830 19:27:17.776047  6819 credentials.hpp:37] Loading credentials for authentication from
'/tmp/Endpoint_SlaveEndpointTest_NoAuthorizer_1_50Uh6b/http_credentials'
I0830 19:27:17.776288  6819 http.cpp:1045] Creating default 'basic' HTTP authenticator for
realm 'mesos-agent-readonly'
I0830 19:27:17.776438  6819 http.cpp:1045] Creating default 'basic' HTTP authenticator for
realm 'mesos-agent-readwrite'
I0830 19:27:17.777853  6819 slave.cpp:581] Agent resources: [{"name":"cpus","scalar":{"value":2.0},"type":"SCALAR"},{"name":"mem","scalar":{"value":1024.0},"type":"SCALAR"},{"name":"disk","scalar":{"value":1024.0},"type":"SCALAR"},{"name":"ports","ranges":{"range":[{"begin":31000,"end":32000}]},"type":"RANGES"}]
I0830 19:27:17.778080  6819 slave.cpp:589] Agent attributes: [  ]
I0830 19:27:17.778095  6819 slave.cpp:598] Agent hostname: 9dbf26c66ad8
I0830 19:27:17.778209  6818 status_update_manager.cpp:177] Pausing sending status updates
I0830 19:27:17.779534  6801 state.cpp:64] Recovering state from '/tmp/Endpoint_SlaveEndpointTest_NoAuthorizer_1_FJAhKS/meta'
I0830 19:27:17.779817  6813 status_update_manager.cpp:203] Recovering status update manager
I0830 19:27:17.780000  6812 containerizer.cpp:646] Recovering containerizer
I0830 19:27:17.781392  6807 provisioner.cpp:416] Provisioner recovery complete
I0830 19:27:17.781736  6819 slave.cpp:6296] Finished recovery
I0830 19:27:17.782126  6819 slave.cpp:6478] Querying resource estimator for oversubscribable
resources
I0830 19:27:17.782316  6800 slave.cpp:6492] Received oversubscribable resources {} from the
resource estimator
I0830 19:27:17.784389  6821 process.cpp:3956] Handling HTTP event for process 'slave(808)'
with path: '/slave(808)/monitor/statistics.json'
I0830 19:27:17.785794  6801 http.cpp:1185] HTTP GET for /slave(808)/monitor/statistics.json
from 172.17.0.3:33732
I0830 19:27:17.785928  6801 http.cpp:976] Authorizing principal 'test-principal' to GET the
'/monitor/statistics.json' endpoint
I0830 19:27:17.788410  6813 slave.cpp:859] Agent terminating
[       OK ] Endpoint/SlaveEndpointTest.NoAuthorizer/1 (28 ms)
[ RUN      ] Endpoint/SlaveEndpointTest.NoAuthorizer/2
I0830 19:27:17.801219  6780 containerizer.cpp:290] Using isolation { environment_secret, posix/cpu,
posix/mem, filesystem/posix, network/cni }
W0830 19:27:17.801698  6780 backend.cpp:76] Failed to create 'aufs' backend: AufsBackend requires
root privileges
W0830 19:27:17.801813  6780 backend.cpp:76] Failed to create 'bind' backend: BindBackend requires
root privileges
I0830 19:27:17.801846  6780 provisioner.cpp:255] Using default backend 'copy'
I0830 19:27:17.803483  6780 cluster.cpp:448] Creating default 'local' authorizer
I0830 19:27:17.805335  6806 slave.cpp:252] Mesos agent started on (809)@172.17.0.3:33910
I0830 19:27:17.805359  6806 slave.cpp:253] Flags at startup: --acls="" --appc_simple_discovery_uri_prefix="http://"
--appc_store_dir="/tmp/Endpoint_SlaveEndpointTest_NoAuthorizer_2_KZthLr/store/appc" --authenticate_http_readonly="true"
--authenticate_http_readwrite="true" --authenticatee="crammd5" --authentication_backoff_factor="1secs"
--authorizer="local" --cgroups_cpu_enable_pids_and_tids_count="false" --cgroups_enable_cfs="false"
--cgroups_hierarchy="/sys/fs/cgroup" --cgroups_limit_swap="false" --cgroups_root="mesos" --container_disk_watch_interval="15secs"
--containerizers="mesos" --credential="/tmp/Endpoint_SlaveEndpointTest_NoAuthorizer_2_KZthLr/credential"
--default_role="*" --disallow_sharing_agent_pid_namespace="false" --disk_watch_interval="1mins"
--docker="docker" --docker_kill_orphans="true" --docker_registry="https://registry-1.docker.io"
--docker_remove_delay="6hrs" --docker_socket="/var/run/docker.sock" --docker_stop_timeout="0ns"
--docker_store_dir="/tmp/Endpoint_SlaveEndpointTest_NoAuthorizer_2_KZthLr/store/docker" --docker_volume_checkpoint_dir="/var/run/mesos/isolators/docker/volume"
--enforce_container_disk_quota="false" --executor_registration_timeout="1mins" --executor_reregistration_timeout="2secs"
--executor_shutdown_grace_period="5secs" --fetcher_cache_dir="/tmp/Endpoint_SlaveEndpointTest_NoAuthorizer_2_KZthLr/fetch"
--fetcher_cache_size="2GB" --frameworks_home="" --gc_delay="1weeks" --gc_disk_headroom="0.1"
--hadoop_home="" --help="false" --hostname_lookup="true" --http_command_executor="false" --http_credentials="/tmp/Endpoint_SlaveEndpointTest_NoAuthorizer_2_KZthLr/http_credentials"
--http_heartbeat_interval="30secs" --initialize_driver_logging="true" --isolation="posix/cpu,posix/mem"
--launcher="posix" --launcher_dir="/mesos/mesos-1.5.0/_build/src" --logbufsecs="0" --logging_level="INFO"
--max_completed_executors_per_framework="150" --oversubscribed_resources_interval="15secs"
--perf_duration="10secs" --perf_interval="1mins" --port="5051" --qos_correction_interval_min="0ns"
--quiet="false" --recover="reconnect" --recovery_timeout="15mins" --registration_backoff_factor="10ms"
--resources="cpus:2;gpus:0;mem:1024;disk:1024;ports:[31000-32000]" --revocable_cpu_low_priority="true"
--runtime_dir="/tmp/Endpoint_SlaveEndpointTest_NoAuthorizer_2_KZthLr" --sandbox_directory="/mnt/mesos/sandbox"
--strict="true" --switch_user="true" --systemd_enable_support="true" --systemd_runtime_directory="/run/systemd/system"
--version="false" --work_dir="/tmp/Endpoint_SlaveEndpointTest_NoAuthorizer_2_2YUPk8" --zk_session_timeout="10secs"
I0830 19:27:17.805723  6806 credentials.hpp:86] Loading credential for authentication from
'/tmp/Endpoint_SlaveEndpointTest_NoAuthorizer_2_KZthLr/credential'
I0830 19:27:17.805872  6806 slave.cpp:285] Agent using credential for: test-principal
I0830 19:27:17.805896  6806 credentials.hpp:37] Loading credentials for authentication from
'/tmp/Endpoint_SlaveEndpointTest_NoAuthorizer_2_KZthLr/http_credentials'
I0830 19:27:17.806121  6806 http.cpp:1045] Creating default 'basic' HTTP authenticator for
realm 'mesos-agent-readonly'
I0830 19:27:17.806269  6806 http.cpp:1045] Creating default 'basic' HTTP authenticator for
realm 'mesos-agent-readwrite'
I0830 19:27:17.807693  6806 slave.cpp:581] Agent resources: [{"name":"cpus","scalar":{"value":2.0},"type":"SCALAR"},{"name":"mem","scalar":{"value":1024.0},"type":"SCALAR"},{"name":"disk","scalar":{"value":1024.0},"type":"SCALAR"},{"name":"ports","ranges":{"range":[{"begin":31000,"end":32000}]},"type":"RANGES"}]
I0830 19:27:17.807929  6806 slave.cpp:589] Agent attributes: [  ]
I0830 19:27:17.807943  6806 slave.cpp:598] Agent hostname: 9dbf26c66ad8
I0830 19:27:17.808118  6808 status_update_manager.cpp:177] Pausing sending status updates
I0830 19:27:17.809720  6819 state.cpp:64] Recovering state from '/tmp/Endpoint_SlaveEndpointTest_NoAuthorizer_2_2YUPk8/meta'
I0830 19:27:17.810034  6810 status_update_manager.cpp:203] Recovering status update manager
I0830 19:27:17.810214  6820 containerizer.cpp:646] Recovering containerizer
I0830 19:27:17.811539  6799 provisioner.cpp:416] Provisioner recovery complete
I0830 19:27:17.811889  6817 slave.cpp:6296] Finished recovery
I0830 19:27:17.812288  6817 slave.cpp:6478] Querying resource estimator for oversubscribable
resources
I0830 19:27:17.812500  6816 slave.cpp:6492] Received oversubscribable resources {} from the
resource estimator
I0830 19:27:17.814771  6815 process.cpp:3956] Handling HTTP event for process 'slave(809)'
with path: '/slave(809)/containers'
I0830 19:27:17.815918  6802 http.cpp:1185] HTTP GET for /slave(809)/containers from 172.17.0.3:33734
I0830 19:27:17.815986  6802 http.cpp:976] Authorizing principal 'test-principal' to GET the
'/containers' endpoint
I0830 19:27:17.819270  6806 slave.cpp:859] Agent terminating
[       OK ] Endpoint/SlaveEndpointTest.NoAuthorizer/2 (29 ms)
[----------] 9 tests from Endpoint/SlaveEndpointTest (266 ms total)

[----------] 2 tests from ContainerizerType/DefaultContainerDNSFlagTest
[ RUN      ] ContainerizerType/DefaultContainerDNSFlagTest.ValidateFlag/0
[       OK ] ContainerizerType/DefaultContainerDNSFlagTest.ValidateFlag/0 (10 ms)
[ RUN      ] ContainerizerType/DefaultContainerDNSFlagTest.ValidateFlag/1
[       OK ] ContainerizerType/DefaultContainerDNSFlagTest.ValidateFlag/1 (10 ms)
[----------] 2 tests from ContainerizerType/DefaultContainerDNSFlagTest (20 ms total)

[----------] Global test environment tear-down
[==========] 1660 tests from 183 test cases ran. (566266 ms total)
[  PASSED  ] 1659 tests.
[  FAILED  ] 1 test, listed below:
[  FAILED  ] MasterTest.IgnoreOldAgentReregistration

 1 FAILED TEST
  YOU HAVE 20 DISABLED TESTS

I0830 19:27:17.906636  6823 process.cpp:1072] Failed to accept socket: future discarded
make[4]: *** [check-local] Error 1
make[4]: Leaving directory `/mesos/mesos-1.5.0/_build/src'
make[3]: *** [check-am] Error 2
make[3]: Leaving directory `/mesos/mesos-1.5.0/_build/src'
make[2]: *** [check] Error 2
make[2]: Leaving directory `/mesos/mesos-1.5.0/_build/src'
make[1]: *** [check-recursive] Error 1
make[1]: Leaving directory `/mesos/mesos-1.5.0/_build'
make: *** [distcheck] Error 1
+ docker rmi mesos-1504118611-5776
Untagged: mesos-1504118611-5776:latest
Deleted: sha256:bd78d07b6b95b637866e4f39ad6b44739e81b08ec3d8a1f72c91a50dbc8be0ae
Deleted: sha256:72f87ea66611ce45c3ef539923743cfb4582b74599099fd058b16eeb874332f1
Deleted: sha256:88781d1b7dff62c273c20d3608a0e1162c902e694d60b81e5ba5d10b77155b38
Deleted: sha256:7f848a26db7833e927a7bf30f93365e02d7871e9468dc05e45475ab2bf4fd22f
Deleted: sha256:f3a829f4944d92b8b639ec885ede98fe33bcd757fc08dd302793c07a6da63fae
Deleted: sha256:03a89f7236588a9ce82a77d008fdca6e90b2d5792c6663e28b910eadcf14e789
Deleted: sha256:b0ed898414bb17356b0b2152d3e38cc4f9b658275596b939dc7e9042ec1552a6
Deleted: sha256:34c779ff04a1bf8a804c222f2baac13b9c0ea7d9f01f1e4ad74ec47182028b65
Deleted: sha256:537bf1f10c1dd9e5b1f9f12dd51cde6c4c0103848ab48884340b702d8ff13654
Deleted: sha256:03ec196af2fc5c610f9a260b769daa765b0b02c880885531616b3287c94b0a1c
Deleted: sha256:c93fa36be80a15c7d5ec8834616e23beb055f5abefd88b59ebecb4c769e46065
Deleted: sha256:6194f3b196f0f8f4b02fba38c5842182cb47b14ea2db7871a07b4d403e3aed3e
Deleted: sha256:41435bba93ebee9e839a67ddaf18ca94eb84a62e50890d615ea104ea84148a68
Deleted: sha256:bfd38e5c1e3f969eb6bd2fc3941d543081bf77b19e843680571d129326d03e55
Deleted: sha256:4da6f893e01bcb01fbbf45f429d387990b4fc304730f0e5756c19d4890a751af
Deleted: sha256:17185da0892b8ea91064c141bf0e243f1026787d29489ffa2c1589480067d284
Deleted: sha256:4a019aae68c031c3c626007b708e072b6bb678edfb91bd210accd156c02efceb
Deleted: sha256:15f08ba502e66a13fe2b4f21221560b9ffdca9949629e653b4fa1cc58aab7379
Deleted: sha256:69c69a46d8af424f80d95f91a409cc76fd0db76a2a46ab963371d7b156197e5c
Deleted: sha256:8f5297a6cd5b3c2a74f6dab22309ccd7fb598b1a23b659b7071bd0c2ad37b03e
Deleted: sha256:aca73a6d87fdeaa7096f23262776a3de0344caf186e501e2b88e2f4b6f6b9180
Deleted: sha256:f0e5f38fcda8d41ad08dd38d1bd1c6ded7e777b51160e067eb96267e3c09473d
Deleted: sha256:3b97e2f6a9061da275253f488d67a56c17646117eda726f0e696d1777c47fc27
Deleted: sha256:4c0c304a5421028fbb317f14dbcbc269dd38aab841d07b5af4594310b5edda37
Deleted: sha256:c37349eff15629fa2503dff7f5fad71570f3e0d8bf641ad6a9becc12840930ff
Build step 'Execute shell' marked build as failure
Not sending mail to unregistered user yujie.jay@gmail.com
Not sending mail to unregistered user benjamin.hindman@gmail.com
Not sending mail to unregistered user xujyan@apple.com

Mime
View raw message