mesos-builds mailing list archives

Site index · List index
Message view « Date » · « Thread »
Top « Date » · « Thread »
From Apache Jenkins Server <jenk...@builds.apache.org>
Subject Build failed in Jenkins: Mesos-Reviewbot #18668
Date Tue, 01 Aug 2017 22:38:34 GMT
See <https://builds.apache.org/job/Mesos-Reviewbot/18668/display/redirect?page=changes>

Changes:

[xujyan] Properly separated concatenated error messages.

------------------------------------------
[...truncated 30.50 MB...]
I0801 22:38:28.363930  5100 containerizer.cpp:230] Using isolation: posix/cpu,posix/mem,filesystem/posix,network/cni,environment_secret
W0801 22:38:28.364773  5100 backend.cpp:76] Failed to create 'overlay' backend: OverlayBackend
requires root privileges
W0801 22:38:28.364992  5100 backend.cpp:76] Failed to create 'bind' backend: BindBackend requires
root privileges
I0801 22:38:28.365036  5100 provisioner.cpp:255] Using default backend 'copy'
I0801 22:38:28.370162  5126 slave.cpp:250] Mesos agent started on (795)@172.17.0.3:40649
I0801 22:38:28.370204  5126 slave.cpp:251] Flags at startup: --acls="" --appc_simple_discovery_uri_prefix="http://"
--appc_store_dir="/tmp/Endpoint_SlaveEndpointTest_AuthorizedRequest_2_NU4h2N/store/appc" --authenticate_http_readonly="true"
--authenticate_http_readwrite="true" --authenticatee="crammd5" --authentication_backoff_factor="1secs"
--authorizer="local" --cgroups_cpu_enable_pids_and_tids_count="false" --cgroups_enable_cfs="false"
--cgroups_hierarchy="/sys/fs/cgroup" --cgroups_limit_swap="false" --cgroups_root="mesos" --container_disk_watch_interval="15secs"
--containerizers="mesos" --credential="/tmp/Endpoint_SlaveEndpointTest_AuthorizedRequest_2_NU4h2N/credential"
--default_role="*" --disk_watch_interval="1mins" --docker="docker" --docker_kill_orphans="true"
--docker_registry="https://registry-1.docker.io" --docker_remove_delay="6hrs" --docker_socket="/var/run/docker.sock"
--docker_stop_timeout="0ns" --docker_store_dir="/tmp/Endpoint_SlaveEndpointTest_AuthorizedRequest_2_NU4h2N/store/docker"
--docker_volume_checkpoint_dir="/var/run/mesos/isolators/docker/volume" --enforce_container_disk_quota="false"
--executor_registration_timeout="1mins" --executor_reregistration_timeout="2secs" --executor_shutdown_grace_period="5secs"
--fetcher_cache_dir="/tmp/Endpoint_SlaveEndpointTest_AuthorizedRequest_2_NU4h2N/fetch" --fetcher_cache_size="2GB"
--frameworks_home="" --gc_delay="1weeks" --gc_disk_headroom="0.1" --hadoop_home="" --help="false"
--hostname_lookup="true" --http_command_executor="false" --http_credentials="/tmp/Endpoint_SlaveEndpointTest_AuthorizedRequest_2_NU4h2N/http_credentials"
--http_heartbeat_interval="30secs" --initialize_driver_logging="true" --isolation="posix/cpu,posix/mem"
--launcher="posix" --launcher_dir="/mesos/mesos-1.4.0/_build/src" --logbufsecs="0" --logging_level="INFO"
--max_completed_executors_per_framework="150" --oversubscribed_resources_interval="15secs"
--perf_duration="10secs" --perf_interval="1mins" --port="5051" --qos_correction_interval_min="0ns"
--quiet="false" --recover="reconnect" --recovery_timeout="15mins" --registration_backoff_factor="10ms"
--resources="cpus:2;gpus:0;mem:1024;disk:1024;ports:[31000-32000]" --revocable_cpu_low_priority="true"
--runtime_dir="/tmp/Endpoint_SlaveEndpointTest_AuthorizedRequest_2_NU4h2N" --sandbox_directory="/mnt/mesos/sandbox"
--strict="true" --switch_user="true" --systemd_enable_support="true" --systemd_runtime_directory="/run/systemd/system"
--version="false" --work_dir="/tmp/Endpoint_SlaveEndpointTest_AuthorizedRequest_2_PzeBee"
I0801 22:38:28.371026  5126 credentials.hpp:86] Loading credential for authentication from
'/tmp/Endpoint_SlaveEndpointTest_AuthorizedRequest_2_NU4h2N/credential'
I0801 22:38:28.371378  5126 slave.cpp:283] Agent using credential for: test-principal
I0801 22:38:28.371404  5126 credentials.hpp:37] Loading credentials for authentication from
'/tmp/Endpoint_SlaveEndpointTest_AuthorizedRequest_2_NU4h2N/http_credentials'
I0801 22:38:28.371850  5126 http.cpp:993] Creating default 'basic' HTTP authenticator for
realm 'mesos-agent-readonly'
I0801 22:38:28.372184  5126 http.cpp:993] Creating default 'basic' HTTP authenticator for
realm 'mesos-agent-readwrite'
I0801 22:38:28.374461  5126 slave.cpp:565] Agent resources: [{"name":"cpus","scalar":{"value":2.0},"type":"SCALAR"},{"name":"mem","scalar":{"value":1024.0},"type":"SCALAR"},{"name":"disk","scalar":{"value":1024.0},"type":"SCALAR"},{"name":"ports","ranges":{"range":[{"begin":31000,"end":32000}]},"type":"RANGES"}]
I0801 22:38:28.374891  5126 slave.cpp:573] Agent attributes: [  ]
I0801 22:38:28.374910  5126 slave.cpp:582] Agent hostname: 7cb699aa75b7
I0801 22:38:28.375242  5123 status_update_manager.cpp:177] Pausing sending status updates
I0801 22:38:28.377223  5122 state.cpp:64] Recovering state from '/tmp/Endpoint_SlaveEndpointTest_AuthorizedRequest_2_PzeBee/meta'
I0801 22:38:28.377795  5121 status_update_manager.cpp:203] Recovering status update manager
I0801 22:38:28.378134  5124 containerizer.cpp:582] Recovering containerizer
I0801 22:38:28.380326  5125 provisioner.cpp:416] Provisioner recovery complete
I0801 22:38:28.381093  5120 slave.cpp:6207] Finished recovery
I0801 22:38:28.381753  5120 slave.cpp:6389] Querying resource estimator for oversubscribable
resources
I0801 22:38:28.382108  5124 slave.cpp:6403] Received oversubscribable resources {} from the
resource estimator
I0801 22:38:28.386162  5124 process.cpp:3836] Handling HTTP event for process 'slave(795)'
with path: '/slave(795)/containers'
I0801 22:38:28.388432  5120 http.cpp:1133] HTTP GET for /slave(795)/containers from 172.17.0.3:43752
I0801 22:38:28.388559  5120 http.cpp:957] Authorizing principal 'test-principal' to GET the
'/containers' endpoint
I0801 22:38:28.394415  5100 slave.cpp:843] Agent terminating
[       OK ] Endpoint/SlaveEndpointTest.AuthorizedRequest/2 (46 ms)
[ RUN      ] Endpoint/SlaveEndpointTest.UnauthorizedRequest/0
I0801 22:38:28.411013  5100 containerizer.cpp:230] Using isolation: posix/cpu,posix/mem,filesystem/posix,network/cni,environment_secret
W0801 22:38:28.411784  5100 backend.cpp:76] Failed to create 'overlay' backend: OverlayBackend
requires root privileges
W0801 22:38:28.411954  5100 backend.cpp:76] Failed to create 'bind' backend: BindBackend requires
root privileges
I0801 22:38:28.411996  5100 provisioner.cpp:255] Using default backend 'copy'
I0801 22:38:28.417168  5120 slave.cpp:250] Mesos agent started on (796)@172.17.0.3:40649
I0801 22:38:28.417212  5120 slave.cpp:251] Flags at startup: --acls="" --appc_simple_discovery_uri_prefix="http://"
--appc_store_dir="/tmp/Endpoint_SlaveEndpointTest_UnauthorizedRequest_0_fRz2E7/store/appc"
--authenticate_http_readonly="true" --authenticate_http_readwrite="true" --authenticatee="crammd5"
--authentication_backoff_factor="1secs" --authorizer="local" --cgroups_cpu_enable_pids_and_tids_count="false"
--cgroups_enable_cfs="false" --cgroups_hierarchy="/sys/fs/cgroup" --cgroups_limit_swap="false"
--cgroups_root="mesos" --container_disk_watch_interval="15secs" --containerizers="mesos" --credential="/tmp/Endpoint_SlaveEndpointTest_UnauthorizedRequest_0_fRz2E7/credential"
--default_role="*" --disk_watch_interval="1mins" --docker="docker" --docker_kill_orphans="true"
--docker_registry="https://registry-1.docker.io" --docker_remove_delay="6hrs" --docker_socket="/var/run/docker.sock"
--docker_stop_timeout="0ns" --docker_store_dir="/tmp/Endpoint_SlaveEndpointTest_UnauthorizedRequest_0_fRz2E7/store/docker"
--docker_volume_checkpoint_dir="/var/run/mesos/isolators/docker/volume" --enforce_container_disk_quota="false"
--executor_registration_timeout="1mins" --executor_reregistration_timeout="2secs" --executor_shutdown_grace_period="5secs"
--fetcher_cache_dir="/tmp/Endpoint_SlaveEndpointTest_UnauthorizedRequest_0_fRz2E7/fetch" --fetcher_cache_size="2GB"
--frameworks_home="" --gc_delay="1weeks" --gc_disk_headroom="0.1" --hadoop_home="" --help="false"
--hostname_lookup="true" --http_command_executor="false" --http_credentials="/tmp/Endpoint_SlaveEndpointTest_UnauthorizedRequest_0_fRz2E7/http_credentials"
--http_heartbeat_interval="30secs" --initialize_driver_logging="true" --isolation="posix/cpu,posix/mem"
--launcher="posix" --launcher_dir="/mesos/mesos-1.4.0/_build/src" --logbufsecs="0" --logging_level="INFO"
--max_completed_executors_per_framework="150" --oversubscribed_resources_interval="15secs"
--perf_duration="10secs" --perf_interval="1mins" --port="5051" --qos_correction_interval_min="0ns"
--quiet="false" --recover="reconnect" --recovery_timeout="15mins" --registration_backoff_factor="10ms"
--resources="cpus:2;gpus:0;mem:1024;disk:1024;ports:[31000-32000]" --revocable_cpu_low_priority="true"
--runtime_dir="/tmp/Endpoint_SlaveEndpointTest_UnauthorizedRequest_0_fRz2E7" --sandbox_directory="/mnt/mesos/sandbox"
--strict="true" --switch_user="true" --systemd_enable_support="true" --systemd_runtime_directory="/run/systemd/system"
--version="false" --work_dir="/tmp/Endpoint_SlaveEndpointTest_UnauthorizedRequest_0_BwYHJx"
I0801 22:38:28.417922  5120 credentials.hpp:86] Loading credential for authentication from
'/tmp/Endpoint_SlaveEndpointTest_UnauthorizedRequest_0_fRz2E7/credential'
I0801 22:38:28.418174  5120 slave.cpp:283] Agent using credential for: test-principal
I0801 22:38:28.418200  5120 credentials.hpp:37] Loading credentials for authentication from
'/tmp/Endpoint_SlaveEndpointTest_UnauthorizedRequest_0_fRz2E7/http_credentials'
I0801 22:38:28.418551  5120 http.cpp:993] Creating default 'basic' HTTP authenticator for
realm 'mesos-agent-readonly'
I0801 22:38:28.418793  5120 http.cpp:993] Creating default 'basic' HTTP authenticator for
realm 'mesos-agent-readwrite'
I0801 22:38:28.420910  5120 slave.cpp:565] Agent resources: [{"name":"cpus","scalar":{"value":2.0},"type":"SCALAR"},{"name":"mem","scalar":{"value":1024.0},"type":"SCALAR"},{"name":"disk","scalar":{"value":1024.0},"type":"SCALAR"},{"name":"ports","ranges":{"range":[{"begin":31000,"end":32000}]},"type":"RANGES"}]
I0801 22:38:28.421334  5120 slave.cpp:573] Agent attributes: [  ]
I0801 22:38:28.421356  5120 slave.cpp:582] Agent hostname: 7cb699aa75b7
I0801 22:38:28.421736  5123 status_update_manager.cpp:177] Pausing sending status updates
I0801 22:38:28.423566  5122 state.cpp:64] Recovering state from '/tmp/Endpoint_SlaveEndpointTest_UnauthorizedRequest_0_BwYHJx/meta'
I0801 22:38:28.424187  5121 status_update_manager.cpp:203] Recovering status update manager
I0801 22:38:28.424516  5124 containerizer.cpp:582] Recovering containerizer
I0801 22:38:28.426712  5119 provisioner.cpp:416] Provisioner recovery complete
I0801 22:38:28.427469  5123 slave.cpp:6207] Finished recovery
I0801 22:38:28.428248  5123 slave.cpp:6389] Querying resource estimator for oversubscribable
resources
I0801 22:38:28.428688  5122 slave.cpp:6403] Received oversubscribable resources {} from the
resource estimator
I0801 22:38:28.432920  5125 process.cpp:3836] Handling HTTP event for process 'slave(796)'
with path: '/slave(796)/monitor/statistics'
I0801 22:38:28.435081  5123 http.cpp:1133] HTTP GET for /slave(796)/monitor/statistics from
172.17.0.3:43754
I0801 22:38:28.435277  5123 http.cpp:957] Authorizing principal 'test-principal' to GET the
'/monitor/statistics' endpoint
I0801 22:38:28.438585  5125 slave.cpp:843] Agent terminating
[       OK ] Endpoint/SlaveEndpointTest.UnauthorizedRequest/0 (44 ms)
[ RUN      ] Endpoint/SlaveEndpointTest.UnauthorizedRequest/1
I0801 22:38:28.455548  5100 containerizer.cpp:230] Using isolation: posix/cpu,posix/mem,filesystem/posix,network/cni,environment_secret
W0801 22:38:28.456310  5100 backend.cpp:76] Failed to create 'overlay' backend: OverlayBackend
requires root privileges
W0801 22:38:28.456477  5100 backend.cpp:76] Failed to create 'bind' backend: BindBackend requires
root privileges
I0801 22:38:28.456521  5100 provisioner.cpp:255] Using default backend 'copy'
I0801 22:38:28.461575  5124 slave.cpp:250] Mesos agent started on (797)@172.17.0.3:40649
I0801 22:38:28.461616  5124 slave.cpp:251] Flags at startup: --acls="" --appc_simple_discovery_uri_prefix="http://"
--appc_store_dir="/tmp/Endpoint_SlaveEndpointTest_UnauthorizedRequest_1_hq9VKr/store/appc"
--authenticate_http_readonly="true" --authenticate_http_readwrite="true" --authenticatee="crammd5"
--authentication_backoff_factor="1secs" --authorizer="local" --cgroups_cpu_enable_pids_and_tids_count="false"
--cgroups_enable_cfs="false" --cgroups_hierarchy="/sys/fs/cgroup" --cgroups_limit_swap="false"
--cgroups_root="mesos" --container_disk_watch_interval="15secs" --containerizers="mesos" --credential="/tmp/Endpoint_SlaveEndpointTest_UnauthorizedRequest_1_hq9VKr/credential"
--default_role="*" --disk_watch_interval="1mins" --docker="docker" --docker_kill_orphans="true"
--docker_registry="https://registry-1.docker.io" --docker_remove_delay="6hrs" --docker_socket="/var/run/docker.sock"
--docker_stop_timeout="0ns" --docker_store_dir="/tmp/Endpoint_SlaveEndpointTest_UnauthorizedRequest_1_hq9VKr/store/docker"
--docker_volume_checkpoint_dir="/var/run/mesos/isolators/docker/volume" --enforce_container_disk_quota="false"
--executor_registration_timeout="1mins" --executor_reregistration_timeout="2secs" --executor_shutdown_grace_period="5secs"
--fetcher_cache_dir="/tmp/Endpoint_SlaveEndpointTest_UnauthorizedRequest_1_hq9VKr/fetch" --fetcher_cache_size="2GB"
--frameworks_home="" --gc_delay="1weeks" --gc_disk_headroom="0.1" --hadoop_home="" --help="false"
--hostname_lookup="true" --http_command_executor="false" --http_credentials="/tmp/Endpoint_SlaveEndpointTest_UnauthorizedRequest_1_hq9VKr/http_credentials"
--http_heartbeat_interval="30secs" --initialize_driver_logging="true" --isolation="posix/cpu,posix/mem"
--launcher="posix" --launcher_dir="/mesos/mesos-1.4.0/_build/src" --logbufsecs="0" --logging_level="INFO"
--max_completed_executors_per_framework="150" --oversubscribed_resources_interval="15secs"
--perf_duration="10secs" --perf_interval="1mins" --port="5051" --qos_correction_interval_min="0ns"
--quiet="false" --recover="reconnect" --recovery_timeout="15mins" --registration_backoff_factor="10ms"
--resources="cpus:2;gpus:0;mem:1024;disk:1024;ports:[31000-32000]" --revocable_cpu_low_priority="true"
--runtime_dir="/tmp/Endpoint_SlaveEndpointTest_UnauthorizedRequest_1_hq9VKr" --sandbox_directory="/mnt/mesos/sandbox"
--strict="true" --switch_user="true" --systemd_enable_support="true" --systemd_runtime_directory="/run/systemd/system"
--version="false" --work_dir="/tmp/Endpoint_SlaveEndpointTest_UnauthorizedRequest_1_nRWoIR"
I0801 22:38:28.462405  5124 credentials.hpp:86] Loading credential for authentication from
'/tmp/Endpoint_SlaveEndpointTest_UnauthorizedRequest_1_hq9VKr/credential'
I0801 22:38:28.462805  5124 slave.cpp:283] Agent using credential for: test-principal
I0801 22:38:28.462834  5124 credentials.hpp:37] Loading credentials for authentication from
'/tmp/Endpoint_SlaveEndpointTest_UnauthorizedRequest_1_hq9VKr/http_credentials'
I0801 22:38:28.463321  5124 http.cpp:993] Creating default 'basic' HTTP authenticator for
realm 'mesos-agent-readonly'
I0801 22:38:28.463655  5124 http.cpp:993] Creating default 'basic' HTTP authenticator for
realm 'mesos-agent-readwrite'
I0801 22:38:28.465962  5124 slave.cpp:565] Agent resources: [{"name":"cpus","scalar":{"value":2.0},"type":"SCALAR"},{"name":"mem","scalar":{"value":1024.0},"type":"SCALAR"},{"name":"disk","scalar":{"value":1024.0},"type":"SCALAR"},{"name":"ports","ranges":{"range":[{"begin":31000,"end":32000}]},"type":"RANGES"}]
I0801 22:38:28.466389  5124 slave.cpp:573] Agent attributes: [  ]
I0801 22:38:28.466413  5124 slave.cpp:582] Agent hostname: 7cb699aa75b7
I0801 22:38:28.466696  5123 status_update_manager.cpp:177] Pausing sending status updates
I0801 22:38:28.468628  5125 state.cpp:64] Recovering state from '/tmp/Endpoint_SlaveEndpointTest_UnauthorizedRequest_1_nRWoIR/meta'
I0801 22:38:28.469090  5123 status_update_manager.cpp:203] Recovering status update manager
I0801 22:38:28.469498  5120 containerizer.cpp:582] Recovering containerizer
I0801 22:38:28.471626  5126 provisioner.cpp:416] Provisioner recovery complete
I0801 22:38:28.472193  5122 slave.cpp:6207] Finished recovery
I0801 22:38:28.472918  5122 slave.cpp:6389] Querying resource estimator for oversubscribable
resources
I0801 22:38:28.473274  5123 slave.cpp:6403] Received oversubscribable resources {} from the
resource estimator
I0801 22:38:28.477727  5123 process.cpp:3836] Handling HTTP event for process 'slave(797)'
with path: '/slave(797)/monitor/statistics.json'
I0801 22:38:28.479823  5122 http.cpp:1133] HTTP GET for /slave(797)/monitor/statistics.json
from 172.17.0.3:43756
I0801 22:38:28.479955  5122 http.cpp:957] Authorizing principal 'test-principal' to GET the
'/monitor/statistics.json' endpoint
I0801 22:38:28.484371  5125 slave.cpp:843] Agent terminating
[       OK ] Endpoint/SlaveEndpointTest.UnauthorizedRequest/1 (45 ms)
[ RUN      ] Endpoint/SlaveEndpointTest.UnauthorizedRequest/2
I0801 22:38:28.501401  5100 containerizer.cpp:230] Using isolation: posix/cpu,posix/mem,filesystem/posix,network/cni,environment_secret
W0801 22:38:28.502163  5100 backend.cpp:76] Failed to create 'overlay' backend: OverlayBackend
requires root privileges
W0801 22:38:28.502331  5100 backend.cpp:76] Failed to create 'bind' backend: BindBackend requires
root privileges
I0801 22:38:28.502375  5100 provisioner.cpp:255] Using default backend 'copy'
I0801 22:38:28.507467  5126 slave.cpp:250] Mesos agent started on (798)@172.17.0.3:40649
I0801 22:38:28.507509  5126 slave.cpp:251] Flags at startup: --acls="" --appc_simple_discovery_uri_prefix="http://"
--appc_store_dir="/tmp/Endpoint_SlaveEndpointTest_UnauthorizedRequest_2_BWOkkM/store/appc"
--authenticate_http_readonly="true" --authenticate_http_readwrite="true" --authenticatee="crammd5"
--authentication_backoff_factor="1secs" --authorizer="local" --cgroups_cpu_enable_pids_and_tids_count="false"
--cgroups_enable_cfs="false" --cgroups_hierarchy="/sys/fs/cgroup" --cgroups_limit_swap="false"
--cgroups_root="mesos" --container_disk_watch_interval="15secs" --containerizers="mesos" --credential="/tmp/Endpoint_SlaveEndpointTest_UnauthorizedRequest_2_BWOkkM/credential"
--default_role="*" --disk_watch_interval="1mins" --docker="docker" --docker_kill_orphans="true"
--docker_registry="https://registry-1.docker.io" --docker_remove_delay="6hrs" --docker_socket="/var/run/docker.sock"
--docker_stop_timeout="0ns" --docker_store_dir="/tmp/Endpoint_SlaveEndpointTest_UnauthorizedRequest_2_BWOkkM/store/docker"
--docker_volume_checkpoint_dir="/var/run/mesos/isolators/docker/volume" --enforce_container_disk_quota="false"
--executor_registration_timeout="1mins" --executor_reregistration_timeout="2secs" --executor_shutdown_grace_period="5secs"
--fetcher_cache_dir="/tmp/Endpoint_SlaveEndpointTest_UnauthorizedRequest_2_BWOkkM/fetch" --fetcher_cache_size="2GB"
--frameworks_home="" --gc_delay="1weeks" --gc_disk_headroom="0.1" --hadoop_home="" --help="false"
--hostname_lookup="true" --http_command_executor="false" --http_credentials="/tmp/Endpoint_SlaveEndpointTest_UnauthorizedRequest_2_BWOkkM/http_credentials"
--http_heartbeat_interval="30secs" --initialize_driver_logging="true" --isolation="posix/cpu,posix/mem"
--launcher="posix" --launcher_dir="/mesos/mesos-1.4.0/_build/src" --logbufsecs="0" --logging_level="INFO"
--max_completed_executors_per_framework="150" --oversubscribed_resources_interval="15secs"
--perf_duration="10secs" --perf_interval="1mins" --port="5051" --qos_correction_interval_min="0ns"
--quiet="false" --recover="reconnect" --recovery_timeout="15mins" --registration_backoff_factor="10ms"
--resources="cpus:2;gpus:0;mem:1024;disk:1024;ports:[31000-32000]" --revocable_cpu_low_priority="true"
--runtime_dir="/tmp/Endpoint_SlaveEndpointTest_UnauthorizedRequest_2_BWOkkM" --sandbox_directory="/mnt/mesos/sandbox"
--strict="true" --switch_user="true" --systemd_enable_support="true" --systemd_runtime_directory="/run/systemd/system"
--version="false" --work_dir="/tmp/Endpoint_SlaveEndpointTest_UnauthorizedRequest_2_R4pnac"
I0801 22:38:28.508219  5126 credentials.hpp:86] Loading credential for authentication from
'/tmp/Endpoint_SlaveEndpointTest_UnauthorizedRequest_2_BWOkkM/credential'
I0801 22:38:28.508474  5126 slave.cpp:283] Agent using credential for: test-principal
I0801 22:38:28.508500  5126 credentials.hpp:37] Loading credentials for authentication from
'/tmp/Endpoint_SlaveEndpointTest_UnauthorizedRequest_2_BWOkkM/http_credentials'
I0801 22:38:28.508849  5126 http.cpp:993] Creating default 'basic' HTTP authenticator for
realm 'mesos-agent-readonly'
I0801 22:38:28.509075  5126 http.cpp:993] Creating default 'basic' HTTP authenticator for
realm 'mesos-agent-readwrite'
I0801 22:38:28.511261  5126 slave.cpp:565] Agent resources: [{"name":"cpus","scalar":{"value":2.0},"type":"SCALAR"},{"name":"mem","scalar":{"value":1024.0},"type":"SCALAR"},{"name":"disk","scalar":{"value":1024.0},"type":"SCALAR"},{"name":"ports","ranges":{"range":[{"begin":31000,"end":32000}]},"type":"RANGES"}]
I0801 22:38:28.511685  5126 slave.cpp:573] Agent attributes: [  ]
I0801 22:38:28.511706  5126 slave.cpp:582] Agent hostname: 7cb699aa75b7
I0801 22:38:28.511976  5120 status_update_manager.cpp:177] Pausing sending status updates
I0801 22:38:28.513828  5122 state.cpp:64] Recovering state from '/tmp/Endpoint_SlaveEndpointTest_UnauthorizedRequest_2_R4pnac/meta'
I0801 22:38:28.514416  5120 status_update_manager.cpp:203] Recovering status update manager
I0801 22:38:28.514683  5121 containerizer.cpp:582] Recovering containerizer
I0801 22:38:28.516832  5121 provisioner.cpp:416] Provisioner recovery complete
I0801 22:38:28.517477  5125 slave.cpp:6207] Finished recovery
I0801 22:38:28.518110  5125 slave.cpp:6389] Querying resource estimator for oversubscribable
resources
I0801 22:38:28.518422  5122 slave.cpp:6403] Received oversubscribable resources {} from the
resource estimator
I0801 22:38:28.522490  5121 process.cpp:3836] Handling HTTP event for process 'slave(798)'
with path: '/slave(798)/containers'
I0801 22:38:28.524438  5122 http.cpp:1133] HTTP GET for /slave(798)/containers from 172.17.0.3:43758
I0801 22:38:28.524740  5122 http.cpp:957] Authorizing principal 'test-principal' to GET the
'/containers' endpoint
I0801 22:38:28.528641  5122 slave.cpp:843] Agent terminating
[       OK ] Endpoint/SlaveEndpointTest.UnauthorizedRequest/2 (44 ms)
[ RUN      ] Endpoint/SlaveEndpointTest.NoAuthorizer/0
I0801 22:38:28.545955  5100 containerizer.cpp:230] Using isolation: posix/cpu,posix/mem,filesystem/posix,network/cni,environment_secret
W0801 22:38:28.546718  5100 backend.cpp:76] Failed to create 'overlay' backend: OverlayBackend
requires root privileges
W0801 22:38:28.546888  5100 backend.cpp:76] Failed to create 'bind' backend: BindBackend requires
root privileges
I0801 22:38:28.546931  5100 provisioner.cpp:255] Using default backend 'copy'
I0801 22:38:28.549271  5100 cluster.cpp:448] Creating default 'local' authorizer
I0801 22:38:28.552042  5122 slave.cpp:250] Mesos agent started on (799)@172.17.0.3:40649
I0801 22:38:28.552083  5122 slave.cpp:251] Flags at startup: --acls="" --appc_simple_discovery_uri_prefix="http://"
--appc_store_dir="/tmp/Endpoint_SlaveEndpointTest_NoAuthorizer_0_91Csm7/store/appc" --authenticate_http_readonly="true"
--authenticate_http_readwrite="true" --authenticatee="crammd5" --authentication_backoff_factor="1secs"
--authorizer="local" --cgroups_cpu_enable_pids_and_tids_count="false" --cgroups_enable_cfs="false"
--cgroups_hierarchy="/sys/fs/cgroup" --cgroups_limit_swap="false" --cgroups_root="mesos" --container_disk_watch_interval="15secs"
--containerizers="mesos" --credential="/tmp/Endpoint_SlaveEndpointTest_NoAuthorizer_0_91Csm7/credential"
--default_role="*" --disk_watch_interval="1mins" --docker="docker" --docker_kill_orphans="true"
--docker_registry="https://registry-1.docker.io" --docker_remove_delay="6hrs" --docker_socket="/var/run/docker.sock"
--docker_stop_timeout="0ns" --docker_store_dir="/tmp/Endpoint_SlaveEndpointTest_NoAuthorizer_0_91Csm7/store/docker"
--docker_volume_checkpoint_dir="/var/run/mesos/isolators/docker/volume" --enforce_container_disk_quota="false"
--executor_registration_timeout="1mins" --executor_reregistration_timeout="2secs" --executor_shutdown_grace_period="5secs"
--fetcher_cache_dir="/tmp/Endpoint_SlaveEndpointTest_NoAuthorizer_0_91Csm7/fetch" --fetcher_cache_size="2GB"
--frameworks_home="" --gc_delay="1weeks" --gc_disk_headroom="0.1" --hadoop_home="" --help="false"
--hostname_lookup="true" --http_command_executor="false" --http_credentials="/tmp/Endpoint_SlaveEndpointTest_NoAuthorizer_0_91Csm7/http_credentials"
--http_heartbeat_interval="30secs" --initialize_driver_logging="true" --isolation="posix/cpu,posix/mem"
--launcher="posix" --launcher_dir="/mesos/mesos-1.4.0/_build/src" --logbufsecs="0" --logging_level="INFO"
--max_completed_executors_per_framework="150" --oversubscribed_resources_interval="15secs"
--perf_duration="10secs" --perf_interval="1mins" --port="5051" --qos_correction_interval_min="0ns"
--quiet="false" --recover="reconnect" --recovery_timeout="15mins" --registration_backoff_factor="10ms"
--resources="cpus:2;gpus:0;mem:1024;disk:1024;ports:[31000-32000]" --revocable_cpu_low_priority="true"
--runtime_dir="/tmp/Endpoint_SlaveEndpointTest_NoAuthorizer_0_91Csm7" --sandbox_directory="/mnt/mesos/sandbox"
--strict="true" --switch_user="true" --systemd_enable_support="true" --systemd_runtime_directory="/run/systemd/system"
--version="false" --work_dir="/tmp/Endpoint_SlaveEndpointTest_NoAuthorizer_0_zLin5w"
I0801 22:38:28.552923  5122 credentials.hpp:86] Loading credential for authentication from
'/tmp/Endpoint_SlaveEndpointTest_NoAuthorizer_0_91Csm7/credential'
I0801 22:38:28.553287  5122 slave.cpp:283] Agent using credential for: test-principal
I0801 22:38:28.553318  5122 credentials.hpp:37] Loading credentials for authentication from
'/tmp/Endpoint_SlaveEndpointTest_NoAuthorizer_0_91Csm7/http_credentials'
I0801 22:38:28.553788  5122 http.cpp:993] Creating default 'basic' HTTP authenticator for
realm 'mesos-agent-readonly'
I0801 22:38:28.554132  5122 http.cpp:993] Creating default 'basic' HTTP authenticator for
realm 'mesos-agent-readwrite'
I0801 22:38:28.556408  5122 slave.cpp:565] Agent resources: [{"name":"cpus","scalar":{"value":2.0},"type":"SCALAR"},{"name":"mem","scalar":{"value":1024.0},"type":"SCALAR"},{"name":"disk","scalar":{"value":1024.0},"type":"SCALAR"},{"name":"ports","ranges":{"range":[{"begin":31000,"end":32000}]},"type":"RANGES"}]
I0801 22:38:28.556834  5122 slave.cpp:573] Agent attributes: [  ]
I0801 22:38:28.556859  5122 slave.cpp:582] Agent hostname: 7cb699aa75b7
I0801 22:38:28.557165  5123 status_update_manager.cpp:177] Pausing sending status updates
I0801 22:38:28.559528  5125 state.cpp:64] Recovering state from '/tmp/Endpoint_SlaveEndpointTest_NoAuthorizer_0_zLin5w/meta'
I0801 22:38:28.559921  5123 status_update_manager.cpp:203] Recovering status update manager
I0801 22:38:28.560297  5124 containerizer.cpp:582] Recovering containerizer
I0801 22:38:28.562476  5124 provisioner.cpp:416] Provisioner recovery complete
I0801 22:38:28.563287  5126 slave.cpp:6207] Finished recovery
I0801 22:38:28.563977  5126 slave.cpp:6389] Querying resource estimator for oversubscribable
resources
I0801 22:38:28.564401  5125 slave.cpp:6403] Received oversubscribable resources {} from the
resource estimator
I0801 22:38:28.568270  5124 process.cpp:3836] Handling HTTP event for process 'slave(799)'
with path: '/slave(799)/monitor/statistics'
I0801 22:38:28.570392  5122 http.cpp:1133] HTTP GET for /slave(799)/monitor/statistics from
172.17.0.3:43760
I0801 22:38:28.570526  5122 http.cpp:957] Authorizing principal 'test-principal' to GET the
'/monitor/statistics' endpoint
I0801 22:38:28.576381  5124 slave.cpp:843] Agent terminating
[       OK ] Endpoint/SlaveEndpointTest.NoAuthorizer/0 (48 ms)
[ RUN      ] Endpoint/SlaveEndpointTest.NoAuthorizer/1
I0801 22:38:28.593819  5100 containerizer.cpp:230] Using isolation: posix/cpu,posix/mem,filesystem/posix,network/cni,environment_secret
W0801 22:38:28.594662  5100 backend.cpp:76] Failed to create 'overlay' backend: OverlayBackend
requires root privileges
W0801 22:38:28.594835  5100 backend.cpp:76] Failed to create 'bind' backend: BindBackend requires
root privileges
I0801 22:38:28.594877  5100 provisioner.cpp:255] Using default backend 'copy'
I0801 22:38:28.597254  5100 cluster.cpp:448] Creating default 'local' authorizer
I0801 22:38:28.599961  5120 slave.cpp:250] Mesos agent started on (800)@172.17.0.3:40649
I0801 22:38:28.600000  5120 slave.cpp:251] Flags at startup: --acls="" --appc_simple_discovery_uri_prefix="http://"
--appc_store_dir="/tmp/Endpoint_SlaveEndpointTest_NoAuthorizer_1_7uSmTs/store/appc" --authenticate_http_readonly="true"
--authenticate_http_readwrite="true" --authenticatee="crammd5" --authentication_backoff_factor="1secs"
--authorizer="local" --cgroups_cpu_enable_pids_and_tids_count="false" --cgroups_enable_cfs="false"
--cgroups_hierarchy="/sys/fs/cgroup" --cgroups_limit_swap="false" --cgroups_root="mesos" --container_disk_watch_interval="15secs"
--containerizers="mesos" --credential="/tmp/Endpoint_SlaveEndpointTest_NoAuthorizer_1_7uSmTs/credential"
--default_role="*" --disk_watch_interval="1mins" --docker="docker" --docker_kill_orphans="true"
--docker_registry="https://registry-1.docker.io" --docker_remove_delay="6hrs" --docker_socket="/var/run/docker.sock"
--docker_stop_timeout="0ns" --docker_store_dir="/tmp/Endpoint_SlaveEndpointTest_NoAuthorizer_1_7uSmTs/store/docker"
--docker_volume_checkpoint_dir="/var/run/mesos/isolators/docker/volume" --enforce_container_disk_quota="false"
--executor_registration_timeout="1mins" --executor_reregistration_timeout="2secs" --executor_shutdown_grace_period="5secs"
--fetcher_cache_dir="/tmp/Endpoint_SlaveEndpointTest_NoAuthorizer_1_7uSmTs/fetch" --fetcher_cache_size="2GB"
--frameworks_home="" --gc_delay="1weeks" --gc_disk_headroom="0.1" --hadoop_home="" --help="false"
--hostname_lookup="true" --http_command_executor="false" --http_credentials="/tmp/Endpoint_SlaveEndpointTest_NoAuthorizer_1_7uSmTs/http_credentials"
--http_heartbeat_interval="30secs" --initialize_driver_logging="true" --isolation="posix/cpu,posix/mem"
--launcher="posix" --launcher_dir="/mesos/mesos-1.4.0/_build/src" --logbufsecs="0" --logging_level="INFO"
--max_completed_executors_per_framework="150" --oversubscribed_resources_interval="15secs"
--perf_duration="10secs" --perf_interval="1mins" --port="5051" --qos_correction_interval_min="0ns"
--quiet="false" --recover="reconnect" --recovery_timeout="15mins" --registration_backoff_factor="10ms"
--resources="cpus:2;gpus:0;mem:1024;disk:1024;ports:[31000-32000]" --revocable_cpu_low_priority="true"
--runtime_dir="/tmp/Endpoint_SlaveEndpointTest_NoAuthorizer_1_7uSmTs" --sandbox_directory="/mnt/mesos/sandbox"
--strict="true" --switch_user="true" --systemd_enable_support="true" --systemd_runtime_directory="/run/systemd/system"
--version="false" --work_dir="/tmp/Endpoint_SlaveEndpointTest_NoAuthorizer_1_BeNuuS"
I0801 22:38:28.600797  5120 credentials.hpp:86] Loading credential for authentication from
'/tmp/Endpoint_SlaveEndpointTest_NoAuthorizer_1_7uSmTs/credential'
I0801 22:38:28.601199  5120 slave.cpp:283] Agent using credential for: test-principal
I0801 22:38:28.601233  5120 credentials.hpp:37] Loading credentials for authentication from
'/tmp/Endpoint_SlaveEndpointTest_NoAuthorizer_1_7uSmTs/http_credentials'
I0801 22:38:28.601713  5120 http.cpp:993] Creating default 'basic' HTTP authenticator for
realm 'mesos-agent-readonly'
I0801 22:38:28.602010  5120 http.cpp:993] Creating default 'basic' HTTP authenticator for
realm 'mesos-agent-readwrite'
I0801 22:38:28.604315  5120 slave.cpp:565] Agent resources: [{"name":"cpus","scalar":{"value":2.0},"type":"SCALAR"},{"name":"mem","scalar":{"value":1024.0},"type":"SCALAR"},{"name":"disk","scalar":{"value":1024.0},"type":"SCALAR"},{"name":"ports","ranges":{"range":[{"begin":31000,"end":32000}]},"type":"RANGES"}]
I0801 22:38:28.604739  5120 slave.cpp:573] Agent attributes: [  ]
I0801 22:38:28.604759  5120 slave.cpp:582] Agent hostname: 7cb699aa75b7
I0801 22:38:28.605015  5124 status_update_manager.cpp:177] Pausing sending status updates
I0801 22:38:28.606974  5121 state.cpp:64] Recovering state from '/tmp/Endpoint_SlaveEndpointTest_NoAuthorizer_1_BeNuuS/meta'
I0801 22:38:28.607477  5119 status_update_manager.cpp:203] Recovering status update manager
I0801 22:38:28.607866  5123 containerizer.cpp:582] Recovering containerizer
I0801 22:38:28.610033  5120 provisioner.cpp:416] Provisioner recovery complete
I0801 22:38:28.610635  5126 slave.cpp:6207] Finished recovery
I0801 22:38:28.611264  5126 slave.cpp:6389] Querying resource estimator for oversubscribable
resources
I0801 22:38:28.611714  5119 slave.cpp:6403] Received oversubscribable resources {} from the
resource estimator
I0801 22:38:28.615772  5119 process.cpp:3836] Handling HTTP event for process 'slave(800)'
with path: '/slave(800)/monitor/statistics.json'
I0801 22:38:28.617751  5123 http.cpp:1133] HTTP GET for /slave(800)/monitor/statistics.json
from 172.17.0.3:43762
I0801 22:38:28.617943  5123 http.cpp:957] Authorizing principal 'test-principal' to GET the
'/monitor/statistics.json' endpoint
I0801 22:38:28.622654  5121 slave.cpp:843] Agent terminating
[       OK ] Endpoint/SlaveEndpointTest.NoAuthorizer/1 (46 ms)
[ RUN      ] Endpoint/SlaveEndpointTest.NoAuthorizer/2
I0801 22:38:28.640596  5100 containerizer.cpp:230] Using isolation: posix/cpu,posix/mem,filesystem/posix,network/cni,environment_secret
W0801 22:38:28.641366  5100 backend.cpp:76] Failed to create 'overlay' backend: OverlayBackend
requires root privileges
W0801 22:38:28.641535  5100 backend.cpp:76] Failed to create 'bind' backend: BindBackend requires
root privileges
I0801 22:38:28.641577  5100 provisioner.cpp:255] Using default backend 'copy'
I0801 22:38:28.643965  5100 cluster.cpp:448] Creating default 'local' authorizer
I0801 22:38:28.646721  5124 slave.cpp:250] Mesos agent started on (801)@172.17.0.3:40649
I0801 22:38:28.646764  5124 slave.cpp:251] Flags at startup: --acls="" --appc_simple_discovery_uri_prefix="http://"
--appc_store_dir="/tmp/Endpoint_SlaveEndpointTest_NoAuthorizer_2_hgWzUO/store/appc" --authenticate_http_readonly="true"
--authenticate_http_readwrite="true" --authenticatee="crammd5" --authentication_backoff_factor="1secs"
--authorizer="local" --cgroups_cpu_enable_pids_and_tids_count="false" --cgroups_enable_cfs="false"
--cgroups_hierarchy="/sys/fs/cgroup" --cgroups_limit_swap="false" --cgroups_root="mesos" --container_disk_watch_interval="15secs"
--containerizers="mesos" --credential="/tmp/Endpoint_SlaveEndpointTest_NoAuthorizer_2_hgWzUO/credential"
--default_role="*" --disk_watch_interval="1mins" --docker="docker" --docker_kill_orphans="true"
--docker_registry="https://registry-1.docker.io" --docker_remove_delay="6hrs" --docker_socket="/var/run/docker.sock"
--docker_stop_timeout="0ns" --docker_store_dir="/tmp/Endpoint_SlaveEndpointTest_NoAuthorizer_2_hgWzUO/store/docker"
--docker_volume_checkpoint_dir="/var/run/mesos/isolators/docker/volume" --enforce_container_disk_quota="false"
--executor_registration_timeout="1mins" --executor_reregistration_timeout="2secs" --executor_shutdown_grace_period="5secs"
--fetcher_cache_dir="/tmp/Endpoint_SlaveEndpointTest_NoAuthorizer_2_hgWzUO/fetch" --fetcher_cache_size="2GB"
--frameworks_home="" --gc_delay="1weeks" --gc_disk_headroom="0.1" --hadoop_home="" --help="false"
--hostname_lookup="true" --http_command_executor="false" --http_credentials="/tmp/Endpoint_SlaveEndpointTest_NoAuthorizer_2_hgWzUO/http_credentials"
--http_heartbeat_interval="30secs" --initialize_driver_logging="true" --isolation="posix/cpu,posix/mem"
--launcher="posix" --launcher_dir="/mesos/mesos-1.4.0/_build/src" --logbufsecs="0" --logging_level="INFO"
--max_completed_executors_per_framework="150" --oversubscribed_resources_interval="15secs"
--perf_duration="10secs" --perf_interval="1mins" --port="5051" --qos_correction_interval_min="0ns"
--quiet="false" --recover="reconnect" --recovery_timeout="15mins" --registration_backoff_factor="10ms"
--resources="cpus:2;gpus:0;mem:1024;disk:1024;ports:[31000-32000]" --revocable_cpu_low_priority="true"
--runtime_dir="/tmp/Endpoint_SlaveEndpointTest_NoAuthorizer_2_hgWzUO" --sandbox_directory="/mnt/mesos/sandbox"
--strict="true" --switch_user="true" --systemd_enable_support="true" --systemd_runtime_directory="/run/systemd/system"
--version="false" --work_dir="/tmp/Endpoint_SlaveEndpointTest_NoAuthorizer_2_zJR9ne"
I0801 22:38:28.647496  5124 credentials.hpp:86] Loading credential for authentication from
'/tmp/Endpoint_SlaveEndpointTest_NoAuthorizer_2_hgWzUO/credential'
I0801 22:38:28.647760  5124 slave.cpp:283] Agent using credential for: test-principal
I0801 22:38:28.647790  5124 credentials.hpp:37] Loading credentials for authentication from
'/tmp/Endpoint_SlaveEndpointTest_NoAuthorizer_2_hgWzUO/http_credentials'
I0801 22:38:28.648192  5124 http.cpp:993] Creating default 'basic' HTTP authenticator for
realm 'mesos-agent-readonly'
I0801 22:38:28.648524  5124 http.cpp:993] Creating default 'basic' HTTP authenticator for
realm 'mesos-agent-readwrite'
I0801 22:38:28.650684  5124 slave.cpp:565] Agent resources: [{"name":"cpus","scalar":{"value":2.0},"type":"SCALAR"},{"name":"mem","scalar":{"value":1024.0},"type":"SCALAR"},{"name":"disk","scalar":{"value":1024.0},"type":"SCALAR"},{"name":"ports","ranges":{"range":[{"begin":31000,"end":32000}]},"type":"RANGES"}]
I0801 22:38:28.651108  5124 slave.cpp:573] Agent attributes: [  ]
I0801 22:38:28.651130  5124 slave.cpp:582] Agent hostname: 7cb699aa75b7
I0801 22:38:28.651454  5125 status_update_manager.cpp:177] Pausing sending status updates
I0801 22:38:28.653354  5120 state.cpp:64] Recovering state from '/tmp/Endpoint_SlaveEndpointTest_NoAuthorizer_2_zJR9ne/meta'
I0801 22:38:28.653796  5121 status_update_manager.cpp:203] Recovering status update manager
I0801 22:38:28.654177  5124 containerizer.cpp:582] Recovering containerizer
I0801 22:38:28.656273  5120 provisioner.cpp:416] Provisioner recovery complete
I0801 22:38:28.664038  5126 slave.cpp:6207] Finished recovery
I0801 22:38:28.664692  5126 slave.cpp:6389] Querying resource estimator for oversubscribable
resources
I0801 22:38:28.665191  5119 slave.cpp:6403] Received oversubscribable resources {} from the
resource estimator
I0801 22:38:28.669203  5119 process.cpp:3836] Handling HTTP event for process 'slave(801)'
with path: '/slave(801)/containers'
I0801 22:38:28.671078  5122 http.cpp:1133] HTTP GET for /slave(801)/containers from 172.17.0.3:43764
I0801 22:38:28.671214  5122 http.cpp:957] Authorizing principal 'test-principal' to GET the
'/containers' endpoint
I0801 22:38:28.678088  5100 slave.cpp:843] Agent terminating
[       OK ] Endpoint/SlaveEndpointTest.NoAuthorizer/2 (54 ms)
[----------] 9 tests from Endpoint/SlaveEndpointTest (427 ms total)

[----------] Global test environment tear-down
[==========] 1649 tests from 181 test cases ran. (709533 ms total)
[  PASSED  ] 1645 tests.
[  FAILED  ] 4 tests, listed below:
[  FAILED  ] DefaultExecutorCheckTest.CommandCheckDeliveredAndReconciled
[  FAILED  ] DefaultExecutorCheckTest.CommandCheckStatusChange
[  FAILED  ] DefaultExecutorCheckTest.CommandCheckSeesParentsEnv
[  FAILED  ] DefaultExecutorCheckTest.CommandCheckSharesWorkDirWithTask

 4 FAILED TESTS
  YOU HAVE 20 DISABLED TESTS

I0801 22:38:28.822620  5127 process.cpp:1006] Failed to accept socket: future discarded
make[4]: *** [check-local] Error 1
make[4]: Leaving directory `/mesos/mesos-1.4.0/_build/src'
make[3]: *** [check-am] Error 2
make[3]: Leaving directory `/mesos/mesos-1.4.0/_build/src'
make[2]: *** [check] Error 2
make[2]: Leaving directory `/mesos/mesos-1.4.0/_build/src'
make[1]: *** [check-recursive] Error 1
make[1]: Leaving directory `/mesos/mesos-1.4.0/_build'
make: *** [distcheck] Error 1
+ docker rmi mesos-1501621130-4798
Untagged: mesos-1501621130-4798:latest
Deleted: sha256:8442cc1b5d929c43be9c2754b0450699d8ce8265611de6cfd5c79c991c326fba
Deleted: sha256:f720a8336aa1680d8939e1e40ad0db3a02725992ea0b214abe06b164a07c29f0
Deleted: sha256:f8ce09b91aa673e266e8d08d2a8e1c95ac7d46da719884a0615cf84f49d956b1
Deleted: sha256:2b3741932b79081e21a56a9d925e0267ff60724876a016be464fe35187811980
Deleted: sha256:543b4ad68a98312ba0e701e66e3ca806258f34cf140dfa761d87f0d5c0cd823e
Deleted: sha256:04116f544643592315ec77f3ec2deff09f7cd18865d33fb0f600522584277cb9
Deleted: sha256:73c2cf44aeba7a8f33396b659db4a675cab49c229122692733759e9bb4a64f45
Deleted: sha256:aa642e3b4ce11fdee656a4dbacf855033f3328dc2fd2326fb2d75a632cbeaecf
Deleted: sha256:60561098f8b539bb3f7b6b648809da37e902b8edfb750b4e5b66051b2cc82a74
Deleted: sha256:774f9d28b2cf9f8ade4cc4d7113125309f03bbbbe0b909aa7a124253487a9940
Deleted: sha256:cff33fb63e235f8e28c0ae811129522d55f7fbf9d6ec8c0914ea555db7c8accf
Deleted: sha256:fc98586317a6d9fc723c6f44b6a7314202f20ffaebcb0e775bde30152f5080a2
Deleted: sha256:69d8cf06beb3f6841f6da644b95be17a2f9d0ce02f0279aedf96a29b0d6b10ea
Deleted: sha256:036ba7b48d675f7025d78979c8c865ea58b1c67e8990b8f3a5b6f1a7dbfd5884
Deleted: sha256:94b1d24c5060dcef2c9ecdfe72bd930e6f4fe9a759d15aee47dc4e6394c84c51
Deleted: sha256:2cda9d7f18d81a2ad56f711d80cc735586c89c6aabafcfe2a201250b14740197
Deleted: sha256:bbe3336402562438cf53ec93749b6aca0ebf5c0497c0e56bf239aea852a536fa
Deleted: sha256:321f599f8bf27f95c381f5be8dde25c30e06e6a1202b7ccacb9fd5f476244189
Deleted: sha256:18f7a497ab069cd048af7c047da2b727e0fa7c3b35c8803c24ee56584dffdd0b
Deleted: sha256:34852203e19712cf08c38593dadfb4d9ad8f649595faa9d53225775de3070cd1
Deleted: sha256:aba2ad4e7857c4feff28c0b41185353f0499d55ad0b1127ffedcf065dfcf8f4e
Deleted: sha256:a9c79d2b2fff1c4faad17d015a9742038bc8521a6af5b3775c60ade9729365f0
Deleted: sha256:f9aa8d0412bcc8448d71954dbf7a2f2a9cdc17af8840031c66f5a151ca9bd871
Deleted: sha256:4428980f04d9e77ce3f6df668ace9d5e46aa7ed58406ac852c535d8b2d2baa0e
Build step 'Execute shell' marked build as failure

Mime
View raw message