mesos-builds mailing list archives

Site index · List index
Message view « Date » · « Thread »
Top « Date » · « Thread »
From Apache Jenkins Server <jenk...@builds.apache.org>
Subject Build failed in Jenkins: Mesos-Buildbot » cmake,gcc,--verbose --enable-libevent --enable-ssl,GLOG_v=1 MESOS_VERBOSE=1,centos:7,(ubuntu)&&(!ubuntu-us1)&&(!ubuntu-eu2) #4063
Date Thu, 03 Aug 2017 18:09:37 GMT
See <https://builds.apache.org/job/Mesos-Buildbot/BUILDTOOL=cmake,COMPILER=gcc,CONFIGURATION=--verbose%20--enable-libevent%20--enable-ssl,ENVIRONMENT=GLOG_v=1%20MESOS_VERBOSE=1,OS=centos%3A7,label_exp=(ubuntu)&&(!ubuntu-us1)&&(!ubuntu-eu2)/4063/display/redirect?page=changes>

Changes:

[zhq527725] Replaced raw string with normal string for `DefaultContainerDNSCniTest`.

------------------------------------------
[...truncated 29.47 MB...]
I0803 18:09:17.729450  6626 http.cpp:1166] HTTP GET for /slave(796)/containers from 172.17.0.2:47772
I0803 18:09:17.729526  6626 http.cpp:957] Authorizing principal 'test-principal' to GET the
'/containers' endpoint
I0803 18:09:17.733754  6624 slave.cpp:843] Agent terminating
[       OK ] Endpoint/SlaveEndpointTest.AuthorizedRequest/2 (34 ms)
[ RUN      ] Endpoint/SlaveEndpointTest.UnauthorizedRequest/0
I0803 18:09:17.745177   951 containerizer.cpp:246] Using isolation: posix/cpu,posix/mem,filesystem/posix,network/cni,environment_secret
W0803 18:09:17.745651   951 backend.cpp:76] Failed to create 'aufs' backend: AufsBackend requires
root privileges
W0803 18:09:17.745757   951 backend.cpp:76] Failed to create 'bind' backend: BindBackend requires
root privileges
I0803 18:09:17.745790   951 provisioner.cpp:255] Using default backend 'copy'
I0803 18:09:17.749274  6629 slave.cpp:250] Mesos agent started on (797)@172.17.0.2:49573
I0803 18:09:17.749299  6629 slave.cpp:251] Flags at startup: --acls="" --appc_simple_discovery_uri_prefix="http://"
--appc_store_dir="/tmp/Endpoint_SlaveEndpointTest_UnauthorizedRequest_0_lUhnmd/store/appc"
--authenticate_http_executors="true" --authenticate_http_readonly="true" --authenticate_http_readwrite="true"
--authenticatee="crammd5" --authentication_backoff_factor="1secs" --authorizer="local" --cgroups_cpu_enable_pids_and_tids_count="false"
--cgroups_enable_cfs="false" --cgroups_hierarchy="/sys/fs/cgroup" --cgroups_limit_swap="false"
--cgroups_root="mesos" --container_disk_watch_interval="15secs" --containerizers="mesos" --credential="/tmp/Endpoint_SlaveEndpointTest_UnauthorizedRequest_0_lUhnmd/credential"
--default_role="*" --disk_watch_interval="1mins" --docker="docker" --docker_kill_orphans="true"
--docker_registry="https://registry-1.docker.io" --docker_remove_delay="6hrs" --docker_socket="/var/run/docker.sock"
--docker_stop_timeout="0ns" --docker_store_dir="/tmp/Endpoint_SlaveEndpointTest_UnauthorizedRequest_0_lUhnmd/store/docker"
--docker_volume_checkpoint_dir="/var/run/mesos/isolators/docker/volume" --enforce_container_disk_quota="false"
--executor_registration_timeout="1mins" --executor_reregistration_timeout="2secs" --executor_secret_key="/tmp/Endpoint_SlaveEndpointTest_UnauthorizedRequest_0_lUhnmd/executor_secret_key"
--executor_shutdown_grace_period="5secs" --fetcher_cache_dir="/tmp/Endpoint_SlaveEndpointTest_UnauthorizedRequest_0_lUhnmd/fetch"
--fetcher_cache_size="2GB" --frameworks_home="" --gc_delay="1weeks" --gc_disk_headroom="0.1"
--hadoop_home="" --help="false" --hostname_lookup="true" --http_command_executor="false" --http_credentials="/tmp/Endpoint_SlaveEndpointTest_UnauthorizedRequest_0_lUhnmd/http_credentials"
--http_heartbeat_interval="30secs" --initialize_driver_logging="true" --isolation="posix/cpu,posix/mem"
--launcher="posix" --launcher_dir="/mesos/build/src" --logbufsecs="0" --logging_level="INFO"
--max_completed_executors_per_framework="150" --oversubscribed_resources_interval="15secs"
--perf_duration="10secs" --perf_interval="1mins" --port="5051" --qos_correction_interval_min="0ns"
--quiet="false" --recover="reconnect" --recovery_timeout="15mins" --registration_backoff_factor="10ms"
--resources="cpus:2;gpus:0;mem:1024;disk:1024;ports:[31000-32000]" --revocable_cpu_low_priority="true"
--runtime_dir="/tmp/Endpoint_SlaveEndpointTest_UnauthorizedRequest_0_lUhnmd" --sandbox_directory="/mnt/mesos/sandbox"
--strict="true" --switch_user="true" --systemd_enable_support="true" --systemd_runtime_directory="/run/systemd/system"
--version="false" --work_dir="/tmp/Endpoint_SlaveEndpointTest_UnauthorizedRequest_0_CQ9zW3"
I0803 18:09:17.749778  6629 credentials.hpp:86] Loading credential for authentication from
'/tmp/Endpoint_SlaveEndpointTest_UnauthorizedRequest_0_lUhnmd/credential'
I0803 18:09:17.749938  6629 slave.cpp:283] Agent using credential for: test-principal
I0803 18:09:17.749953  6629 credentials.hpp:37] Loading credentials for authentication from
'/tmp/Endpoint_SlaveEndpointTest_UnauthorizedRequest_0_lUhnmd/http_credentials'
I0803 18:09:17.750193  6629 http.cpp:1026] Creating default 'basic' HTTP authenticator for
realm 'mesos-agent-executor'
I0803 18:09:17.750318  6629 http.cpp:1047] Creating default 'jwt' HTTP authenticator for realm
'mesos-agent-executor'
I0803 18:09:17.750510  6629 http.cpp:1026] Creating default 'basic' HTTP authenticator for
realm 'mesos-agent-readonly'
I0803 18:09:17.750596  6629 http.cpp:1047] Creating default 'jwt' HTTP authenticator for realm
'mesos-agent-readonly'
I0803 18:09:17.750777  6629 http.cpp:1026] Creating default 'basic' HTTP authenticator for
realm 'mesos-agent-readwrite'
I0803 18:09:17.750883  6629 http.cpp:1047] Creating default 'jwt' HTTP authenticator for realm
'mesos-agent-readwrite'
I0803 18:09:17.752276  6629 slave.cpp:565] Agent resources: [{"name":"cpus","scalar":{"value":2.0},"type":"SCALAR"},{"name":"mem","scalar":{"value":1024.0},"type":"SCALAR"},{"name":"disk","scalar":{"value":1024.0},"type":"SCALAR"},{"name":"ports","ranges":{"range":[{"begin":31000,"end":32000}]},"type":"RANGES"}]
I0803 18:09:17.752463  6629 slave.cpp:573] Agent attributes: [  ]
I0803 18:09:17.752480  6629 slave.cpp:582] Agent hostname: 6a8e92dd09bf
I0803 18:09:17.752688  6630 status_update_manager.cpp:177] Pausing sending status updates
I0803 18:09:17.754078  6616 state.cpp:64] Recovering state from '/tmp/Endpoint_SlaveEndpointTest_UnauthorizedRequest_0_CQ9zW3/meta'
I0803 18:09:17.754386  6616 status_update_manager.cpp:203] Recovering status update manager
I0803 18:09:17.754566  6617 containerizer.cpp:598] Recovering containerizer
I0803 18:09:17.756119  6625 provisioner.cpp:416] Provisioner recovery complete
I0803 18:09:17.756481  6621 slave.cpp:6207] Finished recovery
I0803 18:09:17.757035  6621 slave.cpp:6389] Querying resource estimator for oversubscribable
resources
I0803 18:09:17.757308  6629 slave.cpp:6403] Received oversubscribable resources {} from the
resource estimator
I0803 18:09:17.759824  6616 process.cpp:3938] Handling HTTP event for process 'slave(797)'
with path: '/slave(797)/monitor/statistics'
I0803 18:09:17.761584  6631 http.cpp:1166] HTTP GET for /slave(797)/monitor/statistics from
172.17.0.2:47773
I0803 18:09:17.761674  6631 http.cpp:957] Authorizing principal 'test-principal' to GET the
'/monitor/statistics' endpoint
I0803 18:09:17.763833  6629 slave.cpp:843] Agent terminating
[       OK ] Endpoint/SlaveEndpointTest.UnauthorizedRequest/0 (31 ms)
[ RUN      ] Endpoint/SlaveEndpointTest.UnauthorizedRequest/1
I0803 18:09:17.775550   951 containerizer.cpp:246] Using isolation: posix/cpu,posix/mem,filesystem/posix,network/cni,environment_secret
W0803 18:09:17.776062   951 backend.cpp:76] Failed to create 'aufs' backend: AufsBackend requires
root privileges
W0803 18:09:17.776175   951 backend.cpp:76] Failed to create 'bind' backend: BindBackend requires
root privileges
I0803 18:09:17.776214   951 provisioner.cpp:255] Using default backend 'copy'
I0803 18:09:17.779610  6629 slave.cpp:250] Mesos agent started on (798)@172.17.0.2:49573
I0803 18:09:17.779901  6629 slave.cpp:251] Flags at startup: --acls="" --appc_simple_discovery_uri_prefix="http://"
--appc_store_dir="/tmp/Endpoint_SlaveEndpointTest_UnauthorizedRequest_1_LNXqiP/store/appc"
--authenticate_http_executors="true" --authenticate_http_readonly="true" --authenticate_http_readwrite="true"
--authenticatee="crammd5" --authentication_backoff_factor="1secs" --authorizer="local" --cgroups_cpu_enable_pids_and_tids_count="false"
--cgroups_enable_cfs="false" --cgroups_hierarchy="/sys/fs/cgroup" --cgroups_limit_swap="false"
--cgroups_root="mesos" --container_disk_watch_interval="15secs" --containerizers="mesos" --credential="/tmp/Endpoint_SlaveEndpointTest_UnauthorizedRequest_1_LNXqiP/credential"
--default_role="*" --disk_watch_interval="1mins" --docker="docker" --docker_kill_orphans="true"
--docker_registry="https://registry-1.docker.io" --docker_remove_delay="6hrs" --docker_socket="/var/run/docker.sock"
--docker_stop_timeout="0ns" --docker_store_dir="/tmp/Endpoint_SlaveEndpointTest_UnauthorizedRequest_1_LNXqiP/store/docker"
--docker_volume_checkpoint_dir="/var/run/mesos/isolators/docker/volume" --enforce_container_disk_quota="false"
--executor_registration_timeout="1mins" --executor_reregistration_timeout="2secs" --executor_secret_key="/tmp/Endpoint_SlaveEndpointTest_UnauthorizedRequest_1_LNXqiP/executor_secret_key"
--executor_shutdown_grace_period="5secs" --fetcher_cache_dir="/tmp/Endpoint_SlaveEndpointTest_UnauthorizedRequest_1_LNXqiP/fetch"
--fetcher_cache_size="2GB" --frameworks_home="" --gc_delay="1weeks" --gc_disk_headroom="0.1"
--hadoop_home="" --help="false" --hostname_lookup="true" --http_command_executor="false" --http_credentials="/tmp/Endpoint_SlaveEndpointTest_UnauthorizedRequest_1_LNXqiP/http_credentials"
--http_heartbeat_interval="30secs" --initialize_driver_logging="true" --isolation="posix/cpu,posix/mem"
--launcher="posix" --launcher_dir="/mesos/build/src" --logbufsecs="0" --logging_level="INFO"
--max_completed_executors_per_framework="150" --oversubscribed_resources_interval="15secs"
--perf_duration="10secs" --perf_interval="1mins" --port="5051" --qos_correction_interval_min="0ns"
--quiet="false" --recover="reconnect" --recovery_timeout="15mins" --registration_backoff_factor="10ms"
--resources="cpus:2;gpus:0;mem:1024;disk:1024;ports:[31000-32000]" --revocable_cpu_low_priority="true"
--runtime_dir="/tmp/Endpoint_SlaveEndpointTest_UnauthorizedRequest_1_LNXqiP" --sandbox_directory="/mnt/mesos/sandbox"
--strict="true" --switch_user="true" --systemd_enable_support="true" --systemd_runtime_directory="/run/systemd/system"
--version="false" --work_dir="/tmp/Endpoint_SlaveEndpointTest_UnauthorizedRequest_1_CYlGNF"
I0803 18:09:17.780295  6629 credentials.hpp:86] Loading credential for authentication from
'/tmp/Endpoint_SlaveEndpointTest_UnauthorizedRequest_1_LNXqiP/credential'
I0803 18:09:17.780592  6629 slave.cpp:283] Agent using credential for: test-principal
I0803 18:09:17.780611  6629 credentials.hpp:37] Loading credentials for authentication from
'/tmp/Endpoint_SlaveEndpointTest_UnauthorizedRequest_1_LNXqiP/http_credentials'
I0803 18:09:17.780990  6629 http.cpp:1026] Creating default 'basic' HTTP authenticator for
realm 'mesos-agent-executor'
I0803 18:09:17.781191  6629 http.cpp:1047] Creating default 'jwt' HTTP authenticator for realm
'mesos-agent-executor'
I0803 18:09:17.781405  6629 http.cpp:1026] Creating default 'basic' HTTP authenticator for
realm 'mesos-agent-readonly'
I0803 18:09:17.781518  6629 http.cpp:1047] Creating default 'jwt' HTTP authenticator for realm
'mesos-agent-readonly'
I0803 18:09:17.781711  6629 http.cpp:1026] Creating default 'basic' HTTP authenticator for
realm 'mesos-agent-readwrite'
I0803 18:09:17.781827  6629 http.cpp:1047] Creating default 'jwt' HTTP authenticator for realm
'mesos-agent-readwrite'
I0803 18:09:17.783191  6629 slave.cpp:565] Agent resources: [{"name":"cpus","scalar":{"value":2.0},"type":"SCALAR"},{"name":"mem","scalar":{"value":1024.0},"type":"SCALAR"},{"name":"disk","scalar":{"value":1024.0},"type":"SCALAR"},{"name":"ports","ranges":{"range":[{"begin":31000,"end":32000}]},"type":"RANGES"}]
I0803 18:09:17.783375  6629 slave.cpp:573] Agent attributes: [  ]
I0803 18:09:17.783388  6629 slave.cpp:582] Agent hostname: 6a8e92dd09bf
I0803 18:09:17.783540  6616 status_update_manager.cpp:177] Pausing sending status updates
I0803 18:09:17.784982  6624 state.cpp:64] Recovering state from '/tmp/Endpoint_SlaveEndpointTest_UnauthorizedRequest_1_CYlGNF/meta'
I0803 18:09:17.785375  6626 status_update_manager.cpp:203] Recovering status update manager
I0803 18:09:17.785562  6628 containerizer.cpp:598] Recovering containerizer
I0803 18:09:17.787086  6626 provisioner.cpp:416] Provisioner recovery complete
I0803 18:09:17.787438  6627 slave.cpp:6207] Finished recovery
I0803 18:09:17.787968  6627 slave.cpp:6389] Querying resource estimator for oversubscribable
resources
I0803 18:09:17.788280  6629 slave.cpp:6403] Received oversubscribable resources {} from the
resource estimator
I0803 18:09:17.790560  6628 process.cpp:3938] Handling HTTP event for process 'slave(798)'
with path: '/slave(798)/monitor/statistics.json'
I0803 18:09:17.792338  6625 http.cpp:1166] HTTP GET for /slave(798)/monitor/statistics.json
from 172.17.0.2:47774
I0803 18:09:17.792423  6625 http.cpp:957] Authorizing principal 'test-principal' to GET the
'/monitor/statistics.json' endpoint
I0803 18:09:17.794759   951 slave.cpp:843] Agent terminating
[       OK ] Endpoint/SlaveEndpointTest.UnauthorizedRequest/1 (29 ms)
[ RUN      ] Endpoint/SlaveEndpointTest.UnauthorizedRequest/2
I0803 18:09:17.805393   951 containerizer.cpp:246] Using isolation: posix/cpu,posix/mem,filesystem/posix,network/cni,environment_secret
W0803 18:09:17.805874   951 backend.cpp:76] Failed to create 'aufs' backend: AufsBackend requires
root privileges
W0803 18:09:17.805980   951 backend.cpp:76] Failed to create 'bind' backend: BindBackend requires
root privileges
I0803 18:09:17.806012   951 provisioner.cpp:255] Using default backend 'copy'
I0803 18:09:17.809478  6625 slave.cpp:250] Mesos agent started on (799)@172.17.0.2:49573
I0803 18:09:17.809502  6625 slave.cpp:251] Flags at startup: --acls="" --appc_simple_discovery_uri_prefix="http://"
--appc_store_dir="/tmp/Endpoint_SlaveEndpointTest_UnauthorizedRequest_2_jwR2xr/store/appc"
--authenticate_http_executors="true" --authenticate_http_readonly="true" --authenticate_http_readwrite="true"
--authenticatee="crammd5" --authentication_backoff_factor="1secs" --authorizer="local" --cgroups_cpu_enable_pids_and_tids_count="false"
--cgroups_enable_cfs="false" --cgroups_hierarchy="/sys/fs/cgroup" --cgroups_limit_swap="false"
--cgroups_root="mesos" --container_disk_watch_interval="15secs" --containerizers="mesos" --credential="/tmp/Endpoint_SlaveEndpointTest_UnauthorizedRequest_2_jwR2xr/credential"
--default_role="*" --disk_watch_interval="1mins" --docker="docker" --docker_kill_orphans="true"
--docker_registry="https://registry-1.docker.io" --docker_remove_delay="6hrs" --docker_socket="/var/run/docker.sock"
--docker_stop_timeout="0ns" --docker_store_dir="/tmp/Endpoint_SlaveEndpointTest_UnauthorizedRequest_2_jwR2xr/store/docker"
--docker_volume_checkpoint_dir="/var/run/mesos/isolators/docker/volume" --enforce_container_disk_quota="false"
--executor_registration_timeout="1mins" --executor_reregistration_timeout="2secs" --executor_secret_key="/tmp/Endpoint_SlaveEndpointTest_UnauthorizedRequest_2_jwR2xr/executor_secret_key"
--executor_shutdown_grace_period="5secs" --fetcher_cache_dir="/tmp/Endpoint_SlaveEndpointTest_UnauthorizedRequest_2_jwR2xr/fetch"
--fetcher_cache_size="2GB" --frameworks_home="" --gc_delay="1weeks" --gc_disk_headroom="0.1"
--hadoop_home="" --help="false" --hostname_lookup="true" --http_command_executor="false" --http_credentials="/tmp/Endpoint_SlaveEndpointTest_UnauthorizedRequest_2_jwR2xr/http_credentials"
--http_heartbeat_interval="30secs" --initialize_driver_logging="true" --isolation="posix/cpu,posix/mem"
--launcher="posix" --launcher_dir="/mesos/build/src" --logbufsecs="0" --logging_level="INFO"
--max_completed_executors_per_framework="150" --oversubscribed_resources_interval="15secs"
--perf_duration="10secs" --perf_interval="1mins" --port="5051" --qos_correction_interval_min="0ns"
--quiet="false" --recover="reconnect" --recovery_timeout="15mins" --registration_backoff_factor="10ms"
--resources="cpus:2;gpus:0;mem:1024;disk:1024;ports:[31000-32000]" --revocable_cpu_low_priority="true"
--runtime_dir="/tmp/Endpoint_SlaveEndpointTest_UnauthorizedRequest_2_jwR2xr" --sandbox_directory="/mnt/mesos/sandbox"
--strict="true" --switch_user="true" --systemd_enable_support="true" --systemd_runtime_directory="/run/systemd/system"
--version="false" --work_dir="/tmp/Endpoint_SlaveEndpointTest_UnauthorizedRequest_2_yM5rYh"
I0803 18:09:17.809921  6625 credentials.hpp:86] Loading credential for authentication from
'/tmp/Endpoint_SlaveEndpointTest_UnauthorizedRequest_2_jwR2xr/credential'
I0803 18:09:17.810127  6625 slave.cpp:283] Agent using credential for: test-principal
I0803 18:09:17.810140  6625 credentials.hpp:37] Loading credentials for authentication from
'/tmp/Endpoint_SlaveEndpointTest_UnauthorizedRequest_2_jwR2xr/http_credentials'
I0803 18:09:17.810386  6625 http.cpp:1026] Creating default 'basic' HTTP authenticator for
realm 'mesos-agent-executor'
I0803 18:09:17.810554  6625 http.cpp:1047] Creating default 'jwt' HTTP authenticator for realm
'mesos-agent-executor'
I0803 18:09:17.810745  6625 http.cpp:1026] Creating default 'basic' HTTP authenticator for
realm 'mesos-agent-readonly'
I0803 18:09:17.810828  6625 http.cpp:1047] Creating default 'jwt' HTTP authenticator for realm
'mesos-agent-readonly'
I0803 18:09:17.810984  6625 http.cpp:1026] Creating default 'basic' HTTP authenticator for
realm 'mesos-agent-readwrite'
I0803 18:09:17.811070  6625 http.cpp:1047] Creating default 'jwt' HTTP authenticator for realm
'mesos-agent-readwrite'
I0803 18:09:17.812381  6625 slave.cpp:565] Agent resources: [{"name":"cpus","scalar":{"value":2.0},"type":"SCALAR"},{"name":"mem","scalar":{"value":1024.0},"type":"SCALAR"},{"name":"disk","scalar":{"value":1024.0},"type":"SCALAR"},{"name":"ports","ranges":{"range":[{"begin":31000,"end":32000}]},"type":"RANGES"}]
I0803 18:09:17.812559  6625 slave.cpp:573] Agent attributes: [  ]
I0803 18:09:17.812568  6625 slave.cpp:582] Agent hostname: 6a8e92dd09bf
I0803 18:09:17.812734  6619 status_update_manager.cpp:177] Pausing sending status updates
I0803 18:09:17.813963  6621 state.cpp:64] Recovering state from '/tmp/Endpoint_SlaveEndpointTest_UnauthorizedRequest_2_yM5rYh/meta'
I0803 18:09:17.814270  6628 status_update_manager.cpp:203] Recovering status update manager
I0803 18:09:17.814465  6627 containerizer.cpp:598] Recovering containerizer
I0803 18:09:17.815825  6630 provisioner.cpp:416] Provisioner recovery complete
I0803 18:09:17.816203  6629 slave.cpp:6207] Finished recovery
I0803 18:09:17.816817  6629 slave.cpp:6389] Querying resource estimator for oversubscribable
resources
I0803 18:09:17.817142  6621 slave.cpp:6403] Received oversubscribable resources {} from the
resource estimator
I0803 18:09:17.819526  6630 process.cpp:3938] Handling HTTP event for process 'slave(799)'
with path: '/slave(799)/containers'
I0803 18:09:17.821238  6626 http.cpp:1166] HTTP GET for /slave(799)/containers from 172.17.0.2:47775
I0803 18:09:17.821317  6626 http.cpp:957] Authorizing principal 'test-principal' to GET the
'/containers' endpoint
I0803 18:09:17.823201   951 slave.cpp:843] Agent terminating
[       OK ] Endpoint/SlaveEndpointTest.UnauthorizedRequest/2 (28 ms)
[ RUN      ] Endpoint/SlaveEndpointTest.NoAuthorizer/0
I0803 18:09:17.833894   951 containerizer.cpp:246] Using isolation: posix/cpu,posix/mem,filesystem/posix,network/cni,environment_secret
W0803 18:09:17.834378   951 backend.cpp:76] Failed to create 'aufs' backend: AufsBackend requires
root privileges
W0803 18:09:17.834483   951 backend.cpp:76] Failed to create 'bind' backend: BindBackend requires
root privileges
I0803 18:09:17.834513   951 provisioner.cpp:255] Using default backend 'copy'
I0803 18:09:17.836295   951 cluster.cpp:448] Creating default 'local' authorizer
I0803 18:09:17.838054  6619 slave.cpp:250] Mesos agent started on (800)@172.17.0.2:49573
I0803 18:09:17.838074  6619 slave.cpp:251] Flags at startup: --acls="" --appc_simple_discovery_uri_prefix="http://"
--appc_store_dir="/tmp/Endpoint_SlaveEndpointTest_NoAuthorizer_0_tfh553/store/appc" --authenticate_http_executors="true"
--authenticate_http_readonly="true" --authenticate_http_readwrite="true" --authenticatee="crammd5"
--authentication_backoff_factor="1secs" --authorizer="local" --cgroups_cpu_enable_pids_and_tids_count="false"
--cgroups_enable_cfs="false" --cgroups_hierarchy="/sys/fs/cgroup" --cgroups_limit_swap="false"
--cgroups_root="mesos" --container_disk_watch_interval="15secs" --containerizers="mesos" --credential="/tmp/Endpoint_SlaveEndpointTest_NoAuthorizer_0_tfh553/credential"
--default_role="*" --disk_watch_interval="1mins" --docker="docker" --docker_kill_orphans="true"
--docker_registry="https://registry-1.docker.io" --docker_remove_delay="6hrs" --docker_socket="/var/run/docker.sock"
--docker_stop_timeout="0ns" --docker_store_dir="/tmp/Endpoint_SlaveEndpointTest_NoAuthorizer_0_tfh553/store/docker"
--docker_volume_checkpoint_dir="/var/run/mesos/isolators/docker/volume" --enforce_container_disk_quota="false"
--executor_registration_timeout="1mins" --executor_reregistration_timeout="2secs" --executor_secret_key="/tmp/Endpoint_SlaveEndpointTest_NoAuthorizer_0_tfh553/executor_secret_key"
--executor_shutdown_grace_period="5secs" --fetcher_cache_dir="/tmp/Endpoint_SlaveEndpointTest_NoAuthorizer_0_tfh553/fetch"
--fetcher_cache_size="2GB" --frameworks_home="" --gc_delay="1weeks" --gc_disk_headroom="0.1"
--hadoop_home="" --help="false" --hostname_lookup="true" --http_command_executor="false" --http_credentials="/tmp/Endpoint_SlaveEndpointTest_NoAuthorizer_0_tfh553/http_credentials"
--http_heartbeat_interval="30secs" --initialize_driver_logging="true" --isolation="posix/cpu,posix/mem"
--launcher="posix" --launcher_dir="/mesos/build/src" --logbufsecs="0" --logging_level="INFO"
--max_completed_executors_per_framework="150" --oversubscribed_resources_interval="15secs"
--perf_duration="10secs" --perf_interval="1mins" --port="5051" --qos_correction_interval_min="0ns"
--quiet="false" --recover="reconnect" --recovery_timeout="15mins" --registration_backoff_factor="10ms"
--resources="cpus:2;gpus:0;mem:1024;disk:1024;ports:[31000-32000]" --revocable_cpu_low_priority="true"
--runtime_dir="/tmp/Endpoint_SlaveEndpointTest_NoAuthorizer_0_tfh553" --sandbox_directory="/mnt/mesos/sandbox"
--strict="true" --switch_user="true" --systemd_enable_support="true" --systemd_runtime_directory="/run/systemd/system"
--version="false" --work_dir="/tmp/Endpoint_SlaveEndpointTest_NoAuthorizer_0_QHAUrU"
I0803 18:09:17.838569  6619 credentials.hpp:86] Loading credential for authentication from
'/tmp/Endpoint_SlaveEndpointTest_NoAuthorizer_0_tfh553/credential'
I0803 18:09:17.838809  6619 slave.cpp:283] Agent using credential for: test-principal
I0803 18:09:17.838827  6619 credentials.hpp:37] Loading credentials for authentication from
'/tmp/Endpoint_SlaveEndpointTest_NoAuthorizer_0_tfh553/http_credentials'
I0803 18:09:17.839098  6619 http.cpp:1026] Creating default 'basic' HTTP authenticator for
realm 'mesos-agent-executor'
I0803 18:09:17.839269  6619 http.cpp:1047] Creating default 'jwt' HTTP authenticator for realm
'mesos-agent-executor'
I0803 18:09:17.839503  6619 http.cpp:1026] Creating default 'basic' HTTP authenticator for
realm 'mesos-agent-readonly'
I0803 18:09:17.839629  6619 http.cpp:1047] Creating default 'jwt' HTTP authenticator for realm
'mesos-agent-readonly'
I0803 18:09:17.839812  6619 http.cpp:1026] Creating default 'basic' HTTP authenticator for
realm 'mesos-agent-readwrite'
I0803 18:09:17.839915  6619 http.cpp:1047] Creating default 'jwt' HTTP authenticator for realm
'mesos-agent-readwrite'
I0803 18:09:17.841239  6619 slave.cpp:565] Agent resources: [{"name":"cpus","scalar":{"value":2.0},"type":"SCALAR"},{"name":"mem","scalar":{"value":1024.0},"type":"SCALAR"},{"name":"disk","scalar":{"value":1024.0},"type":"SCALAR"},{"name":"ports","ranges":{"range":[{"begin":31000,"end":32000}]},"type":"RANGES"}]
I0803 18:09:17.841420  6619 slave.cpp:573] Agent attributes: [  ]
I0803 18:09:17.841431  6619 slave.cpp:582] Agent hostname: 6a8e92dd09bf
I0803 18:09:17.841576  6631 status_update_manager.cpp:177] Pausing sending status updates
I0803 18:09:17.842926  6623 state.cpp:64] Recovering state from '/tmp/Endpoint_SlaveEndpointTest_NoAuthorizer_0_QHAUrU/meta'
I0803 18:09:17.843189  6624 status_update_manager.cpp:203] Recovering status update manager
I0803 18:09:17.843351  6622 containerizer.cpp:598] Recovering containerizer
I0803 18:09:17.844709  6617 provisioner.cpp:416] Provisioner recovery complete
I0803 18:09:17.845054  6616 slave.cpp:6207] Finished recovery
I0803 18:09:17.845640  6616 slave.cpp:6389] Querying resource estimator for oversubscribable
resources
I0803 18:09:17.846050  6618 slave.cpp:6403] Received oversubscribable resources {} from the
resource estimator
I0803 18:09:17.848383  6617 process.cpp:3938] Handling HTTP event for process 'slave(800)'
with path: '/slave(800)/monitor/statistics'
I0803 18:09:17.850143  6624 http.cpp:1166] HTTP GET for /slave(800)/monitor/statistics from
172.17.0.2:47776
I0803 18:09:17.850226  6624 http.cpp:957] Authorizing principal 'test-principal' to GET the
'/monitor/statistics' endpoint
I0803 18:09:17.853168  6616 slave.cpp:843] Agent terminating
[       OK ] Endpoint/SlaveEndpointTest.NoAuthorizer/0 (30 ms)
[ RUN      ] Endpoint/SlaveEndpointTest.NoAuthorizer/1
I0803 18:09:17.864321   951 containerizer.cpp:246] Using isolation: posix/cpu,posix/mem,filesystem/posix,network/cni,environment_secret
W0803 18:09:17.864779   951 backend.cpp:76] Failed to create 'aufs' backend: AufsBackend requires
root privileges
W0803 18:09:17.864878   951 backend.cpp:76] Failed to create 'bind' backend: BindBackend requires
root privileges
I0803 18:09:17.864905   951 provisioner.cpp:255] Using default backend 'copy'
I0803 18:09:17.866675   951 cluster.cpp:448] Creating default 'local' authorizer
I0803 18:09:17.868299  6625 slave.cpp:250] Mesos agent started on (801)@172.17.0.2:49573
I0803 18:09:17.868471  6625 slave.cpp:251] Flags at startup: --acls="" --appc_simple_discovery_uri_prefix="http://"
--appc_store_dir="/tmp/Endpoint_SlaveEndpointTest_NoAuthorizer_1_8XMDXG/store/appc" --authenticate_http_executors="true"
--authenticate_http_readonly="true" --authenticate_http_readwrite="true" --authenticatee="crammd5"
--authentication_backoff_factor="1secs" --authorizer="local" --cgroups_cpu_enable_pids_and_tids_count="false"
--cgroups_enable_cfs="false" --cgroups_hierarchy="/sys/fs/cgroup" --cgroups_limit_swap="false"
--cgroups_root="mesos" --container_disk_watch_interval="15secs" --containerizers="mesos" --credential="/tmp/Endpoint_SlaveEndpointTest_NoAuthorizer_1_8XMDXG/credential"
--default_role="*" --disk_watch_interval="1mins" --docker="docker" --docker_kill_orphans="true"
--docker_registry="https://registry-1.docker.io" --docker_remove_delay="6hrs" --docker_socket="/var/run/docker.sock"
--docker_stop_timeout="0ns" --docker_store_dir="/tmp/Endpoint_SlaveEndpointTest_NoAuthorizer_1_8XMDXG/store/docker"
--docker_volume_checkpoint_dir="/var/run/mesos/isolators/docker/volume" --enforce_container_disk_quota="false"
--executor_registration_timeout="1mins" --executor_reregistration_timeout="2secs" --executor_secret_key="/tmp/Endpoint_SlaveEndpointTest_NoAuthorizer_1_8XMDXG/executor_secret_key"
--executor_shutdown_grace_period="5secs" --fetcher_cache_dir="/tmp/Endpoint_SlaveEndpointTest_NoAuthorizer_1_8XMDXG/fetch"
--fetcher_cache_size="2GB" --frameworks_home="" --gc_delay="1weeks" --gc_disk_headroom="0.1"
--hadoop_home="" --help="false" --hostname_lookup="true" --http_command_executor="false" --http_credentials="/tmp/Endpoint_SlaveEndpointTest_NoAuthorizer_1_8XMDXG/http_credentials"
--http_heartbeat_interval="30secs" --initialize_driver_logging="true" --isolation="posix/cpu,posix/mem"
--launcher="posix" --launcher_dir="/mesos/build/src" --logbufsecs="0" --logging_level="INFO"
--max_completed_executors_per_framework="150" --oversubscribed_resources_interval="15secs"
--perf_duration="10secs" --perf_interval="1mins" --port="5051" --qos_correction_interval_min="0ns"
--quiet="false" --recover="reconnect" --recovery_timeout="15mins" --registration_backoff_factor="10ms"
--resources="cpus:2;gpus:0;mem:1024;disk:1024;ports:[31000-32000]" --revocable_cpu_low_priority="true"
--runtime_dir="/tmp/Endpoint_SlaveEndpointTest_NoAuthorizer_1_8XMDXG" --sandbox_directory="/mnt/mesos/sandbox"
--strict="true" --switch_user="true" --systemd_enable_support="true" --systemd_runtime_directory="/run/systemd/system"
--version="false" --work_dir="/tmp/Endpoint_SlaveEndpointTest_NoAuthorizer_1_tABwex"
I0803 18:09:17.868975  6625 credentials.hpp:86] Loading credential for authentication from
'/tmp/Endpoint_SlaveEndpointTest_NoAuthorizer_1_8XMDXG/credential'
I0803 18:09:17.869179  6625 slave.cpp:283] Agent using credential for: test-principal
I0803 18:09:17.869200  6625 credentials.hpp:37] Loading credentials for authentication from
'/tmp/Endpoint_SlaveEndpointTest_NoAuthorizer_1_8XMDXG/http_credentials'
I0803 18:09:17.869473  6625 http.cpp:1026] Creating default 'basic' HTTP authenticator for
realm 'mesos-agent-executor'
I0803 18:09:17.869596  6625 http.cpp:1047] Creating default 'jwt' HTTP authenticator for realm
'mesos-agent-executor'
I0803 18:09:17.869822  6625 http.cpp:1026] Creating default 'basic' HTTP authenticator for
realm 'mesos-agent-readonly'
I0803 18:09:17.869942  6625 http.cpp:1047] Creating default 'jwt' HTTP authenticator for realm
'mesos-agent-readonly'
I0803 18:09:17.870146  6625 http.cpp:1026] Creating default 'basic' HTTP authenticator for
realm 'mesos-agent-readwrite'
I0803 18:09:17.870250  6625 http.cpp:1047] Creating default 'jwt' HTTP authenticator for realm
'mesos-agent-readwrite'
I0803 18:09:17.871526  6625 slave.cpp:565] Agent resources: [{"name":"cpus","scalar":{"value":2.0},"type":"SCALAR"},{"name":"mem","scalar":{"value":1024.0},"type":"SCALAR"},{"name":"disk","scalar":{"value":1024.0},"type":"SCALAR"},{"name":"ports","ranges":{"range":[{"begin":31000,"end":32000}]},"type":"RANGES"}]
I0803 18:09:17.871701  6625 slave.cpp:573] Agent attributes: [  ]
I0803 18:09:17.871713  6625 slave.cpp:582] Agent hostname: 6a8e92dd09bf
I0803 18:09:17.871835  6621 status_update_manager.cpp:177] Pausing sending status updates
I0803 18:09:17.873311  6617 state.cpp:64] Recovering state from '/tmp/Endpoint_SlaveEndpointTest_NoAuthorizer_1_tABwex/meta'
I0803 18:09:17.873693  6622 status_update_manager.cpp:203] Recovering status update manager
I0803 18:09:17.873908  6618 containerizer.cpp:598] Recovering containerizer
I0803 18:09:17.875407  6631 provisioner.cpp:416] Provisioner recovery complete
I0803 18:09:17.875711  6621 slave.cpp:6207] Finished recovery
I0803 18:09:17.876286  6621 slave.cpp:6389] Querying resource estimator for oversubscribable
resources
I0803 18:09:17.876590  6626 slave.cpp:6403] Received oversubscribable resources {} from the
resource estimator
I0803 18:09:17.879106  6620 process.cpp:3938] Handling HTTP event for process 'slave(801)'
with path: '/slave(801)/monitor/statistics.json'
I0803 18:09:17.880882  6617 http.cpp:1166] HTTP GET for /slave(801)/monitor/statistics.json
from 172.17.0.2:47777
I0803 18:09:17.880985  6617 http.cpp:957] Authorizing principal 'test-principal' to GET the
'/monitor/statistics.json' endpoint
I0803 18:09:17.883836   951 slave.cpp:843] Agent terminating
[       OK ] Endpoint/SlaveEndpointTest.NoAuthorizer/1 (30 ms)
[ RUN      ] Endpoint/SlaveEndpointTest.NoAuthorizer/2
I0803 18:09:17.894454   951 containerizer.cpp:246] Using isolation: posix/cpu,posix/mem,filesystem/posix,network/cni,environment_secret
W0803 18:09:17.894908   951 backend.cpp:76] Failed to create 'aufs' backend: AufsBackend requires
root privileges
W0803 18:09:17.895009   951 backend.cpp:76] Failed to create 'bind' backend: BindBackend requires
root privileges
I0803 18:09:17.895037   951 provisioner.cpp:255] Using default backend 'copy'
I0803 18:09:17.896764   951 cluster.cpp:448] Creating default 'local' authorizer
I0803 18:09:17.898461  6625 slave.cpp:250] Mesos agent started on (802)@172.17.0.2:49573
I0803 18:09:17.898495  6625 slave.cpp:251] Flags at startup: --acls="" --appc_simple_discovery_uri_prefix="http://"
--appc_store_dir="/tmp/Endpoint_SlaveEndpointTest_NoAuthorizer_2_gnbY8j/store/appc" --authenticate_http_executors="true"
--authenticate_http_readonly="true" --authenticate_http_readwrite="true" --authenticatee="crammd5"
--authentication_backoff_factor="1secs" --authorizer="local" --cgroups_cpu_enable_pids_and_tids_count="false"
--cgroups_enable_cfs="false" --cgroups_hierarchy="/sys/fs/cgroup" --cgroups_limit_swap="false"
--cgroups_root="mesos" --container_disk_watch_interval="15secs" --containerizers="mesos" --credential="/tmp/Endpoint_SlaveEndpointTest_NoAuthorizer_2_gnbY8j/credential"
--default_role="*" --disk_watch_interval="1mins" --docker="docker" --docker_kill_orphans="true"
--docker_registry="https://registry-1.docker.io" --docker_remove_delay="6hrs" --docker_socket="/var/run/docker.sock"
--docker_stop_timeout="0ns" --docker_store_dir="/tmp/Endpoint_SlaveEndpointTest_NoAuthorizer_2_gnbY8j/store/docker"
--docker_volume_checkpoint_dir="/var/run/mesos/isolators/docker/volume" --enforce_container_disk_quota="false"
--executor_registration_timeout="1mins" --executor_reregistration_timeout="2secs" --executor_secret_key="/tmp/Endpoint_SlaveEndpointTest_NoAuthorizer_2_gnbY8j/executor_secret_key"
--executor_shutdown_grace_period="5secs" --fetcher_cache_dir="/tmp/Endpoint_SlaveEndpointTest_NoAuthorizer_2_gnbY8j/fetch"
--fetcher_cache_size="2GB" --frameworks_home="" --gc_delay="1weeks" --gc_disk_headroom="0.1"
--hadoop_home="" --help="false" --hostname_lookup="true" --http_command_executor="false" --http_credentials="/tmp/Endpoint_SlaveEndpointTest_NoAuthorizer_2_gnbY8j/http_credentials"
--http_heartbeat_interval="30secs" --initialize_driver_logging="true" --isolation="posix/cpu,posix/mem"
--launcher="posix" --launcher_dir="/mesos/build/src" --logbufsecs="0" --logging_level="INFO"
--max_completed_executors_per_framework="150" --oversubscribed_resources_interval="15secs"
--perf_duration="10secs" --perf_interval="1mins" --port="5051" --qos_correction_interval_min="0ns"
--quiet="false" --recover="reconnect" --recovery_timeout="15mins" --registration_backoff_factor="10ms"
--resources="cpus:2;gpus:0;mem:1024;disk:1024;ports:[31000-32000]" --revocable_cpu_low_priority="true"
--runtime_dir="/tmp/Endpoint_SlaveEndpointTest_NoAuthorizer_2_gnbY8j" --sandbox_directory="/mnt/mesos/sandbox"
--strict="true" --switch_user="true" --systemd_enable_support="true" --systemd_runtime_directory="/run/systemd/system"
--version="false" --work_dir="/tmp/Endpoint_SlaveEndpointTest_NoAuthorizer_2_gPtVka"
I0803 18:09:17.899128  6625 credentials.hpp:86] Loading credential for authentication from
'/tmp/Endpoint_SlaveEndpointTest_NoAuthorizer_2_gnbY8j/credential'
I0803 18:09:17.899358  6625 slave.cpp:283] Agent using credential for: test-principal
I0803 18:09:17.899509  6625 credentials.hpp:37] Loading credentials for authentication from
'/tmp/Endpoint_SlaveEndpointTest_NoAuthorizer_2_gnbY8j/http_credentials'
I0803 18:09:17.899864  6625 http.cpp:1026] Creating default 'basic' HTTP authenticator for
realm 'mesos-agent-executor'
I0803 18:09:17.900099  6625 http.cpp:1047] Creating default 'jwt' HTTP authenticator for realm
'mesos-agent-executor'
I0803 18:09:17.900324  6625 http.cpp:1026] Creating default 'basic' HTTP authenticator for
realm 'mesos-agent-readonly'
I0803 18:09:17.900429  6625 http.cpp:1047] Creating default 'jwt' HTTP authenticator for realm
'mesos-agent-readonly'
I0803 18:09:17.900617  6625 http.cpp:1026] Creating default 'basic' HTTP authenticator for
realm 'mesos-agent-readwrite'
I0803 18:09:17.900749  6625 http.cpp:1047] Creating default 'jwt' HTTP authenticator for realm
'mesos-agent-readwrite'
I0803 18:09:17.902078  6625 slave.cpp:565] Agent resources: [{"name":"cpus","scalar":{"value":2.0},"type":"SCALAR"},{"name":"mem","scalar":{"value":1024.0},"type":"SCALAR"},{"name":"disk","scalar":{"value":1024.0},"type":"SCALAR"},{"name":"ports","ranges":{"range":[{"begin":31000,"end":32000}]},"type":"RANGES"}]
I0803 18:09:17.902269  6625 slave.cpp:573] Agent attributes: [  ]
I0803 18:09:17.902304  6625 slave.cpp:582] Agent hostname: 6a8e92dd09bf
I0803 18:09:17.902463  6617 status_update_manager.cpp:177] Pausing sending status updates
I0803 18:09:17.903940  6623 state.cpp:64] Recovering state from '/tmp/Endpoint_SlaveEndpointTest_NoAuthorizer_2_gPtVka/meta'
I0803 18:09:17.904261  6616 status_update_manager.cpp:203] Recovering status update manager
I0803 18:09:17.904446  6616 containerizer.cpp:598] Recovering containerizer
I0803 18:09:17.905921  6619 provisioner.cpp:416] Provisioner recovery complete
I0803 18:09:17.906298  6620 slave.cpp:6207] Finished recovery
I0803 18:09:17.906765  6620 slave.cpp:6389] Querying resource estimator for oversubscribable
resources
I0803 18:09:17.907059  6625 slave.cpp:6403] Received oversubscribable resources {} from the
resource estimator
I0803 18:09:17.909397  6621 process.cpp:3938] Handling HTTP event for process 'slave(802)'
with path: '/slave(802)/containers'
I0803 18:09:17.911206  6618 http.cpp:1166] HTTP GET for /slave(802)/containers from 172.17.0.2:47778
I0803 18:09:17.911304  6618 http.cpp:957] Authorizing principal 'test-principal' to GET the
'/containers' endpoint
I0803 18:09:17.915177   951 slave.cpp:843] Agent terminating
[       OK ] Endpoint/SlaveEndpointTest.NoAuthorizer/2 (31 ms)
[----------] 9 tests from Endpoint/SlaveEndpointTest (289 ms total)

[----------] Global test environment tear-down
[==========] 1607 tests from 176 test cases ran. (307333 ms total)
[  PASSED  ] 1606 tests.
[  FAILED  ] 1 test, listed below:
[  FAILED  ] SlaveTest.UnreachableAgentReregisterAfterFailover

 1 FAILED TEST
  YOU HAVE 20 DISABLED TESTS

I0803 18:09:17.977715  6632 process.cpp:1072] Failed to accept socket: future discarded
make[3]: *** [CMakeFiles/check] Error 1
make[3]: Leaving directory `/mesos/build'
make[2]: *** [CMakeFiles/check.dir/all] Error 2
make[2]: Leaving directory `/mesos/build'
make[1]: *** [CMakeFiles/check.dir/rule] Error 2
make[1]: Leaving directory `/mesos/build'
make: *** [check] Error 2
+ docker rmi mesos-1501780686-3412
Untagged: mesos-1501780686-3412:latest
Deleted: sha256:07cbaff4b1bc6f401d6f41057ed63c47b8cbc38b666ad1b0cc55b2c49e0ec821
Deleted: sha256:6c5ab7d46e0866a10d721af6fa8eddf6275fdb208bbd452f6c5b71d1e67e08f3
Deleted: sha256:2e524ac9cc09a76c167ab1f50ca206cfe9d9731f32fdd42890dc6b6d5258bd1f
Deleted: sha256:ee717c66132b1df5fd05e74d3ea47718c44b215e20d19118e804645f1b5c6a9b
Deleted: sha256:27840f3ec37c2bb3fadfde3a883a9ed96b189117dd2c37b09f5ecf680aa9a1ce
Deleted: sha256:c999f8eea028f91df3c2d984f35e74bee8ccbf44277b3105be874df46cc97a99
Deleted: sha256:400930351e8d53e45fae42efbcec171308d5dd27fbfd3b10a1975937880b948e
Deleted: sha256:dc03806e597f91fb5fb4938e1f83b242c9c935173006411101b4f09974bdc0f4
Deleted: sha256:aefead0d4a813d60aa08933ede71c2516595f181a339d42b7cd92692ea0d4ecc
Deleted: sha256:a2d23916b7f6d7d47c290d4c0b7b9ad39b91214a58a596c0cd8ac158f0c00ea7
Deleted: sha256:d45a7ea41af5a23c5d76115d48b4ed4634b1a8bd743bb605c2f2e0652dc0e6a3
Deleted: sha256:b4edacd31cb4891e05afe0451040eeb0d4a1664c33195c5e8aff66de9c828827
Deleted: sha256:12ec21e80138c67540ee0d5e01aec77a5fcd30f1735eff4b2a61502daf1fc9e2
Deleted: sha256:2b2ac3d3319452aeb61ff5a37e091fda1f00ee91d3a0a384194eb13a661830c7
Deleted: sha256:3bdfb2f24bc7e0a992354eff00c3e38ce7eef290d1ac4ef0954b7a3621cc7de3
Deleted: sha256:cd76da2cc5806c8eccaa8c3ea802e42ad8259ae2f11e56b77a2e660e0044d53e
Deleted: sha256:1b29c8be5564596411a86a387ea8f718911cc6016d600c8ef75aa5399ffc5b75
Deleted: sha256:ddf07a7269f1328ee9f83587bdbd1a786d2d1efc3895e09a7b647f1fc232d543
Deleted: sha256:17c2fb4147aa4de4f391b3f634b580145edd59ad4007032c026fb755614764ef
Deleted: sha256:69c8869bbf811674fc1eae8b0c99361fa9676837ac16dce2a618dcbbf9b1b653
Deleted: sha256:1c28e6c516094e35896ea019a2ebe04c2a5e3e57cea3a194b5eef9e7e3b1da3b
Deleted: sha256:d990a373d38af3195dffa799c8a16dd7ef29615a72a09a26b7b90a7f50f93278
Deleted: sha256:25c126f031f8c4e0d268c1f06f1fb94cabb729aca2ce4725a10598ffe17aeb86
Deleted: sha256:9d4aed647f069095c3d30be16c391d8ac5f39c9f7c47577e2e574303f69fdb5f
Deleted: sha256:4f6b55d8c039c07d680a0206f895a6e2aed698b62ce35e77be3870589bdc9d3e
Build step 'Execute shell' marked build as failure
Not sending mail to unregistered user zhq527725@gmail.com
Not sending mail to unregistered user songzihao1990@gmail.com
Not sending mail to unregistered user gregorywmann@gmail.com

Mime
View raw message