mesos-builds mailing list archives

Site index · List index
Message view « Date » · « Thread »
Top « Date » · « Thread »
From Apache Jenkins Server <jenk...@builds.apache.org>
Subject Build failed in Jenkins: Mesos-Buildbot » autotools,gcc,--verbose --enable-libevent --enable-ssl,GLOG_v=1 MESOS_VERBOSE=1,ubuntu:14.04,(ubuntu)&&(!ubuntu-us1)&&(!ubuntu-eu2) #4071
Date Sat, 05 Aug 2017 01:19:13 GMT
See <https://builds.apache.org/job/Mesos-Buildbot/BUILDTOOL=autotools,COMPILER=gcc,CONFIGURATION=--verbose%20--enable-libevent%20--enable-ssl,ENVIRONMENT=GLOG_v=1%20MESOS_VERBOSE=1,OS=ubuntu%3A14.04,label_exp=(ubuntu)&&(!ubuntu-us1)&&(!ubuntu-eu2)/4071/display/redirect?page=changes>

Changes:

[vinodkone] Updated working groups doc to remove email markdown shortcut.

[vinodkone] Disabled caching during docker build of the website.

[vinodkone] Disabled caching during docker build of the website.

------------------------------------------
[...truncated 32.28 MB...]
W0805 01:19:04.523071  8380 backend.cpp:76] Failed to create 'bind' backend: BindBackend requires
root privileges
I0805 01:19:04.523114  8380 provisioner.cpp:255] Using default backend 'copy'
I0805 01:19:04.527432 29739 slave.cpp:250] Mesos agent started on (805)@172.17.0.5:38443
I0805 01:19:04.527458 29739 slave.cpp:251] Flags at startup: --acls="" --appc_simple_discovery_uri_prefix="http://"
--appc_store_dir="/tmp/Endpoint_SlaveEndpointTest_UnauthorizedRequest_0_oSwgp3/store/appc"
--authenticate_http_executors="true" --authenticate_http_readonly="true" --authenticate_http_readwrite="true"
--authenticatee="crammd5" --authentication_backoff_factor="1secs" --authorizer="local" --cgroups_cpu_enable_pids_and_tids_count="false"
--cgroups_enable_cfs="false" --cgroups_hierarchy="/sys/fs/cgroup" --cgroups_limit_swap="false"
--cgroups_root="mesos" --container_disk_watch_interval="15secs" --containerizers="mesos" --credential="/tmp/Endpoint_SlaveEndpointTest_UnauthorizedRequest_0_oSwgp3/credential"
--default_role="*" --disk_watch_interval="1mins" --docker="docker" --docker_kill_orphans="true"
--docker_registry="https://registry-1.docker.io" --docker_remove_delay="6hrs" --docker_socket="/var/run/docker.sock"
--docker_stop_timeout="0ns" --docker_store_dir="/tmp/Endpoint_SlaveEndpointTest_UnauthorizedRequest_0_oSwgp3/store/docker"
--docker_volume_checkpoint_dir="/var/run/mesos/isolators/docker/volume" --enforce_container_disk_quota="false"
--executor_registration_timeout="1mins" --executor_reregistration_timeout="2secs" --executor_secret_key="/tmp/Endpoint_SlaveEndpointTest_UnauthorizedRequest_0_oSwgp3/executor_secret_key"
--executor_shutdown_grace_period="5secs" --fetcher_cache_dir="/tmp/Endpoint_SlaveEndpointTest_UnauthorizedRequest_0_oSwgp3/fetch"
--fetcher_cache_size="2GB" --frameworks_home="" --gc_delay="1weeks" --gc_disk_headroom="0.1"
--hadoop_home="" --help="false" --hostname_lookup="true" --http_command_executor="false" --http_credentials="/tmp/Endpoint_SlaveEndpointTest_UnauthorizedRequest_0_oSwgp3/http_credentials"
--http_heartbeat_interval="30secs" --initialize_driver_logging="true" --isolation="posix/cpu,posix/mem"
--launcher="posix" --launcher_dir="/mesos/mesos-1.4.0/_build/src" --logbufsecs="0" --logging_level="INFO"
--max_completed_executors_per_framework="150" --oversubscribed_resources_interval="15secs"
--perf_duration="10secs" --perf_interval="1mins" --port="5051" --qos_correction_interval_min="0ns"
--quiet="false" --recover="reconnect" --recovery_timeout="15mins" --registration_backoff_factor="10ms"
--resources="cpus:2;gpus:0;mem:1024;disk:1024;ports:[31000-32000]" --revocable_cpu_low_priority="true"
--runtime_dir="/tmp/Endpoint_SlaveEndpointTest_UnauthorizedRequest_0_oSwgp3" --sandbox_directory="/mnt/mesos/sandbox"
--strict="true" --switch_user="true" --systemd_enable_support="true" --systemd_runtime_directory="/run/systemd/system"
--version="false" --work_dir="/tmp/Endpoint_SlaveEndpointTest_UnauthorizedRequest_0_auLylQ"
I0805 01:19:04.527918 29739 credentials.hpp:86] Loading credential for authentication from
'/tmp/Endpoint_SlaveEndpointTest_UnauthorizedRequest_0_oSwgp3/credential'
I0805 01:19:04.528066 29739 slave.cpp:283] Agent using credential for: test-principal
I0805 01:19:04.528095 29739 credentials.hpp:37] Loading credentials for authentication from
'/tmp/Endpoint_SlaveEndpointTest_UnauthorizedRequest_0_oSwgp3/http_credentials'
I0805 01:19:04.528368 29739 http.cpp:1026] Creating default 'basic' HTTP authenticator for
realm 'mesos-agent-executor'
I0805 01:19:04.528491 29739 http.cpp:1047] Creating default 'jwt' HTTP authenticator for realm
'mesos-agent-executor'
I0805 01:19:04.528693 29739 http.cpp:1026] Creating default 'basic' HTTP authenticator for
realm 'mesos-agent-readonly'
I0805 01:19:04.528800 29739 http.cpp:1047] Creating default 'jwt' HTTP authenticator for realm
'mesos-agent-readonly'
I0805 01:19:04.528995 29739 http.cpp:1026] Creating default 'basic' HTTP authenticator for
realm 'mesos-agent-readwrite'
I0805 01:19:04.529110 29739 http.cpp:1047] Creating default 'jwt' HTTP authenticator for realm
'mesos-agent-readwrite'
I0805 01:19:04.530485 29739 slave.cpp:565] Agent resources: [{"name":"cpus","scalar":{"value":2.0},"type":"SCALAR"},{"name":"mem","scalar":{"value":1024.0},"type":"SCALAR"},{"name":"disk","scalar":{"value":1024.0},"type":"SCALAR"},{"name":"ports","ranges":{"range":[{"begin":31000,"end":32000}]},"type":"RANGES"}]
I0805 01:19:04.530719 29739 slave.cpp:573] Agent attributes: [  ]
I0805 01:19:04.530738 29739 slave.cpp:582] Agent hostname: 90eb458356a8
I0805 01:19:04.530922 29728 status_update_manager.cpp:177] Pausing sending status updates
I0805 01:19:04.532137 29724 state.cpp:64] Recovering state from '/tmp/Endpoint_SlaveEndpointTest_UnauthorizedRequest_0_auLylQ/meta'
I0805 01:19:04.532405 29744 status_update_manager.cpp:203] Recovering status update manager
I0805 01:19:04.532601 29727 containerizer.cpp:598] Recovering containerizer
I0805 01:19:04.534463 29726 provisioner.cpp:416] Provisioner recovery complete
I0805 01:19:04.534795 29739 slave.cpp:6207] Finished recovery
I0805 01:19:04.535249 29739 slave.cpp:6389] Querying resource estimator for oversubscribable
resources
I0805 01:19:04.535514 29735 slave.cpp:6403] Received oversubscribable resources {} from the
resource estimator
I0805 01:19:04.537925 29725 process.cpp:3933] Handling HTTP event for process 'slave(805)'
with path: '/slave(805)/monitor/statistics'
I0805 01:19:04.540267 29741 http.cpp:1166] HTTP GET for /slave(805)/monitor/statistics from
172.17.0.5:57958
I0805 01:19:04.540345 29741 http.cpp:957] Authorizing principal 'test-principal' to GET the
'/monitor/statistics' endpoint
I0805 01:19:04.542472 29729 slave.cpp:843] Agent terminating
[       OK ] Endpoint/SlaveEndpointTest.UnauthorizedRequest/0 (31 ms)
[ RUN      ] Endpoint/SlaveEndpointTest.UnauthorizedRequest/1
I0805 01:19:04.553355  8380 containerizer.cpp:246] Using isolation: posix/cpu,posix/mem,filesystem/posix,network/cni,environment_secret
W0805 01:19:04.553831  8380 backend.cpp:76] Failed to create 'aufs' backend: AufsBackend requires
root privileges
W0805 01:19:04.553935  8380 backend.cpp:76] Failed to create 'bind' backend: BindBackend requires
root privileges
I0805 01:19:04.553964  8380 provisioner.cpp:255] Using default backend 'copy'
I0805 01:19:04.557255 29727 slave.cpp:250] Mesos agent started on (806)@172.17.0.5:38443
I0805 01:19:04.557276 29727 slave.cpp:251] Flags at startup: --acls="" --appc_simple_discovery_uri_prefix="http://"
--appc_store_dir="/tmp/Endpoint_SlaveEndpointTest_UnauthorizedRequest_1_QzW3TT/store/appc"
--authenticate_http_executors="true" --authenticate_http_readonly="true" --authenticate_http_readwrite="true"
--authenticatee="crammd5" --authentication_backoff_factor="1secs" --authorizer="local" --cgroups_cpu_enable_pids_and_tids_count="false"
--cgroups_enable_cfs="false" --cgroups_hierarchy="/sys/fs/cgroup" --cgroups_limit_swap="false"
--cgroups_root="mesos" --container_disk_watch_interval="15secs" --containerizers="mesos" --credential="/tmp/Endpoint_SlaveEndpointTest_UnauthorizedRequest_1_QzW3TT/credential"
--default_role="*" --disk_watch_interval="1mins" --docker="docker" --docker_kill_orphans="true"
--docker_registry="https://registry-1.docker.io" --docker_remove_delay="6hrs" --docker_socket="/var/run/docker.sock"
--docker_stop_timeout="0ns" --docker_store_dir="/tmp/Endpoint_SlaveEndpointTest_UnauthorizedRequest_1_QzW3TT/store/docker"
--docker_volume_checkpoint_dir="/var/run/mesos/isolators/docker/volume" --enforce_container_disk_quota="false"
--executor_registration_timeout="1mins" --executor_reregistration_timeout="2secs" --executor_secret_key="/tmp/Endpoint_SlaveEndpointTest_UnauthorizedRequest_1_QzW3TT/executor_secret_key"
--executor_shutdown_grace_period="5secs" --fetcher_cache_dir="/tmp/Endpoint_SlaveEndpointTest_UnauthorizedRequest_1_QzW3TT/fetch"
--fetcher_cache_size="2GB" --frameworks_home="" --gc_delay="1weeks" --gc_disk_headroom="0.1"
--hadoop_home="" --help="false" --hostname_lookup="true" --http_command_executor="false" --http_credentials="/tmp/Endpoint_SlaveEndpointTest_UnauthorizedRequest_1_QzW3TT/http_credentials"
--http_heartbeat_interval="30secs" --initialize_driver_logging="true" --isolation="posix/cpu,posix/mem"
--launcher="posix" --launcher_dir="/mesos/mesos-1.4.0/_build/src" --logbufsecs="0" --logging_level="INFO"
--max_completed_executors_per_framework="150" --oversubscribed_resources_interval="15secs"
--perf_duration="10secs" --perf_interval="1mins" --port="5051" --qos_correction_interval_min="0ns"
--quiet="false" --recover="reconnect" --recovery_timeout="15mins" --registration_backoff_factor="10ms"
--resources="cpus:2;gpus:0;mem:1024;disk:1024;ports:[31000-32000]" --revocable_cpu_low_priority="true"
--runtime_dir="/tmp/Endpoint_SlaveEndpointTest_UnauthorizedRequest_1_QzW3TT" --sandbox_directory="/mnt/mesos/sandbox"
--strict="true" --switch_user="true" --systemd_enable_support="true" --systemd_runtime_directory="/run/systemd/system"
--version="false" --work_dir="/tmp/Endpoint_SlaveEndpointTest_UnauthorizedRequest_1_kU6HLG"
I0805 01:19:04.557621 29727 credentials.hpp:86] Loading credential for authentication from
'/tmp/Endpoint_SlaveEndpointTest_UnauthorizedRequest_1_QzW3TT/credential'
I0805 01:19:04.557770 29727 slave.cpp:283] Agent using credential for: test-principal
I0805 01:19:04.557792 29727 credentials.hpp:37] Loading credentials for authentication from
'/tmp/Endpoint_SlaveEndpointTest_UnauthorizedRequest_1_QzW3TT/http_credentials'
I0805 01:19:04.558058 29727 http.cpp:1026] Creating default 'basic' HTTP authenticator for
realm 'mesos-agent-executor'
I0805 01:19:04.558172 29727 http.cpp:1047] Creating default 'jwt' HTTP authenticator for realm
'mesos-agent-executor'
I0805 01:19:04.558358 29727 http.cpp:1026] Creating default 'basic' HTTP authenticator for
realm 'mesos-agent-readonly'
I0805 01:19:04.558456 29727 http.cpp:1047] Creating default 'jwt' HTTP authenticator for realm
'mesos-agent-readonly'
I0805 01:19:04.558629 29727 http.cpp:1026] Creating default 'basic' HTTP authenticator for
realm 'mesos-agent-readwrite'
I0805 01:19:04.558727 29727 http.cpp:1047] Creating default 'jwt' HTTP authenticator for realm
'mesos-agent-readwrite'
I0805 01:19:04.560067 29727 slave.cpp:565] Agent resources: [{"name":"cpus","scalar":{"value":2.0},"type":"SCALAR"},{"name":"mem","scalar":{"value":1024.0},"type":"SCALAR"},{"name":"disk","scalar":{"value":1024.0},"type":"SCALAR"},{"name":"ports","ranges":{"range":[{"begin":31000,"end":32000}]},"type":"RANGES"}]
I0805 01:19:04.560292 29727 slave.cpp:573] Agent attributes: [  ]
I0805 01:19:04.560307 29727 slave.cpp:582] Agent hostname: 90eb458356a8
I0805 01:19:04.560423 29732 status_update_manager.cpp:177] Pausing sending status updates
I0805 01:19:04.561722 29733 state.cpp:64] Recovering state from '/tmp/Endpoint_SlaveEndpointTest_UnauthorizedRequest_1_kU6HLG/meta'
I0805 01:19:04.562047 29725 status_update_manager.cpp:203] Recovering status update manager
I0805 01:19:04.562278 29744 containerizer.cpp:598] Recovering containerizer
I0805 01:19:04.563614 29735 provisioner.cpp:416] Provisioner recovery complete
I0805 01:19:04.564123 29737 slave.cpp:6207] Finished recovery
I0805 01:19:04.564641 29737 slave.cpp:6389] Querying resource estimator for oversubscribable
resources
I0805 01:19:04.564847 29731 slave.cpp:6403] Received oversubscribable resources {} from the
resource estimator
I0805 01:19:04.566879 29722 process.cpp:3933] Handling HTTP event for process 'slave(806)'
with path: '/slave(806)/monitor/statistics.json'
I0805 01:19:04.568707 29743 http.cpp:1166] HTTP GET for /slave(806)/monitor/statistics.json
from 172.17.0.5:57960
I0805 01:19:04.568800 29743 http.cpp:957] Authorizing principal 'test-principal' to GET the
'/monitor/statistics.json' endpoint
I0805 01:19:04.570941  8380 slave.cpp:843] Agent terminating
[       OK ] Endpoint/SlaveEndpointTest.UnauthorizedRequest/1 (28 ms)
[ RUN      ] Endpoint/SlaveEndpointTest.UnauthorizedRequest/2
I0805 01:19:04.582065  8380 containerizer.cpp:246] Using isolation: posix/cpu,posix/mem,filesystem/posix,network/cni,environment_secret
W0805 01:19:04.582587  8380 backend.cpp:76] Failed to create 'aufs' backend: AufsBackend requires
root privileges
W0805 01:19:04.582689  8380 backend.cpp:76] Failed to create 'bind' backend: BindBackend requires
root privileges
I0805 01:19:04.582718  8380 provisioner.cpp:255] Using default backend 'copy'
I0805 01:19:04.586333 29738 slave.cpp:250] Mesos agent started on (807)@172.17.0.5:38443
I0805 01:19:04.586356 29738 slave.cpp:251] Flags at startup: --acls="" --appc_simple_discovery_uri_prefix="http://"
--appc_store_dir="/tmp/Endpoint_SlaveEndpointTest_UnauthorizedRequest_2_uFZUFK/store/appc"
--authenticate_http_executors="true" --authenticate_http_readonly="true" --authenticate_http_readwrite="true"
--authenticatee="crammd5" --authentication_backoff_factor="1secs" --authorizer="local" --cgroups_cpu_enable_pids_and_tids_count="false"
--cgroups_enable_cfs="false" --cgroups_hierarchy="/sys/fs/cgroup" --cgroups_limit_swap="false"
--cgroups_root="mesos" --container_disk_watch_interval="15secs" --containerizers="mesos" --credential="/tmp/Endpoint_SlaveEndpointTest_UnauthorizedRequest_2_uFZUFK/credential"
--default_role="*" --disk_watch_interval="1mins" --docker="docker" --docker_kill_orphans="true"
--docker_registry="https://registry-1.docker.io" --docker_remove_delay="6hrs" --docker_socket="/var/run/docker.sock"
--docker_stop_timeout="0ns" --docker_store_dir="/tmp/Endpoint_SlaveEndpointTest_UnauthorizedRequest_2_uFZUFK/store/docker"
--docker_volume_checkpoint_dir="/var/run/mesos/isolators/docker/volume" --enforce_container_disk_quota="false"
--executor_registration_timeout="1mins" --executor_reregistration_timeout="2secs" --executor_secret_key="/tmp/Endpoint_SlaveEndpointTest_UnauthorizedRequest_2_uFZUFK/executor_secret_key"
--executor_shutdown_grace_period="5secs" --fetcher_cache_dir="/tmp/Endpoint_SlaveEndpointTest_UnauthorizedRequest_2_uFZUFK/fetch"
--fetcher_cache_size="2GB" --frameworks_home="" --gc_delay="1weeks" --gc_disk_headroom="0.1"
--hadoop_home="" --help="false" --hostname_lookup="true" --http_command_executor="false" --http_credentials="/tmp/Endpoint_SlaveEndpointTest_UnauthorizedRequest_2_uFZUFK/http_credentials"
--http_heartbeat_interval="30secs" --initialize_driver_logging="true" --isolation="posix/cpu,posix/mem"
--launcher="posix" --launcher_dir="/mesos/mesos-1.4.0/_build/src" --logbufsecs="0" --logging_level="INFO"
--max_completed_executors_per_framework="150" --oversubscribed_resources_interval="15secs"
--perf_duration="10secs" --perf_interval="1mins" --port="5051" --qos_correction_interval_min="0ns"
--quiet="false" --recover="reconnect" --recovery_timeout="15mins" --registration_backoff_factor="10ms"
--resources="cpus:2;gpus:0;mem:1024;disk:1024;ports:[31000-32000]" --revocable_cpu_low_priority="true"
--runtime_dir="/tmp/Endpoint_SlaveEndpointTest_UnauthorizedRequest_2_uFZUFK" --sandbox_directory="/mnt/mesos/sandbox"
--strict="true" --switch_user="true" --systemd_enable_support="true" --systemd_runtime_directory="/run/systemd/system"
--version="false" --work_dir="/tmp/Endpoint_SlaveEndpointTest_UnauthorizedRequest_2_I7lktx"
I0805 01:19:04.586753 29738 credentials.hpp:86] Loading credential for authentication from
'/tmp/Endpoint_SlaveEndpointTest_UnauthorizedRequest_2_uFZUFK/credential'
I0805 01:19:04.586913 29738 slave.cpp:283] Agent using credential for: test-principal
I0805 01:19:04.586932 29738 credentials.hpp:37] Loading credentials for authentication from
'/tmp/Endpoint_SlaveEndpointTest_UnauthorizedRequest_2_uFZUFK/http_credentials'
I0805 01:19:04.587258 29738 http.cpp:1026] Creating default 'basic' HTTP authenticator for
realm 'mesos-agent-executor'
I0805 01:19:04.587373 29738 http.cpp:1047] Creating default 'jwt' HTTP authenticator for realm
'mesos-agent-executor'
I0805 01:19:04.587623 29738 http.cpp:1026] Creating default 'basic' HTTP authenticator for
realm 'mesos-agent-readonly'
I0805 01:19:04.587728 29738 http.cpp:1047] Creating default 'jwt' HTTP authenticator for realm
'mesos-agent-readonly'
I0805 01:19:04.587926 29738 http.cpp:1026] Creating default 'basic' HTTP authenticator for
realm 'mesos-agent-readwrite'
I0805 01:19:04.588045 29738 http.cpp:1047] Creating default 'jwt' HTTP authenticator for realm
'mesos-agent-readwrite'
I0805 01:19:04.589440 29738 slave.cpp:565] Agent resources: [{"name":"cpus","scalar":{"value":2.0},"type":"SCALAR"},{"name":"mem","scalar":{"value":1024.0},"type":"SCALAR"},{"name":"disk","scalar":{"value":1024.0},"type":"SCALAR"},{"name":"ports","ranges":{"range":[{"begin":31000,"end":32000}]},"type":"RANGES"}]
I0805 01:19:04.589658 29738 slave.cpp:573] Agent attributes: [  ]
I0805 01:19:04.589670 29738 slave.cpp:582] Agent hostname: 90eb458356a8
I0805 01:19:04.589830 29739 status_update_manager.cpp:177] Pausing sending status updates
I0805 01:19:04.591038 29733 state.cpp:64] Recovering state from '/tmp/Endpoint_SlaveEndpointTest_UnauthorizedRequest_2_I7lktx/meta'
I0805 01:19:04.591405 29742 status_update_manager.cpp:203] Recovering status update manager
I0805 01:19:04.591614 29742 containerizer.cpp:598] Recovering containerizer
I0805 01:19:04.593132 29722 provisioner.cpp:416] Provisioner recovery complete
I0805 01:19:04.593612 29743 slave.cpp:6207] Finished recovery
I0805 01:19:04.594063 29743 slave.cpp:6389] Querying resource estimator for oversubscribable
resources
I0805 01:19:04.594316 29737 slave.cpp:6403] Received oversubscribable resources {} from the
resource estimator
I0805 01:19:04.596676 29723 process.cpp:3933] Handling HTTP event for process 'slave(807)'
with path: '/slave(807)/containers'
I0805 01:19:04.598628 29734 http.cpp:1166] HTTP GET for /slave(807)/containers from 172.17.0.5:57962
I0805 01:19:04.598703 29734 http.cpp:957] Authorizing principal 'test-principal' to GET the
'/containers' endpoint
I0805 01:19:04.600728 29745 slave.cpp:843] Agent terminating
[       OK ] Endpoint/SlaveEndpointTest.UnauthorizedRequest/2 (30 ms)
[ RUN      ] Endpoint/SlaveEndpointTest.NoAuthorizer/0
I0805 01:19:04.611511  8380 containerizer.cpp:246] Using isolation: posix/cpu,posix/mem,filesystem/posix,network/cni,environment_secret
W0805 01:19:04.611992  8380 backend.cpp:76] Failed to create 'aufs' backend: AufsBackend requires
root privileges
W0805 01:19:04.612095  8380 backend.cpp:76] Failed to create 'bind' backend: BindBackend requires
root privileges
I0805 01:19:04.612125  8380 provisioner.cpp:255] Using default backend 'copy'
I0805 01:19:04.613845  8380 cluster.cpp:448] Creating default 'local' authorizer
I0805 01:19:04.615710 29739 slave.cpp:250] Mesos agent started on (808)@172.17.0.5:38443
I0805 01:19:04.615734 29739 slave.cpp:251] Flags at startup: --acls="" --appc_simple_discovery_uri_prefix="http://"
--appc_store_dir="/tmp/Endpoint_SlaveEndpointTest_NoAuthorizer_0_UGbkJB/store/appc" --authenticate_http_executors="true"
--authenticate_http_readonly="true" --authenticate_http_readwrite="true" --authenticatee="crammd5"
--authentication_backoff_factor="1secs" --authorizer="local" --cgroups_cpu_enable_pids_and_tids_count="false"
--cgroups_enable_cfs="false" --cgroups_hierarchy="/sys/fs/cgroup" --cgroups_limit_swap="false"
--cgroups_root="mesos" --container_disk_watch_interval="15secs" --containerizers="mesos" --credential="/tmp/Endpoint_SlaveEndpointTest_NoAuthorizer_0_UGbkJB/credential"
--default_role="*" --disk_watch_interval="1mins" --docker="docker" --docker_kill_orphans="true"
--docker_registry="https://registry-1.docker.io" --docker_remove_delay="6hrs" --docker_socket="/var/run/docker.sock"
--docker_stop_timeout="0ns" --docker_store_dir="/tmp/Endpoint_SlaveEndpointTest_NoAuthorizer_0_UGbkJB/store/docker"
--docker_volume_checkpoint_dir="/var/run/mesos/isolators/docker/volume" --enforce_container_disk_quota="false"
--executor_registration_timeout="1mins" --executor_reregistration_timeout="2secs" --executor_secret_key="/tmp/Endpoint_SlaveEndpointTest_NoAuthorizer_0_UGbkJB/executor_secret_key"
--executor_shutdown_grace_period="5secs" --fetcher_cache_dir="/tmp/Endpoint_SlaveEndpointTest_NoAuthorizer_0_UGbkJB/fetch"
--fetcher_cache_size="2GB" --frameworks_home="" --gc_delay="1weeks" --gc_disk_headroom="0.1"
--hadoop_home="" --help="false" --hostname_lookup="true" --http_command_executor="false" --http_credentials="/tmp/Endpoint_SlaveEndpointTest_NoAuthorizer_0_UGbkJB/http_credentials"
--http_heartbeat_interval="30secs" --initialize_driver_logging="true" --isolation="posix/cpu,posix/mem"
--launcher="posix" --launcher_dir="/mesos/mesos-1.4.0/_build/src" --logbufsecs="0" --logging_level="INFO"
--max_completed_executors_per_framework="150" --oversubscribed_resources_interval="15secs"
--perf_duration="10secs" --perf_interval="1mins" --port="5051" --qos_correction_interval_min="0ns"
--quiet="false" --recover="reconnect" --recovery_timeout="15mins" --registration_backoff_factor="10ms"
--resources="cpus:2;gpus:0;mem:1024;disk:1024;ports:[31000-32000]" --revocable_cpu_low_priority="true"
--runtime_dir="/tmp/Endpoint_SlaveEndpointTest_NoAuthorizer_0_UGbkJB" --sandbox_directory="/mnt/mesos/sandbox"
--strict="true" --switch_user="true" --systemd_enable_support="true" --systemd_runtime_directory="/run/systemd/system"
--version="false" --work_dir="/tmp/Endpoint_SlaveEndpointTest_NoAuthorizer_0_wyXlso"
I0805 01:19:04.616222 29739 credentials.hpp:86] Loading credential for authentication from
'/tmp/Endpoint_SlaveEndpointTest_NoAuthorizer_0_UGbkJB/credential'
I0805 01:19:04.616400 29739 slave.cpp:283] Agent using credential for: test-principal
I0805 01:19:04.616426 29739 credentials.hpp:37] Loading credentials for authentication from
'/tmp/Endpoint_SlaveEndpointTest_NoAuthorizer_0_UGbkJB/http_credentials'
I0805 01:19:04.616750 29739 http.cpp:1026] Creating default 'basic' HTTP authenticator for
realm 'mesos-agent-executor'
I0805 01:19:04.616888 29739 http.cpp:1047] Creating default 'jwt' HTTP authenticator for realm
'mesos-agent-executor'
I0805 01:19:04.617137 29739 http.cpp:1026] Creating default 'basic' HTTP authenticator for
realm 'mesos-agent-readonly'
I0805 01:19:04.617245 29739 http.cpp:1047] Creating default 'jwt' HTTP authenticator for realm
'mesos-agent-readonly'
I0805 01:19:04.617431 29739 http.cpp:1026] Creating default 'basic' HTTP authenticator for
realm 'mesos-agent-readwrite'
I0805 01:19:04.617578 29739 http.cpp:1047] Creating default 'jwt' HTTP authenticator for realm
'mesos-agent-readwrite'
I0805 01:19:04.619961 29739 slave.cpp:565] Agent resources: [{"name":"cpus","scalar":{"value":2.0},"type":"SCALAR"},{"name":"mem","scalar":{"value":1024.0},"type":"SCALAR"},{"name":"disk","scalar":{"value":1024.0},"type":"SCALAR"},{"name":"ports","ranges":{"range":[{"begin":31000,"end":32000}]},"type":"RANGES"}]
I0805 01:19:04.620367 29739 slave.cpp:573] Agent attributes: [  ]
I0805 01:19:04.620388 29739 slave.cpp:582] Agent hostname: 90eb458356a8
I0805 01:19:04.620653 29727 status_update_manager.cpp:177] Pausing sending status updates
I0805 01:19:04.622771 29734 state.cpp:64] Recovering state from '/tmp/Endpoint_SlaveEndpointTest_NoAuthorizer_0_wyXlso/meta'
I0805 01:19:04.623226 29730 status_update_manager.cpp:203] Recovering status update manager
I0805 01:19:04.623459 29725 containerizer.cpp:598] Recovering containerizer
I0805 01:19:04.625316 29723 provisioner.cpp:416] Provisioner recovery complete
I0805 01:19:04.625995 29739 slave.cpp:6207] Finished recovery
I0805 01:19:04.626662 29739 slave.cpp:6389] Querying resource estimator for oversubscribable
resources
I0805 01:19:04.627089 29736 slave.cpp:6403] Received oversubscribable resources {} from the
resource estimator
I0805 01:19:04.629101 29724 process.cpp:3933] Handling HTTP event for process 'slave(808)'
with path: '/slave(808)/monitor/statistics'
I0805 01:19:04.631201 29732 http.cpp:1166] HTTP GET for /slave(808)/monitor/statistics from
172.17.0.5:57964
I0805 01:19:04.631316 29732 http.cpp:957] Authorizing principal 'test-principal' to GET the
'/monitor/statistics' endpoint
I0805 01:19:04.635931  8380 slave.cpp:843] Agent terminating
[       OK ] Endpoint/SlaveEndpointTest.NoAuthorizer/0 (37 ms)
[ RUN      ] Endpoint/SlaveEndpointTest.NoAuthorizer/1
I0805 01:19:04.649695  8380 containerizer.cpp:246] Using isolation: posix/cpu,posix/mem,filesystem/posix,network/cni,environment_secret
W0805 01:19:04.650333  8380 backend.cpp:76] Failed to create 'aufs' backend: AufsBackend requires
root privileges
W0805 01:19:04.650461  8380 backend.cpp:76] Failed to create 'bind' backend: BindBackend requires
root privileges
I0805 01:19:04.650501  8380 provisioner.cpp:255] Using default backend 'copy'
I0805 01:19:04.652887  8380 cluster.cpp:448] Creating default 'local' authorizer
I0805 01:19:04.655248 29742 slave.cpp:250] Mesos agent started on (809)@172.17.0.5:38443
I0805 01:19:04.655272 29742 slave.cpp:251] Flags at startup: --acls="" --appc_simple_discovery_uri_prefix="http://"
--appc_store_dir="/tmp/Endpoint_SlaveEndpointTest_NoAuthorizer_1_IWln8s/store/appc" --authenticate_http_executors="true"
--authenticate_http_readonly="true" --authenticate_http_readwrite="true" --authenticatee="crammd5"
--authentication_backoff_factor="1secs" --authorizer="local" --cgroups_cpu_enable_pids_and_tids_count="false"
--cgroups_enable_cfs="false" --cgroups_hierarchy="/sys/fs/cgroup" --cgroups_limit_swap="false"
--cgroups_root="mesos" --container_disk_watch_interval="15secs" --containerizers="mesos" --credential="/tmp/Endpoint_SlaveEndpointTest_NoAuthorizer_1_IWln8s/credential"
--default_role="*" --disk_watch_interval="1mins" --docker="docker" --docker_kill_orphans="true"
--docker_registry="https://registry-1.docker.io" --docker_remove_delay="6hrs" --docker_socket="/var/run/docker.sock"
--docker_stop_timeout="0ns" --docker_store_dir="/tmp/Endpoint_SlaveEndpointTest_NoAuthorizer_1_IWln8s/store/docker"
--docker_volume_checkpoint_dir="/var/run/mesos/isolators/docker/volume" --enforce_container_disk_quota="false"
--executor_registration_timeout="1mins" --executor_reregistration_timeout="2secs" --executor_secret_key="/tmp/Endpoint_SlaveEndpointTest_NoAuthorizer_1_IWln8s/executor_secret_key"
--executor_shutdown_grace_period="5secs" --fetcher_cache_dir="/tmp/Endpoint_SlaveEndpointTest_NoAuthorizer_1_IWln8s/fetch"
--fetcher_cache_size="2GB" --frameworks_home="" --gc_delay="1weeks" --gc_disk_headroom="0.1"
--hadoop_home="" --help="false" --hostname_lookup="true" --http_command_executor="false" --http_credentials="/tmp/Endpoint_SlaveEndpointTest_NoAuthorizer_1_IWln8s/http_credentials"
--http_heartbeat_interval="30secs" --initialize_driver_logging="true" --isolation="posix/cpu,posix/mem"
--launcher="posix" --launcher_dir="/mesos/mesos-1.4.0/_build/src" --logbufsecs="0" --logging_level="INFO"
--max_completed_executors_per_framework="150" --oversubscribed_resources_interval="15secs"
--perf_duration="10secs" --perf_interval="1mins" --port="5051" --qos_correction_interval_min="0ns"
--quiet="false" --recover="reconnect" --recovery_timeout="15mins" --registration_backoff_factor="10ms"
--resources="cpus:2;gpus:0;mem:1024;disk:1024;ports:[31000-32000]" --revocable_cpu_low_priority="true"
--runtime_dir="/tmp/Endpoint_SlaveEndpointTest_NoAuthorizer_1_IWln8s" --sandbox_directory="/mnt/mesos/sandbox"
--strict="true" --switch_user="true" --systemd_enable_support="true" --systemd_runtime_directory="/run/systemd/system"
--version="false" --work_dir="/tmp/Endpoint_SlaveEndpointTest_NoAuthorizer_1_0KsNLf"
I0805 01:19:04.655685 29742 credentials.hpp:86] Loading credential for authentication from
'/tmp/Endpoint_SlaveEndpointTest_NoAuthorizer_1_IWln8s/credential'
I0805 01:19:04.655833 29742 slave.cpp:283] Agent using credential for: test-principal
I0805 01:19:04.655858 29742 credentials.hpp:37] Loading credentials for authentication from
'/tmp/Endpoint_SlaveEndpointTest_NoAuthorizer_1_IWln8s/http_credentials'
I0805 01:19:04.656172 29742 http.cpp:1026] Creating default 'basic' HTTP authenticator for
realm 'mesos-agent-executor'
I0805 01:19:04.656294 29742 http.cpp:1047] Creating default 'jwt' HTTP authenticator for realm
'mesos-agent-executor'
I0805 01:19:04.656502 29742 http.cpp:1026] Creating default 'basic' HTTP authenticator for
realm 'mesos-agent-readonly'
I0805 01:19:04.656610 29742 http.cpp:1047] Creating default 'jwt' HTTP authenticator for realm
'mesos-agent-readonly'
I0805 01:19:04.656805 29742 http.cpp:1026] Creating default 'basic' HTTP authenticator for
realm 'mesos-agent-readwrite'
I0805 01:19:04.656919 29742 http.cpp:1047] Creating default 'jwt' HTTP authenticator for realm
'mesos-agent-readwrite'
I0805 01:19:04.658406 29742 slave.cpp:565] Agent resources: [{"name":"cpus","scalar":{"value":2.0},"type":"SCALAR"},{"name":"mem","scalar":{"value":1024.0},"type":"SCALAR"},{"name":"disk","scalar":{"value":1024.0},"type":"SCALAR"},{"name":"ports","ranges":{"range":[{"begin":31000,"end":32000}]},"type":"RANGES"}]
I0805 01:19:04.658645 29742 slave.cpp:573] Agent attributes: [  ]
I0805 01:19:04.658658 29742 slave.cpp:582] Agent hostname: 90eb458356a8
I0805 01:19:04.658848 29730 status_update_manager.cpp:177] Pausing sending status updates
I0805 01:19:04.660094 29726 state.cpp:64] Recovering state from '/tmp/Endpoint_SlaveEndpointTest_NoAuthorizer_1_0KsNLf/meta'
I0805 01:19:04.660447 29733 status_update_manager.cpp:203] Recovering status update manager
I0805 01:19:04.660706 29735 containerizer.cpp:598] Recovering containerizer
I0805 01:19:04.662467 29736 provisioner.cpp:416] Provisioner recovery complete
I0805 01:19:04.662935 29741 slave.cpp:6207] Finished recovery
I0805 01:19:04.663354 29741 slave.cpp:6389] Querying resource estimator for oversubscribable
resources
I0805 01:19:04.663630 29738 slave.cpp:6403] Received oversubscribable resources {} from the
resource estimator
I0805 01:19:04.665838 29731 process.cpp:3933] Handling HTTP event for process 'slave(809)'
with path: '/slave(809)/monitor/statistics.json'
I0805 01:19:04.667773 29733 http.cpp:1166] HTTP GET for /slave(809)/monitor/statistics.json
from 172.17.0.5:57966
I0805 01:19:04.667853 29733 http.cpp:957] Authorizing principal 'test-principal' to GET the
'/monitor/statistics.json' endpoint
I0805 01:19:04.671751  8380 slave.cpp:843] Agent terminating
[       OK ] Endpoint/SlaveEndpointTest.NoAuthorizer/1 (33 ms)
[ RUN      ] Endpoint/SlaveEndpointTest.NoAuthorizer/2
I0805 01:19:04.683323  8380 containerizer.cpp:246] Using isolation: posix/cpu,posix/mem,filesystem/posix,network/cni,environment_secret
W0805 01:19:04.683807  8380 backend.cpp:76] Failed to create 'aufs' backend: AufsBackend requires
root privileges
W0805 01:19:04.683920  8380 backend.cpp:76] Failed to create 'bind' backend: BindBackend requires
root privileges
I0805 01:19:04.683951  8380 provisioner.cpp:255] Using default backend 'copy'
I0805 01:19:04.685662  8380 cluster.cpp:448] Creating default 'local' authorizer
I0805 01:19:04.687440 29742 slave.cpp:250] Mesos agent started on (810)@172.17.0.5:38443
I0805 01:19:04.687466 29742 slave.cpp:251] Flags at startup: --acls="" --appc_simple_discovery_uri_prefix="http://"
--appc_store_dir="/tmp/Endpoint_SlaveEndpointTest_NoAuthorizer_2_YHK6Rk/store/appc" --authenticate_http_executors="true"
--authenticate_http_readonly="true" --authenticate_http_readwrite="true" --authenticatee="crammd5"
--authentication_backoff_factor="1secs" --authorizer="local" --cgroups_cpu_enable_pids_and_tids_count="false"
--cgroups_enable_cfs="false" --cgroups_hierarchy="/sys/fs/cgroup" --cgroups_limit_swap="false"
--cgroups_root="mesos" --container_disk_watch_interval="15secs" --containerizers="mesos" --credential="/tmp/Endpoint_SlaveEndpointTest_NoAuthorizer_2_YHK6Rk/credential"
--default_role="*" --disk_watch_interval="1mins" --docker="docker" --docker_kill_orphans="true"
--docker_registry="https://registry-1.docker.io" --docker_remove_delay="6hrs" --docker_socket="/var/run/docker.sock"
--docker_stop_timeout="0ns" --docker_store_dir="/tmp/Endpoint_SlaveEndpointTest_NoAuthorizer_2_YHK6Rk/store/docker"
--docker_volume_checkpoint_dir="/var/run/mesos/isolators/docker/volume" --enforce_container_disk_quota="false"
--executor_registration_timeout="1mins" --executor_reregistration_timeout="2secs" --executor_secret_key="/tmp/Endpoint_SlaveEndpointTest_NoAuthorizer_2_YHK6Rk/executor_secret_key"
--executor_shutdown_grace_period="5secs" --fetcher_cache_dir="/tmp/Endpoint_SlaveEndpointTest_NoAuthorizer_2_YHK6Rk/fetch"
--fetcher_cache_size="2GB" --frameworks_home="" --gc_delay="1weeks" --gc_disk_headroom="0.1"
--hadoop_home="" --help="false" --hostname_lookup="true" --http_command_executor="false" --http_credentials="/tmp/Endpoint_SlaveEndpointTest_NoAuthorizer_2_YHK6Rk/http_credentials"
--http_heartbeat_interval="30secs" --initialize_driver_logging="true" --isolation="posix/cpu,posix/mem"
--launcher="posix" --launcher_dir="/mesos/mesos-1.4.0/_build/src" --logbufsecs="0" --logging_level="INFO"
--max_completed_executors_per_framework="150" --oversubscribed_resources_interval="15secs"
--perf_duration="10secs" --perf_interval="1mins" --port="5051" --qos_correction_interval_min="0ns"
--quiet="false" --recover="reconnect" --recovery_timeout="15mins" --registration_backoff_factor="10ms"
--resources="cpus:2;gpus:0;mem:1024;disk:1024;ports:[31000-32000]" --revocable_cpu_low_priority="true"
--runtime_dir="/tmp/Endpoint_SlaveEndpointTest_NoAuthorizer_2_YHK6Rk" --sandbox_directory="/mnt/mesos/sandbox"
--strict="true" --switch_user="true" --systemd_enable_support="true" --systemd_runtime_directory="/run/systemd/system"
--version="false" --work_dir="/tmp/Endpoint_SlaveEndpointTest_NoAuthorizer_2_miDsq7"
I0805 01:19:04.687790 29742 credentials.hpp:86] Loading credential for authentication from
'/tmp/Endpoint_SlaveEndpointTest_NoAuthorizer_2_YHK6Rk/credential'
I0805 01:19:04.687944 29742 slave.cpp:283] Agent using credential for: test-principal
I0805 01:19:04.687968 29742 credentials.hpp:37] Loading credentials for authentication from
'/tmp/Endpoint_SlaveEndpointTest_NoAuthorizer_2_YHK6Rk/http_credentials'
I0805 01:19:04.688262 29742 http.cpp:1026] Creating default 'basic' HTTP authenticator for
realm 'mesos-agent-executor'
I0805 01:19:04.688386 29742 http.cpp:1047] Creating default 'jwt' HTTP authenticator for realm
'mesos-agent-executor'
I0805 01:19:04.688591 29742 http.cpp:1026] Creating default 'basic' HTTP authenticator for
realm 'mesos-agent-readonly'
I0805 01:19:04.688704 29742 http.cpp:1047] Creating default 'jwt' HTTP authenticator for realm
'mesos-agent-readonly'
I0805 01:19:04.688915 29742 http.cpp:1026] Creating default 'basic' HTTP authenticator for
realm 'mesos-agent-readwrite'
I0805 01:19:04.689028 29742 http.cpp:1047] Creating default 'jwt' HTTP authenticator for realm
'mesos-agent-readwrite'
I0805 01:19:04.690448 29742 slave.cpp:565] Agent resources: [{"name":"cpus","scalar":{"value":2.0},"type":"SCALAR"},{"name":"mem","scalar":{"value":1024.0},"type":"SCALAR"},{"name":"disk","scalar":{"value":1024.0},"type":"SCALAR"},{"name":"ports","ranges":{"range":[{"begin":31000,"end":32000}]},"type":"RANGES"}]
I0805 01:19:04.690676 29742 slave.cpp:573] Agent attributes: [  ]
I0805 01:19:04.690688 29742 slave.cpp:582] Agent hostname: 90eb458356a8
I0805 01:19:04.690821 29726 status_update_manager.cpp:177] Pausing sending status updates
I0805 01:19:04.692095 29737 state.cpp:64] Recovering state from '/tmp/Endpoint_SlaveEndpointTest_NoAuthorizer_2_miDsq7/meta'
I0805 01:19:04.692361 29745 status_update_manager.cpp:203] Recovering status update manager
I0805 01:19:04.692597 29722 containerizer.cpp:598] Recovering containerizer
I0805 01:19:04.694159 29735 provisioner.cpp:416] Provisioner recovery complete
I0805 01:19:04.694512 29742 slave.cpp:6207] Finished recovery
I0805 01:19:04.694916 29742 slave.cpp:6389] Querying resource estimator for oversubscribable
resources
I0805 01:19:04.695164 29724 slave.cpp:6403] Received oversubscribable resources {} from the
resource estimator
I0805 01:19:04.697988 29733 process.cpp:3933] Handling HTTP event for process 'slave(810)'
with path: '/slave(810)/containers'
I0805 01:19:04.699564 29738 http.cpp:1166] HTTP GET for /slave(810)/containers from 172.17.0.5:57968
I0805 01:19:04.699635 29738 http.cpp:957] Authorizing principal 'test-principal' to GET the
'/containers' endpoint
I0805 01:19:04.703809  8380 slave.cpp:843] Agent terminating
[       OK ] Endpoint/SlaveEndpointTest.NoAuthorizer/2 (32 ms)
[----------] 9 tests from Endpoint/SlaveEndpointTest (306 ms total)

[----------] 2 tests from ContainerizerType/DefaultContainerDNSFlagTest
[ RUN      ] ContainerizerType/DefaultContainerDNSFlagTest.ValidateFlag/0
[       OK ] ContainerizerType/DefaultContainerDNSFlagTest.ValidateFlag/0 (12 ms)
[ RUN      ] ContainerizerType/DefaultContainerDNSFlagTest.ValidateFlag/1
[       OK ] ContainerizerType/DefaultContainerDNSFlagTest.ValidateFlag/1 (11 ms)
[----------] 2 tests from ContainerizerType/DefaultContainerDNSFlagTest (23 ms total)

[----------] Global test environment tear-down
[==========] 1662 tests from 184 test cases ran. (598478 ms total)
[  PASSED  ] 1659 tests.
[  FAILED  ] 3 tests, listed below:
[  FAILED  ] DefaultExecutorCheckTest.CommandCheckDeliveredAndReconciled
[  FAILED  ] DefaultExecutorCheckTest.CommandCheckStatusChange
[  FAILED  ] MasterTest.IgnoreOldAgentReregistration

 3 FAILED TESTS
  YOU HAVE 20 DISABLED TESTS

I0805 01:19:04.796947 29746 process.cpp:1072] Failed to accept socket: future discarded
make[4]: *** [check-local] Error 1
make[4]: Leaving directory `/mesos/mesos-1.4.0/_build/src'
make[3]: *** [check-am] Error 2
make[3]: Leaving directory `/mesos/mesos-1.4.0/_build/src'
make[2]: *** [check] Error 2
make[2]: Leaving directory `/mesos/mesos-1.4.0/_build/src'
make[1]: *** [check-recursive] Error 1
make[1]: Leaving directory `/mesos/mesos-1.4.0/_build'
make: *** [distcheck] Error 1
+ docker rmi mesos-1501892654-10220
Untagged: mesos-1501892654-10220:latest
Deleted: sha256:778fb184bfc6adc283424edc3906272b885bf6cbb330eb90ea308cb715ba9ba0
Deleted: sha256:3154801a0f7291d973b3e3893e0e690e678b288d92df1a448f20fb760878c5f1
Deleted: sha256:adb2370487e8bceb67fbe33d76e8abe6b87a4565eb4727af9af4f8977e869ab4
Deleted: sha256:463c8ac5a33c9dfa0a76de2369f5a1ae2f5dbc341e140e5edbdf06c4c578e990
Deleted: sha256:ad2ac2d85ac9c1d7380f547e4b6e44dfc447472277ec79a577a29c43a19b3d08
Deleted: sha256:b72147d69ad2e0bbd32b9f6cc48768554b528806428922ac3ceae1f487f71448
Deleted: sha256:5f2df3af366c41c4704b104df2bf10dea9a2a206bd2d37a4ed4fe8326179ad0f
Deleted: sha256:06e7be14da8916ab5182bda404ca130a8d7f69a6473b566068983e5d65cfa1e9
Deleted: sha256:8ffd823aaf9eb3bdc267181292c853dfa0f2e175d2749744d5d71d44e2071a60
Deleted: sha256:31919c8b4bed98e46449597413a824ba3f8bc5af332fde493d510775ef646e60
Deleted: sha256:7a4f887da4db389cbd5973f1370a1c8f08e3fa51d0946b1e171db9d76b78dd8e
Deleted: sha256:75f5468b57fb542b8808afc8f0909cd05188300a61bc3356cbc2783198f2af1b
Deleted: sha256:6121d5cd5b06c77787794056f572b1c91473e83302e94330b5a11120796e7918
Deleted: sha256:bad54b254160302f12c2cd411600c0e09b2add54dba77cea26bcf213036113b7
Deleted: sha256:8ef89c03a286fc2653555726db761a5f7c7c1ddb2034f840cf3bb23b460e897b
Deleted: sha256:303f714e35824963b0c19a420c70cd956c558c1a67bc135b9492810d546bf7b2
Deleted: sha256:6506b16ffecaef8b2112702d72c65ba9f6d29d6ee28b84714037ec1680726a34
Deleted: sha256:e3d8cf0b13743018c9144079f42610a8291d997a0cf0cfdbd7cffe16049132ee
Deleted: sha256:396dc1fe3bf5ad1dd1e2b1d2ab30e6f3b945621c2a39555adb33f59cd066ac4d
Deleted: sha256:6f5dc98e426bdc52927ced5abd352b5de3bf5dc5727d1dbd022b7984c069fe0e
Deleted: sha256:66e214b738fb244a7fd495754a0d91cb9b290f251fe5789c8c10c3fb7f4a9e6a
Deleted: sha256:9eaaffa8bb6784deb321fee39842dd55f98ba39ea3721acc222eaf41b1f6495c
Deleted: sha256:d9a01e9c4e5bf40b2ac3d5330c4a0e6a57546ff168086de183094b2a7825bbe0
Deleted: sha256:d91f3099fcc1aedf69d3845945524246671acee067751a0ff7875c01d65359de
Build step 'Execute shell' marked build as failure

Mime
View raw message