mesos-builds mailing list archives

Site index · List index
Message view « Date » · « Thread »
Top « Date » · « Thread »
From Apache Jenkins Server <jenk...@builds.apache.org>
Subject Build failed in Jenkins: Mesos-Buildbot » autotools,gcc,--verbose --enable-libevent --enable-ssl,GLOG_v=1 MESOS_VERBOSE=1,ubuntu:14.04,(ubuntu)&&(!ubuntu-us1)&&(!ubuntu-eu2) #4113
Date Tue, 15 Aug 2017 19:45:16 GMT
See <https://builds.apache.org/job/Mesos-Buildbot/BUILDTOOL=autotools,COMPILER=gcc,CONFIGURATION=--verbose%20--enable-libevent%20--enable-ssl,ENVIRONMENT=GLOG_v=1%20MESOS_VERBOSE=1,OS=ubuntu%3A14.04,label_exp=(ubuntu)&&(!ubuntu-us1)&&(!ubuntu-eu2)/4113/display/redirect?page=changes>

Changes:

[alexr] Updated health-checks.md to include description of generalized checks.

------------------------------------------
[...truncated 32.22 MB...]
I0815 19:45:07.120995  8465 containerizer.cpp:246] Using isolation: posix/cpu,posix/mem,filesystem/posix,network/cni,environment_secret
W0815 19:45:07.121492  8465 backend.cpp:76] Failed to create 'aufs' backend: AufsBackend requires
root privileges
W0815 19:45:07.121613  8465 backend.cpp:76] Failed to create 'bind' backend: BindBackend requires
root privileges
I0815 19:45:07.121652  8465 provisioner.cpp:255] Using default backend 'copy'
I0815 19:45:07.125190 29764 slave.cpp:250] Mesos agent started on (806)@172.17.0.5:39764
I0815 19:45:07.125213 29764 slave.cpp:251] Flags at startup: --acls="" --appc_simple_discovery_uri_prefix="http://"
--appc_store_dir="/tmp/Endpoint_SlaveEndpointTest_UnauthorizedRequest_0_iBCkuM/store/appc"
--authenticate_http_executors="true" --authenticate_http_readonly="true" --authenticate_http_readwrite="true"
--authenticatee="crammd5" --authentication_backoff_factor="1secs" --authorizer="local" --cgroups_cpu_enable_pids_and_tids_count="false"
--cgroups_enable_cfs="false" --cgroups_hierarchy="/sys/fs/cgroup" --cgroups_limit_swap="false"
--cgroups_root="mesos" --container_disk_watch_interval="15secs" --containerizers="mesos" --credential="/tmp/Endpoint_SlaveEndpointTest_UnauthorizedRequest_0_iBCkuM/credential"
--default_role="*" --disallow_sharing_agent_pid_namespace="false" --disk_watch_interval="1mins"
--docker="docker" --docker_kill_orphans="true" --docker_registry="https://registry-1.docker.io"
--docker_remove_delay="6hrs" --docker_socket="/var/run/docker.sock" --docker_stop_timeout="0ns"
--docker_store_dir="/tmp/Endpoint_SlaveEndpointTest_UnauthorizedRequest_0_iBCkuM/store/docker"
--docker_volume_checkpoint_dir="/var/run/mesos/isolators/docker/volume" --enforce_container_disk_quota="false"
--executor_registration_timeout="1mins" --executor_reregistration_timeout="2secs" --executor_secret_key="/tmp/Endpoint_SlaveEndpointTest_UnauthorizedRequest_0_iBCkuM/executor_secret_key"
--executor_shutdown_grace_period="5secs" --fetcher_cache_dir="/tmp/Endpoint_SlaveEndpointTest_UnauthorizedRequest_0_iBCkuM/fetch"
--fetcher_cache_size="2GB" --frameworks_home="" --gc_delay="1weeks" --gc_disk_headroom="0.1"
--hadoop_home="" --help="false" --hostname_lookup="true" --http_command_executor="false" --http_credentials="/tmp/Endpoint_SlaveEndpointTest_UnauthorizedRequest_0_iBCkuM/http_credentials"
--http_heartbeat_interval="30secs" --initialize_driver_logging="true" --isolation="posix/cpu,posix/mem"
--launcher="posix" --launcher_dir="/mesos/mesos-1.4.0/_build/src" --logbufsecs="0" --logging_level="INFO"
--max_completed_executors_per_framework="150" --oversubscribed_resources_interval="15secs"
--perf_duration="10secs" --perf_interval="1mins" --port="5051" --qos_correction_interval_min="0ns"
--quiet="false" --recover="reconnect" --recovery_timeout="15mins" --registration_backoff_factor="10ms"
--resources="cpus:2;gpus:0;mem:1024;disk:1024;ports:[31000-32000]" --revocable_cpu_low_priority="true"
--runtime_dir="/tmp/Endpoint_SlaveEndpointTest_UnauthorizedRequest_0_iBCkuM" --sandbox_directory="/mnt/mesos/sandbox"
--strict="true" --switch_user="true" --systemd_enable_support="true" --systemd_runtime_directory="/run/systemd/system"
--version="false" --work_dir="/tmp/Endpoint_SlaveEndpointTest_UnauthorizedRequest_0_hnvJ7y"
I0815 19:45:07.125600 29764 credentials.hpp:86] Loading credential for authentication from
'/tmp/Endpoint_SlaveEndpointTest_UnauthorizedRequest_0_iBCkuM/credential'
I0815 19:45:07.125775 29764 slave.cpp:283] Agent using credential for: test-principal
I0815 19:45:07.125798 29764 credentials.hpp:37] Loading credentials for authentication from
'/tmp/Endpoint_SlaveEndpointTest_UnauthorizedRequest_0_iBCkuM/http_credentials'
I0815 19:45:07.126113 29764 http.cpp:1026] Creating default 'basic' HTTP authenticator for
realm 'mesos-agent-executor'
I0815 19:45:07.126265 29764 http.cpp:1047] Creating default 'jwt' HTTP authenticator for realm
'mesos-agent-executor'
I0815 19:45:07.126493 29764 http.cpp:1026] Creating default 'basic' HTTP authenticator for
realm 'mesos-agent-readonly'
I0815 19:45:07.126600 29764 http.cpp:1047] Creating default 'jwt' HTTP authenticator for realm
'mesos-agent-readonly'
I0815 19:45:07.126819 29764 http.cpp:1026] Creating default 'basic' HTTP authenticator for
realm 'mesos-agent-readwrite'
I0815 19:45:07.126936 29764 http.cpp:1047] Creating default 'jwt' HTTP authenticator for realm
'mesos-agent-readwrite'
I0815 19:45:07.128319 29764 slave.cpp:565] Agent resources: [{"name":"cpus","scalar":{"value":2.0},"type":"SCALAR"},{"name":"mem","scalar":{"value":1024.0},"type":"SCALAR"},{"name":"disk","scalar":{"value":1024.0},"type":"SCALAR"},{"name":"ports","ranges":{"range":[{"begin":31000,"end":32000}]},"type":"RANGES"}]
I0815 19:45:07.128546 29764 slave.cpp:573] Agent attributes: [  ]
I0815 19:45:07.128568 29764 slave.cpp:582] Agent hostname: 4b4ca5734d83
I0815 19:45:07.128710 29784 status_update_manager.cpp:177] Pausing sending status updates
I0815 19:45:07.130173 29777 state.cpp:64] Recovering state from '/tmp/Endpoint_SlaveEndpointTest_UnauthorizedRequest_0_hnvJ7y/meta'
I0815 19:45:07.130539 29762 status_update_manager.cpp:203] Recovering status update manager
I0815 19:45:07.130726 29770 containerizer.cpp:598] Recovering containerizer
I0815 19:45:07.131975 29766 provisioner.cpp:416] Provisioner recovery complete
I0815 19:45:07.132298 29785 slave.cpp:6210] Finished recovery
I0815 19:45:07.132787 29785 slave.cpp:6392] Querying resource estimator for oversubscribable
resources
I0815 19:45:07.133020 29776 slave.cpp:6406] Received oversubscribable resources {} from the
resource estimator
I0815 19:45:07.135103 29780 process.cpp:3933] Handling HTTP event for process 'slave(806)'
with path: '/slave(806)/monitor/statistics'
I0815 19:45:07.136670 29768 http.cpp:1166] HTTP GET for /slave(806)/monitor/statistics from
172.17.0.5:51944
I0815 19:45:07.136736 29768 http.cpp:957] Authorizing principal 'test-principal' to GET the
'/monitor/statistics' endpoint
I0815 19:45:07.138598 29775 slave.cpp:843] Agent terminating
[       OK ] Endpoint/SlaveEndpointTest.UnauthorizedRequest/0 (27 ms)
[ RUN      ] Endpoint/SlaveEndpointTest.UnauthorizedRequest/1
I0815 19:45:07.148886  8465 containerizer.cpp:246] Using isolation: posix/cpu,posix/mem,filesystem/posix,network/cni,environment_secret
W0815 19:45:07.149355  8465 backend.cpp:76] Failed to create 'aufs' backend: AufsBackend requires
root privileges
W0815 19:45:07.149483  8465 backend.cpp:76] Failed to create 'bind' backend: BindBackend requires
root privileges
I0815 19:45:07.149523  8465 provisioner.cpp:255] Using default backend 'copy'
I0815 19:45:07.152971 29785 slave.cpp:250] Mesos agent started on (807)@172.17.0.5:39764
I0815 19:45:07.152993 29785 slave.cpp:251] Flags at startup: --acls="" --appc_simple_discovery_uri_prefix="http://"
--appc_store_dir="/tmp/Endpoint_SlaveEndpointTest_UnauthorizedRequest_1_8T81aE/store/appc"
--authenticate_http_executors="true" --authenticate_http_readonly="true" --authenticate_http_readwrite="true"
--authenticatee="crammd5" --authentication_backoff_factor="1secs" --authorizer="local" --cgroups_cpu_enable_pids_and_tids_count="false"
--cgroups_enable_cfs="false" --cgroups_hierarchy="/sys/fs/cgroup" --cgroups_limit_swap="false"
--cgroups_root="mesos" --container_disk_watch_interval="15secs" --containerizers="mesos" --credential="/tmp/Endpoint_SlaveEndpointTest_UnauthorizedRequest_1_8T81aE/credential"
--default_role="*" --disallow_sharing_agent_pid_namespace="false" --disk_watch_interval="1mins"
--docker="docker" --docker_kill_orphans="true" --docker_registry="https://registry-1.docker.io"
--docker_remove_delay="6hrs" --docker_socket="/var/run/docker.sock" --docker_stop_timeout="0ns"
--docker_store_dir="/tmp/Endpoint_SlaveEndpointTest_UnauthorizedRequest_1_8T81aE/store/docker"
--docker_volume_checkpoint_dir="/var/run/mesos/isolators/docker/volume" --enforce_container_disk_quota="false"
--executor_registration_timeout="1mins" --executor_reregistration_timeout="2secs" --executor_secret_key="/tmp/Endpoint_SlaveEndpointTest_UnauthorizedRequest_1_8T81aE/executor_secret_key"
--executor_shutdown_grace_period="5secs" --fetcher_cache_dir="/tmp/Endpoint_SlaveEndpointTest_UnauthorizedRequest_1_8T81aE/fetch"
--fetcher_cache_size="2GB" --frameworks_home="" --gc_delay="1weeks" --gc_disk_headroom="0.1"
--hadoop_home="" --help="false" --hostname_lookup="true" --http_command_executor="false" --http_credentials="/tmp/Endpoint_SlaveEndpointTest_UnauthorizedRequest_1_8T81aE/http_credentials"
--http_heartbeat_interval="30secs" --initialize_driver_logging="true" --isolation="posix/cpu,posix/mem"
--launcher="posix" --launcher_dir="/mesos/mesos-1.4.0/_build/src" --logbufsecs="0" --logging_level="INFO"
--max_completed_executors_per_framework="150" --oversubscribed_resources_interval="15secs"
--perf_duration="10secs" --perf_interval="1mins" --port="5051" --qos_correction_interval_min="0ns"
--quiet="false" --recover="reconnect" --recovery_timeout="15mins" --registration_backoff_factor="10ms"
--resources="cpus:2;gpus:0;mem:1024;disk:1024;ports:[31000-32000]" --revocable_cpu_low_priority="true"
--runtime_dir="/tmp/Endpoint_SlaveEndpointTest_UnauthorizedRequest_1_8T81aE" --sandbox_directory="/mnt/mesos/sandbox"
--strict="true" --switch_user="true" --systemd_enable_support="true" --systemd_runtime_directory="/run/systemd/system"
--version="false" --work_dir="/tmp/Endpoint_SlaveEndpointTest_UnauthorizedRequest_1_NeghKq"
I0815 19:45:07.153367 29785 credentials.hpp:86] Loading credential for authentication from
'/tmp/Endpoint_SlaveEndpointTest_UnauthorizedRequest_1_8T81aE/credential'
I0815 19:45:07.153519 29785 slave.cpp:283] Agent using credential for: test-principal
I0815 19:45:07.153540 29785 credentials.hpp:37] Loading credentials for authentication from
'/tmp/Endpoint_SlaveEndpointTest_UnauthorizedRequest_1_8T81aE/http_credentials'
I0815 19:45:07.153816 29785 http.cpp:1026] Creating default 'basic' HTTP authenticator for
realm 'mesos-agent-executor'
I0815 19:45:07.153930 29785 http.cpp:1047] Creating default 'jwt' HTTP authenticator for realm
'mesos-agent-executor'
I0815 19:45:07.154114 29785 http.cpp:1026] Creating default 'basic' HTTP authenticator for
realm 'mesos-agent-readonly'
I0815 19:45:07.154211 29785 http.cpp:1047] Creating default 'jwt' HTTP authenticator for realm
'mesos-agent-readonly'
I0815 19:45:07.154392 29785 http.cpp:1026] Creating default 'basic' HTTP authenticator for
realm 'mesos-agent-readwrite'
I0815 19:45:07.154489 29785 http.cpp:1047] Creating default 'jwt' HTTP authenticator for realm
'mesos-agent-readwrite'
I0815 19:45:07.155807 29785 slave.cpp:565] Agent resources: [{"name":"cpus","scalar":{"value":2.0},"type":"SCALAR"},{"name":"mem","scalar":{"value":1024.0},"type":"SCALAR"},{"name":"disk","scalar":{"value":1024.0},"type":"SCALAR"},{"name":"ports","ranges":{"range":[{"begin":31000,"end":32000}]},"type":"RANGES"}]
I0815 19:45:07.156026 29785 slave.cpp:573] Agent attributes: [  ]
I0815 19:45:07.156040 29785 slave.cpp:582] Agent hostname: 4b4ca5734d83
I0815 19:45:07.156169 29764 status_update_manager.cpp:177] Pausing sending status updates
I0815 19:45:07.157618 29769 state.cpp:64] Recovering state from '/tmp/Endpoint_SlaveEndpointTest_UnauthorizedRequest_1_NeghKq/meta'
I0815 19:45:07.157896 29772 status_update_manager.cpp:203] Recovering status update manager
I0815 19:45:07.158093 29784 containerizer.cpp:598] Recovering containerizer
I0815 19:45:07.159306 29762 provisioner.cpp:416] Provisioner recovery complete
I0815 19:45:07.159598 29776 slave.cpp:6210] Finished recovery
I0815 19:45:07.160012 29776 slave.cpp:6392] Querying resource estimator for oversubscribable
resources
I0815 19:45:07.160239 29765 slave.cpp:6406] Received oversubscribable resources {} from the
resource estimator
I0815 19:45:07.162297 29764 process.cpp:3933] Handling HTTP event for process 'slave(807)'
with path: '/slave(807)/monitor/statistics.json'
I0815 19:45:07.164089 29773 http.cpp:1166] HTTP GET for /slave(807)/monitor/statistics.json
from 172.17.0.5:51946
I0815 19:45:07.164152 29773 http.cpp:957] Authorizing principal 'test-principal' to GET the
'/monitor/statistics.json' endpoint
I0815 19:45:07.166286 29771 slave.cpp:843] Agent terminating
[       OK ] Endpoint/SlaveEndpointTest.UnauthorizedRequest/1 (27 ms)
[ RUN      ] Endpoint/SlaveEndpointTest.UnauthorizedRequest/2
I0815 19:45:07.176524  8465 containerizer.cpp:246] Using isolation: posix/cpu,posix/mem,filesystem/posix,network/cni,environment_secret
W0815 19:45:07.176975  8465 backend.cpp:76] Failed to create 'aufs' backend: AufsBackend requires
root privileges
W0815 19:45:07.177094  8465 backend.cpp:76] Failed to create 'bind' backend: BindBackend requires
root privileges
I0815 19:45:07.177126  8465 provisioner.cpp:255] Using default backend 'copy'
I0815 19:45:07.180488 29784 slave.cpp:250] Mesos agent started on (808)@172.17.0.5:39764
I0815 19:45:07.180508 29784 slave.cpp:251] Flags at startup: --acls="" --appc_simple_discovery_uri_prefix="http://"
--appc_store_dir="/tmp/Endpoint_SlaveEndpointTest_UnauthorizedRequest_2_cMt97v/store/appc"
--authenticate_http_executors="true" --authenticate_http_readonly="true" --authenticate_http_readwrite="true"
--authenticatee="crammd5" --authentication_backoff_factor="1secs" --authorizer="local" --cgroups_cpu_enable_pids_and_tids_count="false"
--cgroups_enable_cfs="false" --cgroups_hierarchy="/sys/fs/cgroup" --cgroups_limit_swap="false"
--cgroups_root="mesos" --container_disk_watch_interval="15secs" --containerizers="mesos" --credential="/tmp/Endpoint_SlaveEndpointTest_UnauthorizedRequest_2_cMt97v/credential"
--default_role="*" --disallow_sharing_agent_pid_namespace="false" --disk_watch_interval="1mins"
--docker="docker" --docker_kill_orphans="true" --docker_registry="https://registry-1.docker.io"
--docker_remove_delay="6hrs" --docker_socket="/var/run/docker.sock" --docker_stop_timeout="0ns"
--docker_store_dir="/tmp/Endpoint_SlaveEndpointTest_UnauthorizedRequest_2_cMt97v/store/docker"
--docker_volume_checkpoint_dir="/var/run/mesos/isolators/docker/volume" --enforce_container_disk_quota="false"
--executor_registration_timeout="1mins" --executor_reregistration_timeout="2secs" --executor_secret_key="/tmp/Endpoint_SlaveEndpointTest_UnauthorizedRequest_2_cMt97v/executor_secret_key"
--executor_shutdown_grace_period="5secs" --fetcher_cache_dir="/tmp/Endpoint_SlaveEndpointTest_UnauthorizedRequest_2_cMt97v/fetch"
--fetcher_cache_size="2GB" --frameworks_home="" --gc_delay="1weeks" --gc_disk_headroom="0.1"
--hadoop_home="" --help="false" --hostname_lookup="true" --http_command_executor="false" --http_credentials="/tmp/Endpoint_SlaveEndpointTest_UnauthorizedRequest_2_cMt97v/http_credentials"
--http_heartbeat_interval="30secs" --initialize_driver_logging="true" --isolation="posix/cpu,posix/mem"
--launcher="posix" --launcher_dir="/mesos/mesos-1.4.0/_build/src" --logbufsecs="0" --logging_level="INFO"
--max_completed_executors_per_framework="150" --oversubscribed_resources_interval="15secs"
--perf_duration="10secs" --perf_interval="1mins" --port="5051" --qos_correction_interval_min="0ns"
--quiet="false" --recover="reconnect" --recovery_timeout="15mins" --registration_backoff_factor="10ms"
--resources="cpus:2;gpus:0;mem:1024;disk:1024;ports:[31000-32000]" --revocable_cpu_low_priority="true"
--runtime_dir="/tmp/Endpoint_SlaveEndpointTest_UnauthorizedRequest_2_cMt97v" --sandbox_directory="/mnt/mesos/sandbox"
--strict="true" --switch_user="true" --systemd_enable_support="true" --systemd_runtime_directory="/run/systemd/system"
--version="false" --work_dir="/tmp/Endpoint_SlaveEndpointTest_UnauthorizedRequest_2_d02gDi"
I0815 19:45:07.180865 29784 credentials.hpp:86] Loading credential for authentication from
'/tmp/Endpoint_SlaveEndpointTest_UnauthorizedRequest_2_cMt97v/credential'
I0815 19:45:07.181010 29784 slave.cpp:283] Agent using credential for: test-principal
I0815 19:45:07.181030 29784 credentials.hpp:37] Loading credentials for authentication from
'/tmp/Endpoint_SlaveEndpointTest_UnauthorizedRequest_2_cMt97v/http_credentials'
I0815 19:45:07.181329 29784 http.cpp:1026] Creating default 'basic' HTTP authenticator for
realm 'mesos-agent-executor'
I0815 19:45:07.181445 29784 http.cpp:1047] Creating default 'jwt' HTTP authenticator for realm
'mesos-agent-executor'
I0815 19:45:07.181638 29784 http.cpp:1026] Creating default 'basic' HTTP authenticator for
realm 'mesos-agent-readonly'
I0815 19:45:07.181735 29784 http.cpp:1047] Creating default 'jwt' HTTP authenticator for realm
'mesos-agent-readonly'
I0815 19:45:07.181915 29784 http.cpp:1026] Creating default 'basic' HTTP authenticator for
realm 'mesos-agent-readwrite'
I0815 19:45:07.182020 29784 http.cpp:1047] Creating default 'jwt' HTTP authenticator for realm
'mesos-agent-readwrite'
I0815 19:45:07.183369 29784 slave.cpp:565] Agent resources: [{"name":"cpus","scalar":{"value":2.0},"type":"SCALAR"},{"name":"mem","scalar":{"value":1024.0},"type":"SCALAR"},{"name":"disk","scalar":{"value":1024.0},"type":"SCALAR"},{"name":"ports","ranges":{"range":[{"begin":31000,"end":32000}]},"type":"RANGES"}]
I0815 19:45:07.183595 29784 slave.cpp:573] Agent attributes: [  ]
I0815 19:45:07.183609 29784 slave.cpp:582] Agent hostname: 4b4ca5734d83
I0815 19:45:07.183734 29782 status_update_manager.cpp:177] Pausing sending status updates
I0815 19:45:07.185094 29770 state.cpp:64] Recovering state from '/tmp/Endpoint_SlaveEndpointTest_UnauthorizedRequest_2_d02gDi/meta'
I0815 19:45:07.185371 29772 status_update_manager.cpp:203] Recovering status update manager
I0815 19:45:07.185544 29780 containerizer.cpp:598] Recovering containerizer
I0815 19:45:07.186826 29769 provisioner.cpp:416] Provisioner recovery complete
I0815 19:45:07.187120 29784 slave.cpp:6210] Finished recovery
I0815 19:45:07.187523 29784 slave.cpp:6392] Querying resource estimator for oversubscribable
resources
I0815 19:45:07.187746 29766 slave.cpp:6406] Received oversubscribable resources {} from the
resource estimator
I0815 19:45:07.189810 29782 process.cpp:3933] Handling HTTP event for process 'slave(808)'
with path: '/slave(808)/containers'
I0815 19:45:07.191949 29770 http.cpp:1166] HTTP GET for /slave(808)/containers from 172.17.0.5:51948
I0815 19:45:07.192031 29770 http.cpp:957] Authorizing principal 'test-principal' to GET the
'/containers' endpoint
I0815 19:45:07.194201 29777 slave.cpp:843] Agent terminating
[       OK ] Endpoint/SlaveEndpointTest.UnauthorizedRequest/2 (28 ms)
[ RUN      ] Endpoint/SlaveEndpointTest.NoAuthorizer/0
I0815 19:45:07.204887  8465 containerizer.cpp:246] Using isolation: posix/cpu,posix/mem,filesystem/posix,network/cni,environment_secret
W0815 19:45:07.205356  8465 backend.cpp:76] Failed to create 'aufs' backend: AufsBackend requires
root privileges
W0815 19:45:07.205466  8465 backend.cpp:76] Failed to create 'bind' backend: BindBackend requires
root privileges
I0815 19:45:07.205497  8465 provisioner.cpp:255] Using default backend 'copy'
I0815 19:45:07.207284  8465 cluster.cpp:448] Creating default 'local' authorizer
I0815 19:45:07.209156 29776 slave.cpp:250] Mesos agent started on (809)@172.17.0.5:39764
I0815 19:45:07.209177 29776 slave.cpp:251] Flags at startup: --acls="" --appc_simple_discovery_uri_prefix="http://"
--appc_store_dir="/tmp/Endpoint_SlaveEndpointTest_NoAuthorizer_0_AdfQlo/store/appc" --authenticate_http_executors="true"
--authenticate_http_readonly="true" --authenticate_http_readwrite="true" --authenticatee="crammd5"
--authentication_backoff_factor="1secs" --authorizer="local" --cgroups_cpu_enable_pids_and_tids_count="false"
--cgroups_enable_cfs="false" --cgroups_hierarchy="/sys/fs/cgroup" --cgroups_limit_swap="false"
--cgroups_root="mesos" --container_disk_watch_interval="15secs" --containerizers="mesos" --credential="/tmp/Endpoint_SlaveEndpointTest_NoAuthorizer_0_AdfQlo/credential"
--default_role="*" --disallow_sharing_agent_pid_namespace="false" --disk_watch_interval="1mins"
--docker="docker" --docker_kill_orphans="true" --docker_registry="https://registry-1.docker.io"
--docker_remove_delay="6hrs" --docker_socket="/var/run/docker.sock" --docker_stop_timeout="0ns"
--docker_store_dir="/tmp/Endpoint_SlaveEndpointTest_NoAuthorizer_0_AdfQlo/store/docker" --docker_volume_checkpoint_dir="/var/run/mesos/isolators/docker/volume"
--enforce_container_disk_quota="false" --executor_registration_timeout="1mins" --executor_reregistration_timeout="2secs"
--executor_secret_key="/tmp/Endpoint_SlaveEndpointTest_NoAuthorizer_0_AdfQlo/executor_secret_key"
--executor_shutdown_grace_period="5secs" --fetcher_cache_dir="/tmp/Endpoint_SlaveEndpointTest_NoAuthorizer_0_AdfQlo/fetch"
--fetcher_cache_size="2GB" --frameworks_home="" --gc_delay="1weeks" --gc_disk_headroom="0.1"
--hadoop_home="" --help="false" --hostname_lookup="true" --http_command_executor="false" --http_credentials="/tmp/Endpoint_SlaveEndpointTest_NoAuthorizer_0_AdfQlo/http_credentials"
--http_heartbeat_interval="30secs" --initialize_driver_logging="true" --isolation="posix/cpu,posix/mem"
--launcher="posix" --launcher_dir="/mesos/mesos-1.4.0/_build/src" --logbufsecs="0" --logging_level="INFO"
--max_completed_executors_per_framework="150" --oversubscribed_resources_interval="15secs"
--perf_duration="10secs" --perf_interval="1mins" --port="5051" --qos_correction_interval_min="0ns"
--quiet="false" --recover="reconnect" --recovery_timeout="15mins" --registration_backoff_factor="10ms"
--resources="cpus:2;gpus:0;mem:1024;disk:1024;ports:[31000-32000]" --revocable_cpu_low_priority="true"
--runtime_dir="/tmp/Endpoint_SlaveEndpointTest_NoAuthorizer_0_AdfQlo" --sandbox_directory="/mnt/mesos/sandbox"
--strict="true" --switch_user="true" --systemd_enable_support="true" --systemd_runtime_directory="/run/systemd/system"
--version="false" --work_dir="/tmp/Endpoint_SlaveEndpointTest_NoAuthorizer_0_7RwNMa"
I0815 19:45:07.209539 29776 credentials.hpp:86] Loading credential for authentication from
'/tmp/Endpoint_SlaveEndpointTest_NoAuthorizer_0_AdfQlo/credential'
I0815 19:45:07.209686 29776 slave.cpp:283] Agent using credential for: test-principal
I0815 19:45:07.209712 29776 credentials.hpp:37] Loading credentials for authentication from
'/tmp/Endpoint_SlaveEndpointTest_NoAuthorizer_0_AdfQlo/http_credentials'
I0815 19:45:07.209988 29776 http.cpp:1026] Creating default 'basic' HTTP authenticator for
realm 'mesos-agent-executor'
I0815 19:45:07.210108 29776 http.cpp:1047] Creating default 'jwt' HTTP authenticator for realm
'mesos-agent-executor'
I0815 19:45:07.210309 29776 http.cpp:1026] Creating default 'basic' HTTP authenticator for
realm 'mesos-agent-readonly'
I0815 19:45:07.210413 29776 http.cpp:1047] Creating default 'jwt' HTTP authenticator for realm
'mesos-agent-readonly'
I0815 19:45:07.210598 29776 http.cpp:1026] Creating default 'basic' HTTP authenticator for
realm 'mesos-agent-readwrite'
I0815 19:45:07.210700 29776 http.cpp:1047] Creating default 'jwt' HTTP authenticator for realm
'mesos-agent-readwrite'
I0815 19:45:07.212054 29776 slave.cpp:565] Agent resources: [{"name":"cpus","scalar":{"value":2.0},"type":"SCALAR"},{"name":"mem","scalar":{"value":1024.0},"type":"SCALAR"},{"name":"disk","scalar":{"value":1024.0},"type":"SCALAR"},{"name":"ports","ranges":{"range":[{"begin":31000,"end":32000}]},"type":"RANGES"}]
I0815 19:45:07.212280 29776 slave.cpp:573] Agent attributes: [  ]
I0815 19:45:07.212294 29776 slave.cpp:582] Agent hostname: 4b4ca5734d83
I0815 19:45:07.212409 29769 status_update_manager.cpp:177] Pausing sending status updates
I0815 19:45:07.213811 29778 state.cpp:64] Recovering state from '/tmp/Endpoint_SlaveEndpointTest_NoAuthorizer_0_7RwNMa/meta'
I0815 19:45:07.214113 29781 status_update_manager.cpp:203] Recovering status update manager
I0815 19:45:07.214313 29775 containerizer.cpp:598] Recovering containerizer
I0815 19:45:07.215848 29765 provisioner.cpp:416] Provisioner recovery complete
I0815 19:45:07.216173 29771 slave.cpp:6210] Finished recovery
I0815 19:45:07.216600 29771 slave.cpp:6392] Querying resource estimator for oversubscribable
resources
I0815 19:45:07.216859 29777 slave.cpp:6406] Received oversubscribable resources {} from the
resource estimator
I0815 19:45:07.218824 29768 process.cpp:3933] Handling HTTP event for process 'slave(809)'
with path: '/slave(809)/monitor/statistics'
I0815 19:45:07.220449 29779 http.cpp:1166] HTTP GET for /slave(809)/monitor/statistics from
172.17.0.5:51950
I0815 19:45:07.220518 29779 http.cpp:957] Authorizing principal 'test-principal' to GET the
'/monitor/statistics' endpoint
I0815 19:45:07.223564 29771 slave.cpp:843] Agent terminating
[       OK ] Endpoint/SlaveEndpointTest.NoAuthorizer/0 (29 ms)
[ RUN      ] Endpoint/SlaveEndpointTest.NoAuthorizer/1
I0815 19:45:07.234043  8465 containerizer.cpp:246] Using isolation: posix/cpu,posix/mem,filesystem/posix,network/cni,environment_secret
W0815 19:45:07.234504  8465 backend.cpp:76] Failed to create 'aufs' backend: AufsBackend requires
root privileges
W0815 19:45:07.234609  8465 backend.cpp:76] Failed to create 'bind' backend: BindBackend requires
root privileges
I0815 19:45:07.234638  8465 provisioner.cpp:255] Using default backend 'copy'
I0815 19:45:07.236378  8465 cluster.cpp:448] Creating default 'local' authorizer
I0815 19:45:07.238114 29782 slave.cpp:250] Mesos agent started on (810)@172.17.0.5:39764
I0815 19:45:07.238144 29782 slave.cpp:251] Flags at startup: --acls="" --appc_simple_discovery_uri_prefix="http://"
--appc_store_dir="/tmp/Endpoint_SlaveEndpointTest_NoAuthorizer_1_euAXQg/store/appc" --authenticate_http_executors="true"
--authenticate_http_readonly="true" --authenticate_http_readwrite="true" --authenticatee="crammd5"
--authentication_backoff_factor="1secs" --authorizer="local" --cgroups_cpu_enable_pids_and_tids_count="false"
--cgroups_enable_cfs="false" --cgroups_hierarchy="/sys/fs/cgroup" --cgroups_limit_swap="false"
--cgroups_root="mesos" --container_disk_watch_interval="15secs" --containerizers="mesos" --credential="/tmp/Endpoint_SlaveEndpointTest_NoAuthorizer_1_euAXQg/credential"
--default_role="*" --disallow_sharing_agent_pid_namespace="false" --disk_watch_interval="1mins"
--docker="docker" --docker_kill_orphans="true" --docker_registry="https://registry-1.docker.io"
--docker_remove_delay="6hrs" --docker_socket="/var/run/docker.sock" --docker_stop_timeout="0ns"
--docker_store_dir="/tmp/Endpoint_SlaveEndpointTest_NoAuthorizer_1_euAXQg/store/docker" --docker_volume_checkpoint_dir="/var/run/mesos/isolators/docker/volume"
--enforce_container_disk_quota="false" --executor_registration_timeout="1mins" --executor_reregistration_timeout="2secs"
--executor_secret_key="/tmp/Endpoint_SlaveEndpointTest_NoAuthorizer_1_euAXQg/executor_secret_key"
--executor_shutdown_grace_period="5secs" --fetcher_cache_dir="/tmp/Endpoint_SlaveEndpointTest_NoAuthorizer_1_euAXQg/fetch"
--fetcher_cache_size="2GB" --frameworks_home="" --gc_delay="1weeks" --gc_disk_headroom="0.1"
--hadoop_home="" --help="false" --hostname_lookup="true" --http_command_executor="false" --http_credentials="/tmp/Endpoint_SlaveEndpointTest_NoAuthorizer_1_euAXQg/http_credentials"
--http_heartbeat_interval="30secs" --initialize_driver_logging="true" --isolation="posix/cpu,posix/mem"
--launcher="posix" --launcher_dir="/mesos/mesos-1.4.0/_build/src" --logbufsecs="0" --logging_level="INFO"
--max_completed_executors_per_framework="150" --oversubscribed_resources_interval="15secs"
--perf_duration="10secs" --perf_interval="1mins" --port="5051" --qos_correction_interval_min="0ns"
--quiet="false" --recover="reconnect" --recovery_timeout="15mins" --registration_backoff_factor="10ms"
--resources="cpus:2;gpus:0;mem:1024;disk:1024;ports:[31000-32000]" --revocable_cpu_low_priority="true"
--runtime_dir="/tmp/Endpoint_SlaveEndpointTest_NoAuthorizer_1_euAXQg" --sandbox_directory="/mnt/mesos/sandbox"
--strict="true" --switch_user="true" --systemd_enable_support="true" --systemd_runtime_directory="/run/systemd/system"
--version="false" --work_dir="/tmp/Endpoint_SlaveEndpointTest_NoAuthorizer_1_prYyd3"
I0815 19:45:07.238734 29782 credentials.hpp:86] Loading credential for authentication from
'/tmp/Endpoint_SlaveEndpointTest_NoAuthorizer_1_euAXQg/credential'
I0815 19:45:07.238921 29782 slave.cpp:283] Agent using credential for: test-principal
I0815 19:45:07.238950 29782 credentials.hpp:37] Loading credentials for authentication from
'/tmp/Endpoint_SlaveEndpointTest_NoAuthorizer_1_euAXQg/http_credentials'
I0815 19:45:07.239336 29782 http.cpp:1026] Creating default 'basic' HTTP authenticator for
realm 'mesos-agent-executor'
I0815 19:45:07.239478 29782 http.cpp:1047] Creating default 'jwt' HTTP authenticator for realm
'mesos-agent-executor'
I0815 19:45:07.239684 29782 http.cpp:1026] Creating default 'basic' HTTP authenticator for
realm 'mesos-agent-readonly'
I0815 19:45:07.239802 29782 http.cpp:1047] Creating default 'jwt' HTTP authenticator for realm
'mesos-agent-readonly'
I0815 19:45:07.239982 29782 http.cpp:1026] Creating default 'basic' HTTP authenticator for
realm 'mesos-agent-readwrite'
I0815 19:45:07.240087 29782 http.cpp:1047] Creating default 'jwt' HTTP authenticator for realm
'mesos-agent-readwrite'
I0815 19:45:07.242310 29782 slave.cpp:565] Agent resources: [{"name":"cpus","scalar":{"value":2.0},"type":"SCALAR"},{"name":"mem","scalar":{"value":1024.0},"type":"SCALAR"},{"name":"disk","scalar":{"value":1024.0},"type":"SCALAR"},{"name":"ports","ranges":{"range":[{"begin":31000,"end":32000}]},"type":"RANGES"}]
I0815 19:45:07.242712 29782 slave.cpp:573] Agent attributes: [  ]
I0815 19:45:07.242755 29782 slave.cpp:582] Agent hostname: 4b4ca5734d83
I0815 19:45:07.242884 29777 status_update_manager.cpp:177] Pausing sending status updates
I0815 19:45:07.244498 29766 state.cpp:64] Recovering state from '/tmp/Endpoint_SlaveEndpointTest_NoAuthorizer_1_prYyd3/meta'
I0815 19:45:07.244752 29763 status_update_manager.cpp:203] Recovering status update manager
I0815 19:45:07.244921 29767 containerizer.cpp:598] Recovering containerizer
I0815 19:45:07.246177 29771 provisioner.cpp:416] Provisioner recovery complete
I0815 19:45:07.246479 29762 slave.cpp:6210] Finished recovery
I0815 19:45:07.246876 29762 slave.cpp:6392] Querying resource estimator for oversubscribable
resources
I0815 19:45:07.247092 29769 slave.cpp:6406] Received oversubscribable resources {} from the
resource estimator
I0815 19:45:07.249090 29777 process.cpp:3933] Handling HTTP event for process 'slave(810)'
with path: '/slave(810)/monitor/statistics.json'
I0815 19:45:07.250684 29773 http.cpp:1166] HTTP GET for /slave(810)/monitor/statistics.json
from 172.17.0.5:51952
I0815 19:45:07.250748 29773 http.cpp:957] Authorizing principal 'test-principal' to GET the
'/monitor/statistics.json' endpoint
I0815 19:45:07.253394 29765 slave.cpp:843] Agent terminating
[       OK ] Endpoint/SlaveEndpointTest.NoAuthorizer/1 (30 ms)
[ RUN      ] Endpoint/SlaveEndpointTest.NoAuthorizer/2
I0815 19:45:07.265194  8465 containerizer.cpp:246] Using isolation: posix/cpu,posix/mem,filesystem/posix,network/cni,environment_secret
W0815 19:45:07.265645  8465 backend.cpp:76] Failed to create 'aufs' backend: AufsBackend requires
root privileges
W0815 19:45:07.265750  8465 backend.cpp:76] Failed to create 'bind' backend: BindBackend requires
root privileges
I0815 19:45:07.265780  8465 provisioner.cpp:255] Using default backend 'copy'
I0815 19:45:07.267521  8465 cluster.cpp:448] Creating default 'local' authorizer
I0815 19:45:07.269918 29776 slave.cpp:250] Mesos agent started on (811)@172.17.0.5:39764
I0815 19:45:07.269939 29776 slave.cpp:251] Flags at startup: --acls="" --appc_simple_discovery_uri_prefix="http://"
--appc_store_dir="/tmp/Endpoint_SlaveEndpointTest_NoAuthorizer_2_WGQcE9/store/appc" --authenticate_http_executors="true"
--authenticate_http_readonly="true" --authenticate_http_readwrite="true" --authenticatee="crammd5"
--authentication_backoff_factor="1secs" --authorizer="local" --cgroups_cpu_enable_pids_and_tids_count="false"
--cgroups_enable_cfs="false" --cgroups_hierarchy="/sys/fs/cgroup" --cgroups_limit_swap="false"
--cgroups_root="mesos" --container_disk_watch_interval="15secs" --containerizers="mesos" --credential="/tmp/Endpoint_SlaveEndpointTest_NoAuthorizer_2_WGQcE9/credential"
--default_role="*" --disallow_sharing_agent_pid_namespace="false" --disk_watch_interval="1mins"
--docker="docker" --docker_kill_orphans="true" --docker_registry="https://registry-1.docker.io"
--docker_remove_delay="6hrs" --docker_socket="/var/run/docker.sock" --docker_stop_timeout="0ns"
--docker_store_dir="/tmp/Endpoint_SlaveEndpointTest_NoAuthorizer_2_WGQcE9/store/docker" --docker_volume_checkpoint_dir="/var/run/mesos/isolators/docker/volume"
--enforce_container_disk_quota="false" --executor_registration_timeout="1mins" --executor_reregistration_timeout="2secs"
--executor_secret_key="/tmp/Endpoint_SlaveEndpointTest_NoAuthorizer_2_WGQcE9/executor_secret_key"
--executor_shutdown_grace_period="5secs" --fetcher_cache_dir="/tmp/Endpoint_SlaveEndpointTest_NoAuthorizer_2_WGQcE9/fetch"
--fetcher_cache_size="2GB" --frameworks_home="" --gc_delay="1weeks" --gc_disk_headroom="0.1"
--hadoop_home="" --help="false" --hostname_lookup="true" --http_command_executor="false" --http_credentials="/tmp/Endpoint_SlaveEndpointTest_NoAuthorizer_2_WGQcE9/http_credentials"
--http_heartbeat_interval="30secs" --initialize_driver_logging="true" --isolation="posix/cpu,posix/mem"
--launcher="posix" --launcher_dir="/mesos/mesos-1.4.0/_build/src" --logbufsecs="0" --logging_level="INFO"
--max_completed_executors_per_framework="150" --oversubscribed_resources_interval="15secs"
--perf_duration="10secs" --perf_interval="1mins" --port="5051" --qos_correction_interval_min="0ns"
--quiet="false" --recover="reconnect" --recovery_timeout="15mins" --registration_backoff_factor="10ms"
--resources="cpus:2;gpus:0;mem:1024;disk:1024;ports:[31000-32000]" --revocable_cpu_low_priority="true"
--runtime_dir="/tmp/Endpoint_SlaveEndpointTest_NoAuthorizer_2_WGQcE9" --sandbox_directory="/mnt/mesos/sandbox"
--strict="true" --switch_user="true" --systemd_enable_support="true" --systemd_runtime_directory="/run/systemd/system"
--version="false" --work_dir="/tmp/Endpoint_SlaveEndpointTest_NoAuthorizer_2_3lVdWV"
I0815 19:45:07.270282 29776 credentials.hpp:86] Loading credential for authentication from
'/tmp/Endpoint_SlaveEndpointTest_NoAuthorizer_2_WGQcE9/credential'
I0815 19:45:07.270427 29776 slave.cpp:283] Agent using credential for: test-principal
I0815 19:45:07.270457 29776 credentials.hpp:37] Loading credentials for authentication from
'/tmp/Endpoint_SlaveEndpointTest_NoAuthorizer_2_WGQcE9/http_credentials'
I0815 19:45:07.270763 29776 http.cpp:1026] Creating default 'basic' HTTP authenticator for
realm 'mesos-agent-executor'
I0815 19:45:07.270884 29776 http.cpp:1047] Creating default 'jwt' HTTP authenticator for realm
'mesos-agent-executor'
I0815 19:45:07.271136 29776 http.cpp:1026] Creating default 'basic' HTTP authenticator for
realm 'mesos-agent-readonly'
I0815 19:45:07.271263 29776 http.cpp:1047] Creating default 'jwt' HTTP authenticator for realm
'mesos-agent-readonly'
I0815 19:45:07.271503 29776 http.cpp:1026] Creating default 'basic' HTTP authenticator for
realm 'mesos-agent-readwrite'
I0815 19:45:07.271616 29776 http.cpp:1047] Creating default 'jwt' HTTP authenticator for realm
'mesos-agent-readwrite'
I0815 19:45:07.273607 29776 slave.cpp:565] Agent resources: [{"name":"cpus","scalar":{"value":2.0},"type":"SCALAR"},{"name":"mem","scalar":{"value":1024.0},"type":"SCALAR"},{"name":"disk","scalar":{"value":1024.0},"type":"SCALAR"},{"name":"ports","ranges":{"range":[{"begin":31000,"end":32000}]},"type":"RANGES"}]
I0815 19:45:07.273838 29776 slave.cpp:573] Agent attributes: [  ]
I0815 19:45:07.273854 29776 slave.cpp:582] Agent hostname: 4b4ca5734d83
I0815 19:45:07.273994 29770 status_update_manager.cpp:177] Pausing sending status updates
I0815 19:45:07.275303 29778 state.cpp:64] Recovering state from '/tmp/Endpoint_SlaveEndpointTest_NoAuthorizer_2_3lVdWV/meta'
I0815 19:45:07.275641 29785 status_update_manager.cpp:203] Recovering status update manager
I0815 19:45:07.275848 29779 containerizer.cpp:598] Recovering containerizer
I0815 19:45:07.277166 29783 provisioner.cpp:416] Provisioner recovery complete
I0815 19:45:07.277470 29776 slave.cpp:6210] Finished recovery
I0815 19:45:07.277931 29776 slave.cpp:6392] Querying resource estimator for oversubscribable
resources
I0815 19:45:07.278149 29773 slave.cpp:6406] Received oversubscribable resources {} from the
resource estimator
I0815 19:45:07.280191 29762 process.cpp:3933] Handling HTTP event for process 'slave(811)'
with path: '/slave(811)/containers'
I0815 19:45:07.281971 29785 http.cpp:1166] HTTP GET for /slave(811)/containers from 172.17.0.5:51954
I0815 19:45:07.282053 29785 http.cpp:957] Authorizing principal 'test-principal' to GET the
'/containers' endpoint
I0815 19:45:07.285781  8465 slave.cpp:843] Agent terminating
[       OK ] Endpoint/SlaveEndpointTest.NoAuthorizer/2 (32 ms)
[----------] 9 tests from Endpoint/SlaveEndpointTest (284 ms total)

[----------] 2 tests from ContainerizerType/DefaultContainerDNSFlagTest
[ RUN      ] ContainerizerType/DefaultContainerDNSFlagTest.ValidateFlag/0
[       OK ] ContainerizerType/DefaultContainerDNSFlagTest.ValidateFlag/0 (10 ms)
[ RUN      ] ContainerizerType/DefaultContainerDNSFlagTest.ValidateFlag/1
[       OK ] ContainerizerType/DefaultContainerDNSFlagTest.ValidateFlag/1 (10 ms)
[----------] 2 tests from ContainerizerType/DefaultContainerDNSFlagTest (20 ms total)

[----------] Global test environment tear-down
[==========] 1663 tests from 184 test cases ran. (584198 ms total)
[  PASSED  ] 1662 tests.
[  FAILED  ] 1 test, listed below:
[  FAILED  ] DefaultExecutorCheckTest.CommandCheckDeliveredAndReconciled

 1 FAILED TEST
  YOU HAVE 20 DISABLED TESTS

I0815 19:45:07.367801 29786 process.cpp:1072] Failed to accept socket: future discarded
make[4]: *** [check-local] Error 1
make[4]: Leaving directory `/mesos/mesos-1.4.0/_build/src'
make[3]: *** [check-am] Error 2
make[3]: Leaving directory `/mesos/mesos-1.4.0/_build/src'
make[2]: *** [check] Error 2
make[2]: Leaving directory `/mesos/mesos-1.4.0/_build/src'
make[1]: *** [check-recursive] Error 1
make[1]: Leaving directory `/mesos/mesos-1.4.0/_build'
make: *** [distcheck] Error 1
+ docker rmi mesos-1502822600-32484
Untagged: mesos-1502822600-32484:latest
Deleted: sha256:c93990afd6e908761f34b21cfae39a72694219fe8c76caaa5583f3ac3abac41b
Deleted: sha256:eeb28f68e0a22fb24a4d33ab62eab711da27de8d5c3f01107b051bdc6fc4591d
Deleted: sha256:792f5b66f1123c2993dffc24c83b2aabf50dd362936c5d70555c903b6044d408
Deleted: sha256:223f96365f59eb35bd271077a663db7ece852e6085cf24e8c4f41c479a18387f
Deleted: sha256:cf1ad71b066cdb045351381d31a2543ad414e9fd29adea9c5335d0fa37164dc3
Deleted: sha256:50eb3adf0374c733aef070f10aa24b29cf8ff02f53f4a583c6bc9d35865d9d90
Deleted: sha256:f2882cf0c8a35370bfe51c03f11a88be1e0c1af95114644135ebb37ea1e74cff
Deleted: sha256:c588c9a6de0528e015e76faef1eec3a32e7bd6849773d8d7c2ff43f04bdb354e
Deleted: sha256:490ea703b0b06410cd51503cf784822897c4300c9ded10d8f9992436078da80f
Deleted: sha256:5b9233832002de26d654a9178f80328a3bd3adcf1feb203cf9cda7a2d0209839
Deleted: sha256:ee87554346ee0690a2d27d3cee2f69ff20d2e4253a0dc7d47a48ace7548191b6
Deleted: sha256:052901c74fdc473f50e85b57d8c5b031418ceb1bf3650f9fdb29388ddc5fd846
Deleted: sha256:7ddf217169124a33bd0cf9d64382540e956efd6030e30feec2575d76ecec3883
Deleted: sha256:d41a78c8869f686a7a8e74595266af73348ba645da406180fb8e045e4ae49454
Deleted: sha256:01cdcaae402227f93e649903cb8bc4b2181a36a9ed492c8c57de5bc16511b929
Deleted: sha256:c425d6a26a5c72797c1316e6d450c1c8638c19705d17898819379dae206a35a6
Deleted: sha256:bdd9eeecb3147ffd2bba6cba8c514f8808ae7da268132d1913f65d84c7135eb7
Deleted: sha256:aa5123869aa83b7b36f2291d58a1b4b0b5d8c321c797bb32081d334bfad79ddd
Deleted: sha256:4e98a6c3255c597f74d456825d9c91a9e78b3630f4e6ea6e15e47aa2626a15e0
Deleted: sha256:8c27c84e1ba172abad42a24665fe1b9fb492963d6e26548c4bec8be454347470
Deleted: sha256:b9c32cd57bc4515f99c9394fd79c633a052f30dd3ab296765f0d1666e5486ab5
Deleted: sha256:500417a00a5991183cb6ef7c1417133a0ea98c2e80fa5e33d77322a2cb3f1ae7
Deleted: sha256:e7bffd47c3c0bc66714a72e191ffcb7c9715c88f618ae9acd5bf1798c2bafdb3
Deleted: sha256:5b3afe1723964a091399bd899cacfd52fcf74d9fa4626065a86061a6a388d4c9
Build step 'Execute shell' marked build as failure

Mime
View raw message