mesos-builds mailing list archives

Site index · List index
Message view « Date » · « Thread »
Top « Date » · « Thread »
From Apache Jenkins Server <jenk...@builds.apache.org>
Subject Build failed in Jenkins: Mesos-Buildbot » autotools,gcc,--verbose,GLOG_v=1 MESOS_VERBOSE=1,ubuntu:14.04,(ubuntu)&&(!ubuntu-us1)&&(!ubuntu-eu2) #4097
Date Fri, 11 Aug 2017 11:36:28 GMT
See <https://builds.apache.org/job/Mesos-Buildbot/BUILDTOOL=autotools,COMPILER=gcc,CONFIGURATION=--verbose,ENVIRONMENT=GLOG_v=1%20MESOS_VERBOSE=1,OS=ubuntu%3A14.04,label_exp=(ubuntu)&&(!ubuntu-us1)&&(!ubuntu-eu2)/4097/display/redirect>

------------------------------------------
[...truncated 31.15 MB...]
I0811 11:36:11.910717  5192 http.cpp:1026] Creating default 'basic' HTTP authenticator for
realm 'mesos-agent-readonly'
I0811 11:36:11.911025  5192 http.cpp:1026] Creating default 'basic' HTTP authenticator for
realm 'mesos-agent-readwrite'
I0811 11:36:11.913795  5192 slave.cpp:565] Agent resources: [{"name":"cpus","scalar":{"value":2.0},"type":"SCALAR"},{"name":"mem","scalar":{"value":1024.0},"type":"SCALAR"},{"name":"disk","scalar":{"value":1024.0},"type":"SCALAR"},{"name":"ports","ranges":{"range":[{"begin":31000,"end":32000}]},"type":"RANGES"}]
I0811 11:36:11.914134  5192 slave.cpp:573] Agent attributes: [  ]
I0811 11:36:11.914170  5192 slave.cpp:582] Agent hostname: a0fdaf75194e
I0811 11:36:11.914522  5194 status_update_manager.cpp:177] Pausing sending status updates
I0811 11:36:11.917022  5196 state.cpp:64] Recovering state from '/tmp/Endpoint_SlaveEndpointTest_AuthorizedRequest_2_Mh1duV/meta'
I0811 11:36:11.917742  5196 status_update_manager.cpp:203] Recovering status update manager
I0811 11:36:11.918140  5196 containerizer.cpp:598] Recovering containerizer
I0811 11:36:11.920246  5196 provisioner.cpp:416] Provisioner recovery complete
I0811 11:36:11.921272  5196 slave.cpp:6210] Finished recovery
I0811 11:36:11.922369  5196 slave.cpp:6392] Querying resource estimator for oversubscribable
resources
I0811 11:36:11.922843  5196 slave.cpp:6406] Received oversubscribable resources {} from the
resource estimator
I0811 11:36:11.927676  5196 process.cpp:3933] Handling HTTP event for process 'slave(799)'
with path: '/slave(799)/containers'
I0811 11:36:11.930096  5196 http.cpp:1166] HTTP GET for /slave(799)/containers from 172.17.0.4:38102
I0811 11:36:11.930402  5196 http.cpp:957] Authorizing principal 'test-principal' to GET the
'/containers' endpoint
I0811 11:36:11.955330  5192 slave.cpp:843] Agent terminating
[       OK ] Endpoint/SlaveEndpointTest.AuthorizedRequest/2 (119 ms)
[ RUN      ] Endpoint/SlaveEndpointTest.UnauthorizedRequest/0
I0811 11:36:12.016355  5170 containerizer.cpp:246] Using isolation: posix/cpu,posix/mem,filesystem/posix,network/cni,environment_secret
W0811 11:36:12.017074  5170 backend.cpp:76] Failed to create 'aufs' backend: AufsBackend requires
root privileges
W0811 11:36:12.017284  5170 backend.cpp:76] Failed to create 'bind' backend: BindBackend requires
root privileges
I0811 11:36:12.017349  5170 provisioner.cpp:255] Using default backend 'copy'
I0811 11:36:12.022454  5195 slave.cpp:250] Mesos agent started on (800)@172.17.0.4:33738
I0811 11:36:12.022488  5195 slave.cpp:251] Flags at startup: --acls="" --appc_simple_discovery_uri_prefix="http://"
--appc_store_dir="/tmp/Endpoint_SlaveEndpointTest_UnauthorizedRequest_0_cJSZ9L/store/appc"
--authenticate_http_readonly="true" --authenticate_http_readwrite="true" --authenticatee="crammd5"
--authentication_backoff_factor="1secs" --authorizer="local" --cgroups_cpu_enable_pids_and_tids_count="false"
--cgroups_enable_cfs="false" --cgroups_hierarchy="/sys/fs/cgroup" --cgroups_limit_swap="false"
--cgroups_root="mesos" --container_disk_watch_interval="15secs" --containerizers="mesos" --credential="/tmp/Endpoint_SlaveEndpointTest_UnauthorizedRequest_0_cJSZ9L/credential"
--default_role="*" --disk_watch_interval="1mins" --docker="docker" --docker_kill_orphans="true"
--docker_registry="https://registry-1.docker.io" --docker_remove_delay="6hrs" --docker_socket="/var/run/docker.sock"
--docker_stop_timeout="0ns" --docker_store_dir="/tmp/Endpoint_SlaveEndpointTest_UnauthorizedRequest_0_cJSZ9L/store/docker"
--docker_volume_checkpoint_dir="/var/run/mesos/isolators/docker/volume" --enforce_container_disk_quota="false"
--executor_registration_timeout="1mins" --executor_reregistration_timeout="2secs" --executor_shutdown_grace_period="5secs"
--fetcher_cache_dir="/tmp/Endpoint_SlaveEndpointTest_UnauthorizedRequest_0_cJSZ9L/fetch" --fetcher_cache_size="2GB"
--frameworks_home="" --gc_delay="1weeks" --gc_disk_headroom="0.1" --hadoop_home="" --help="false"
--hostname_lookup="true" --http_command_executor="false" --http_credentials="/tmp/Endpoint_SlaveEndpointTest_UnauthorizedRequest_0_cJSZ9L/http_credentials"
--http_heartbeat_interval="30secs" --initialize_driver_logging="true" --isolation="posix/cpu,posix/mem"
--launcher="posix" --launcher_dir="/mesos/mesos-1.4.0/_build/src" --logbufsecs="0" --logging_level="INFO"
--max_completed_executors_per_framework="150" --oversubscribed_resources_interval="15secs"
--perf_duration="10secs" --perf_interval="1mins" --port="5051" --qos_correction_interval_min="0ns"
--quiet="false" --recover="reconnect" --recovery_timeout="15mins" --registration_backoff_factor="10ms"
--resources="cpus:2;gpus:0;mem:1024;disk:1024;ports:[31000-32000]" --revocable_cpu_low_priority="true"
--runtime_dir="/tmp/Endpoint_SlaveEndpointTest_UnauthorizedRequest_0_cJSZ9L" --sandbox_directory="/mnt/mesos/sandbox"
--strict="true" --switch_user="true" --systemd_enable_support="true" --systemd_runtime_directory="/run/systemd/system"
--version="false" --work_dir="/tmp/Endpoint_SlaveEndpointTest_UnauthorizedRequest_0_C4Ft6o"
I0811 11:36:12.023027  5195 credentials.hpp:86] Loading credential for authentication from
'/tmp/Endpoint_SlaveEndpointTest_UnauthorizedRequest_0_cJSZ9L/credential'
I0811 11:36:12.023308  5195 slave.cpp:283] Agent using credential for: test-principal
I0811 11:36:12.023337  5195 credentials.hpp:37] Loading credentials for authentication from
'/tmp/Endpoint_SlaveEndpointTest_UnauthorizedRequest_0_cJSZ9L/http_credentials'
I0811 11:36:12.023686  5195 http.cpp:1026] Creating default 'basic' HTTP authenticator for
realm 'mesos-agent-readonly'
I0811 11:36:12.024013  5195 http.cpp:1026] Creating default 'basic' HTTP authenticator for
realm 'mesos-agent-readwrite'
I0811 11:36:12.025915  5195 slave.cpp:565] Agent resources: [{"name":"cpus","scalar":{"value":2.0},"type":"SCALAR"},{"name":"mem","scalar":{"value":1024.0},"type":"SCALAR"},{"name":"disk","scalar":{"value":1024.0},"type":"SCALAR"},{"name":"ports","ranges":{"range":[{"begin":31000,"end":32000}]},"type":"RANGES"}]
I0811 11:36:12.026127  5195 slave.cpp:573] Agent attributes: [  ]
I0811 11:36:12.026144  5195 slave.cpp:582] Agent hostname: a0fdaf75194e
I0811 11:36:12.026629  5192 status_update_manager.cpp:177] Pausing sending status updates
I0811 11:36:12.028648  5194 state.cpp:64] Recovering state from '/tmp/Endpoint_SlaveEndpointTest_UnauthorizedRequest_0_C4Ft6o/meta'
I0811 11:36:12.029341  5194 status_update_manager.cpp:203] Recovering status update manager
I0811 11:36:12.029685  5195 containerizer.cpp:598] Recovering containerizer
I0811 11:36:12.032394  5194 provisioner.cpp:416] Provisioner recovery complete
I0811 11:36:12.033007  5190 slave.cpp:6210] Finished recovery
I0811 11:36:12.033819  5190 slave.cpp:6392] Querying resource estimator for oversubscribable
resources
I0811 11:36:12.034301  5193 slave.cpp:6406] Received oversubscribable resources {} from the
resource estimator
I0811 11:36:12.039229  5189 process.cpp:3933] Handling HTTP event for process 'slave(800)'
with path: '/slave(800)/monitor/statistics'
I0811 11:36:12.041613  5193 http.cpp:1166] HTTP GET for /slave(800)/monitor/statistics from
172.17.0.4:38106
I0811 11:36:12.041784  5193 http.cpp:957] Authorizing principal 'test-principal' to GET the
'/monitor/statistics' endpoint
I0811 11:36:12.050792  5170 slave.cpp:843] Agent terminating
[       OK ] Endpoint/SlaveEndpointTest.UnauthorizedRequest/0 (79 ms)
[ RUN      ] Endpoint/SlaveEndpointTest.UnauthorizedRequest/1
I0811 11:36:12.099720  5170 containerizer.cpp:246] Using isolation: posix/cpu,posix/mem,filesystem/posix,network/cni,environment_secret
W0811 11:36:12.101279  5170 backend.cpp:76] Failed to create 'aufs' backend: AufsBackend requires
root privileges
W0811 11:36:12.101698  5170 backend.cpp:76] Failed to create 'bind' backend: BindBackend requires
root privileges
I0811 11:36:12.101876  5170 provisioner.cpp:255] Using default backend 'copy'
I0811 11:36:12.109643  5189 slave.cpp:250] Mesos agent started on (801)@172.17.0.4:33738
I0811 11:36:12.109853  5189 slave.cpp:251] Flags at startup: --acls="" --appc_simple_discovery_uri_prefix="http://"
--appc_store_dir="/tmp/Endpoint_SlaveEndpointTest_UnauthorizedRequest_1_Gu9O7g/store/appc"
--authenticate_http_readonly="true" --authenticate_http_readwrite="true" --authenticatee="crammd5"
--authentication_backoff_factor="1secs" --authorizer="local" --cgroups_cpu_enable_pids_and_tids_count="false"
--cgroups_enable_cfs="false" --cgroups_hierarchy="/sys/fs/cgroup" --cgroups_limit_swap="false"
--cgroups_root="mesos" --container_disk_watch_interval="15secs" --containerizers="mesos" --credential="/tmp/Endpoint_SlaveEndpointTest_UnauthorizedRequest_1_Gu9O7g/credential"
--default_role="*" --disk_watch_interval="1mins" --docker="docker" --docker_kill_orphans="true"
--docker_registry="https://registry-1.docker.io" --docker_remove_delay="6hrs" --docker_socket="/var/run/docker.sock"
--docker_stop_timeout="0ns" --docker_store_dir="/tmp/Endpoint_SlaveEndpointTest_UnauthorizedRequest_1_Gu9O7g/store/docker"
--docker_volume_checkpoint_dir="/var/run/mesos/isolators/docker/volume" --enforce_container_disk_quota="false"
--executor_registration_timeout="1mins" --executor_reregistration_timeout="2secs" --executor_shutdown_grace_period="5secs"
--fetcher_cache_dir="/tmp/Endpoint_SlaveEndpointTest_UnauthorizedRequest_1_Gu9O7g/fetch" --fetcher_cache_size="2GB"
--frameworks_home="" --gc_delay="1weeks" --gc_disk_headroom="0.1" --hadoop_home="" --help="false"
--hostname_lookup="true" --http_command_executor="false" --http_credentials="/tmp/Endpoint_SlaveEndpointTest_UnauthorizedRequest_1_Gu9O7g/http_credentials"
--http_heartbeat_interval="30secs" --initialize_driver_logging="true" --isolation="posix/cpu,posix/mem"
--launcher="posix" --launcher_dir="/mesos/mesos-1.4.0/_build/src" --logbufsecs="0" --logging_level="INFO"
--max_completed_executors_per_framework="150" --oversubscribed_resources_interval="15secs"
--perf_duration="10secs" --perf_interval="1mins" --port="5051" --qos_correction_interval_min="0ns"
--quiet="false" --recover="reconnect" --recovery_timeout="15mins" --registration_backoff_factor="10ms"
--resources="cpus:2;gpus:0;mem:1024;disk:1024;ports:[31000-32000]" --revocable_cpu_low_priority="true"
--runtime_dir="/tmp/Endpoint_SlaveEndpointTest_UnauthorizedRequest_1_Gu9O7g" --sandbox_directory="/mnt/mesos/sandbox"
--strict="true" --switch_user="true" --systemd_enable_support="true" --systemd_runtime_directory="/run/systemd/system"
--version="false" --work_dir="/tmp/Endpoint_SlaveEndpointTest_UnauthorizedRequest_1_TPrUPT"
I0811 11:36:12.110499  5189 credentials.hpp:86] Loading credential for authentication from
'/tmp/Endpoint_SlaveEndpointTest_UnauthorizedRequest_1_Gu9O7g/credential'
I0811 11:36:12.111246  5189 slave.cpp:283] Agent using credential for: test-principal
I0811 11:36:12.111304  5189 credentials.hpp:37] Loading credentials for authentication from
'/tmp/Endpoint_SlaveEndpointTest_UnauthorizedRequest_1_Gu9O7g/http_credentials'
I0811 11:36:12.111729  5189 http.cpp:1026] Creating default 'basic' HTTP authenticator for
realm 'mesos-agent-readonly'
I0811 11:36:12.111959  5189 http.cpp:1026] Creating default 'basic' HTTP authenticator for
realm 'mesos-agent-readwrite'
I0811 11:36:12.114521  5189 slave.cpp:565] Agent resources: [{"name":"cpus","scalar":{"value":2.0},"type":"SCALAR"},{"name":"mem","scalar":{"value":1024.0},"type":"SCALAR"},{"name":"disk","scalar":{"value":1024.0},"type":"SCALAR"},{"name":"ports","ranges":{"range":[{"begin":31000,"end":32000}]},"type":"RANGES"}]
I0811 11:36:12.115185  5189 slave.cpp:573] Agent attributes: [  ]
I0811 11:36:12.115236  5189 slave.cpp:582] Agent hostname: a0fdaf75194e
I0811 11:36:12.115610  5192 status_update_manager.cpp:177] Pausing sending status updates
I0811 11:36:12.118391  5194 state.cpp:64] Recovering state from '/tmp/Endpoint_SlaveEndpointTest_UnauthorizedRequest_1_TPrUPT/meta'
I0811 11:36:12.118963  5192 status_update_manager.cpp:203] Recovering status update manager
I0811 11:36:12.119555  5189 containerizer.cpp:598] Recovering containerizer
I0811 11:36:12.132654  5191 provisioner.cpp:416] Provisioner recovery complete
I0811 11:36:12.134706  5193 slave.cpp:6210] Finished recovery
I0811 11:36:12.135733  5193 slave.cpp:6392] Querying resource estimator for oversubscribable
resources
I0811 11:36:12.136478  5191 slave.cpp:6406] Received oversubscribable resources {} from the
resource estimator
I0811 11:36:12.141330  5192 process.cpp:3933] Handling HTTP event for process 'slave(801)'
with path: '/slave(801)/monitor/statistics.json'
I0811 11:36:12.143420  5191 http.cpp:1166] HTTP GET for /slave(801)/monitor/statistics.json
from 172.17.0.4:38110
I0811 11:36:12.143537  5191 http.cpp:957] Authorizing principal 'test-principal' to GET the
'/monitor/statistics.json' endpoint
I0811 11:36:12.156560  5170 slave.cpp:843] Agent terminating
[       OK ] Endpoint/SlaveEndpointTest.UnauthorizedRequest/1 (121 ms)
[ RUN      ] Endpoint/SlaveEndpointTest.UnauthorizedRequest/2
I0811 11:36:12.224867  5170 containerizer.cpp:246] Using isolation: posix/cpu,posix/mem,filesystem/posix,network/cni,environment_secret
W0811 11:36:12.226840  5170 backend.cpp:76] Failed to create 'aufs' backend: AufsBackend requires
root privileges
W0811 11:36:12.227478  5170 backend.cpp:76] Failed to create 'bind' backend: BindBackend requires
root privileges
I0811 11:36:12.227684  5170 provisioner.cpp:255] Using default backend 'copy'
I0811 11:36:12.239363  5193 slave.cpp:250] Mesos agent started on (802)@172.17.0.4:33738
I0811 11:36:12.239425  5193 slave.cpp:251] Flags at startup: --acls="" --appc_simple_discovery_uri_prefix="http://"
--appc_store_dir="/tmp/Endpoint_SlaveEndpointTest_UnauthorizedRequest_2_4OVNpN/store/appc"
--authenticate_http_readonly="true" --authenticate_http_readwrite="true" --authenticatee="crammd5"
--authentication_backoff_factor="1secs" --authorizer="local" --cgroups_cpu_enable_pids_and_tids_count="false"
--cgroups_enable_cfs="false" --cgroups_hierarchy="/sys/fs/cgroup" --cgroups_limit_swap="false"
--cgroups_root="mesos" --container_disk_watch_interval="15secs" --containerizers="mesos" --credential="/tmp/Endpoint_SlaveEndpointTest_UnauthorizedRequest_2_4OVNpN/credential"
--default_role="*" --disk_watch_interval="1mins" --docker="docker" --docker_kill_orphans="true"
--docker_registry="https://registry-1.docker.io" --docker_remove_delay="6hrs" --docker_socket="/var/run/docker.sock"
--docker_stop_timeout="0ns" --docker_store_dir="/tmp/Endpoint_SlaveEndpointTest_UnauthorizedRequest_2_4OVNpN/store/docker"
--docker_volume_checkpoint_dir="/var/run/mesos/isolators/docker/volume" --enforce_container_disk_quota="false"
--executor_registration_timeout="1mins" --executor_reregistration_timeout="2secs" --executor_shutdown_grace_period="5secs"
--fetcher_cache_dir="/tmp/Endpoint_SlaveEndpointTest_UnauthorizedRequest_2_4OVNpN/fetch" --fetcher_cache_size="2GB"
--frameworks_home="" --gc_delay="1weeks" --gc_disk_headroom="0.1" --hadoop_home="" --help="false"
--hostname_lookup="true" --http_command_executor="false" --http_credentials="/tmp/Endpoint_SlaveEndpointTest_UnauthorizedRequest_2_4OVNpN/http_credentials"
--http_heartbeat_interval="30secs" --initialize_driver_logging="true" --isolation="posix/cpu,posix/mem"
--launcher="posix" --launcher_dir="/mesos/mesos-1.4.0/_build/src" --logbufsecs="0" --logging_level="INFO"
--max_completed_executors_per_framework="150" --oversubscribed_resources_interval="15secs"
--perf_duration="10secs" --perf_interval="1mins" --port="5051" --qos_correction_interval_min="0ns"
--quiet="false" --recover="reconnect" --recovery_timeout="15mins" --registration_backoff_factor="10ms"
--resources="cpus:2;gpus:0;mem:1024;disk:1024;ports:[31000-32000]" --revocable_cpu_low_priority="true"
--runtime_dir="/tmp/Endpoint_SlaveEndpointTest_UnauthorizedRequest_2_4OVNpN" --sandbox_directory="/mnt/mesos/sandbox"
--strict="true" --switch_user="true" --systemd_enable_support="true" --systemd_runtime_directory="/run/systemd/system"
--version="false" --work_dir="/tmp/Endpoint_SlaveEndpointTest_UnauthorizedRequest_2_iaprMp"
I0811 11:36:12.240686  5193 credentials.hpp:86] Loading credential for authentication from
'/tmp/Endpoint_SlaveEndpointTest_UnauthorizedRequest_2_4OVNpN/credential'
I0811 11:36:12.241648  5193 slave.cpp:283] Agent using credential for: test-principal
I0811 11:36:12.241690  5193 credentials.hpp:37] Loading credentials for authentication from
'/tmp/Endpoint_SlaveEndpointTest_UnauthorizedRequest_2_4OVNpN/http_credentials'
I0811 11:36:12.242691  5193 http.cpp:1026] Creating default 'basic' HTTP authenticator for
realm 'mesos-agent-readonly'
I0811 11:36:12.243254  5193 http.cpp:1026] Creating default 'basic' HTTP authenticator for
realm 'mesos-agent-readwrite'
I0811 11:36:12.246500  5193 slave.cpp:565] Agent resources: [{"name":"cpus","scalar":{"value":2.0},"type":"SCALAR"},{"name":"mem","scalar":{"value":1024.0},"type":"SCALAR"},{"name":"disk","scalar":{"value":1024.0},"type":"SCALAR"},{"name":"ports","ranges":{"range":[{"begin":31000,"end":32000}]},"type":"RANGES"}]
I0811 11:36:12.246999  5193 slave.cpp:573] Agent attributes: [  ]
I0811 11:36:12.247251  5193 slave.cpp:582] Agent hostname: a0fdaf75194e
I0811 11:36:12.247859  5195 status_update_manager.cpp:177] Pausing sending status updates
I0811 11:36:12.251746  5196 state.cpp:64] Recovering state from '/tmp/Endpoint_SlaveEndpointTest_UnauthorizedRequest_2_iaprMp/meta'
I0811 11:36:12.252418  5193 status_update_manager.cpp:203] Recovering status update manager
I0811 11:36:12.252965  5189 containerizer.cpp:598] Recovering containerizer
I0811 11:36:12.256758  5191 provisioner.cpp:416] Provisioner recovery complete
I0811 11:36:12.257596  5192 slave.cpp:6210] Finished recovery
I0811 11:36:12.258890  5192 slave.cpp:6392] Querying resource estimator for oversubscribable
resources
I0811 11:36:12.259639  5194 slave.cpp:6406] Received oversubscribable resources {} from the
resource estimator
I0811 11:36:12.264339  5189 process.cpp:3933] Handling HTTP event for process 'slave(802)'
with path: '/slave(802)/containers'
I0811 11:36:12.267015  5194 http.cpp:1166] HTTP GET for /slave(802)/containers from 172.17.0.4:38114
I0811 11:36:12.267103  5194 http.cpp:957] Authorizing principal 'test-principal' to GET the
'/containers' endpoint
I0811 11:36:12.283651  5170 slave.cpp:843] Agent terminating
[       OK ] Endpoint/SlaveEndpointTest.UnauthorizedRequest/2 (118 ms)
[ RUN      ] Endpoint/SlaveEndpointTest.NoAuthorizer/0
I0811 11:36:12.336392  5170 containerizer.cpp:246] Using isolation: posix/cpu,posix/mem,filesystem/posix,network/cni,environment_secret
W0811 11:36:12.336999  5170 backend.cpp:76] Failed to create 'aufs' backend: AufsBackend requires
root privileges
W0811 11:36:12.337157  5170 backend.cpp:76] Failed to create 'bind' backend: BindBackend requires
root privileges
I0811 11:36:12.337224  5170 provisioner.cpp:255] Using default backend 'copy'
I0811 11:36:12.339597  5170 cluster.cpp:448] Creating default 'local' authorizer
I0811 11:36:12.342232  5195 slave.cpp:250] Mesos agent started on (803)@172.17.0.4:33738
I0811 11:36:12.342278  5195 slave.cpp:251] Flags at startup: --acls="" --appc_simple_discovery_uri_prefix="http://"
--appc_store_dir="/tmp/Endpoint_SlaveEndpointTest_NoAuthorizer_0_QNlw2k/store/appc" --authenticate_http_readonly="true"
--authenticate_http_readwrite="true" --authenticatee="crammd5" --authentication_backoff_factor="1secs"
--authorizer="local" --cgroups_cpu_enable_pids_and_tids_count="false" --cgroups_enable_cfs="false"
--cgroups_hierarchy="/sys/fs/cgroup" --cgroups_limit_swap="false" --cgroups_root="mesos" --container_disk_watch_interval="15secs"
--containerizers="mesos" --credential="/tmp/Endpoint_SlaveEndpointTest_NoAuthorizer_0_QNlw2k/credential"
--default_role="*" --disk_watch_interval="1mins" --docker="docker" --docker_kill_orphans="true"
--docker_registry="https://registry-1.docker.io" --docker_remove_delay="6hrs" --docker_socket="/var/run/docker.sock"
--docker_stop_timeout="0ns" --docker_store_dir="/tmp/Endpoint_SlaveEndpointTest_NoAuthorizer_0_QNlw2k/store/docker"
--docker_volume_checkpoint_dir="/var/run/mesos/isolators/docker/volume" --enforce_container_disk_quota="false"
--executor_registration_timeout="1mins" --executor_reregistration_timeout="2secs" --executor_shutdown_grace_period="5secs"
--fetcher_cache_dir="/tmp/Endpoint_SlaveEndpointTest_NoAuthorizer_0_QNlw2k/fetch" --fetcher_cache_size="2GB"
--frameworks_home="" --gc_delay="1weeks" --gc_disk_headroom="0.1" --hadoop_home="" --help="false"
--hostname_lookup="true" --http_command_executor="false" --http_credentials="/tmp/Endpoint_SlaveEndpointTest_NoAuthorizer_0_QNlw2k/http_credentials"
--http_heartbeat_interval="30secs" --initialize_driver_logging="true" --isolation="posix/cpu,posix/mem"
--launcher="posix" --launcher_dir="/mesos/mesos-1.4.0/_build/src" --logbufsecs="0" --logging_level="INFO"
--max_completed_executors_per_framework="150" --oversubscribed_resources_interval="15secs"
--perf_duration="10secs" --perf_interval="1mins" --port="5051" --qos_correction_interval_min="0ns"
--quiet="false" --recover="reconnect" --recovery_timeout="15mins" --registration_backoff_factor="10ms"
--resources="cpus:2;gpus:0;mem:1024;disk:1024;ports:[31000-32000]" --revocable_cpu_low_priority="true"
--runtime_dir="/tmp/Endpoint_SlaveEndpointTest_NoAuthorizer_0_QNlw2k" --sandbox_directory="/mnt/mesos/sandbox"
--strict="true" --switch_user="true" --systemd_enable_support="true" --systemd_runtime_directory="/run/systemd/system"
--version="false" --work_dir="/tmp/Endpoint_SlaveEndpointTest_NoAuthorizer_0_IA9Y4W"
I0811 11:36:12.343523  5195 credentials.hpp:86] Loading credential for authentication from
'/tmp/Endpoint_SlaveEndpointTest_NoAuthorizer_0_QNlw2k/credential'
I0811 11:36:12.344139  5195 slave.cpp:283] Agent using credential for: test-principal
I0811 11:36:12.344405  5195 credentials.hpp:37] Loading credentials for authentication from
'/tmp/Endpoint_SlaveEndpointTest_NoAuthorizer_0_QNlw2k/http_credentials'
I0811 11:36:12.345093  5195 http.cpp:1026] Creating default 'basic' HTTP authenticator for
realm 'mesos-agent-readonly'
I0811 11:36:12.345674  5195 http.cpp:1026] Creating default 'basic' HTTP authenticator for
realm 'mesos-agent-readwrite'
I0811 11:36:12.348332  5195 slave.cpp:565] Agent resources: [{"name":"cpus","scalar":{"value":2.0},"type":"SCALAR"},{"name":"mem","scalar":{"value":1024.0},"type":"SCALAR"},{"name":"disk","scalar":{"value":1024.0},"type":"SCALAR"},{"name":"ports","ranges":{"range":[{"begin":31000,"end":32000}]},"type":"RANGES"}]
I0811 11:36:12.348953  5195 slave.cpp:573] Agent attributes: [  ]
I0811 11:36:12.349198  5195 slave.cpp:582] Agent hostname: a0fdaf75194e
I0811 11:36:12.349624  5196 status_update_manager.cpp:177] Pausing sending status updates
I0811 11:36:12.352574  5196 state.cpp:64] Recovering state from '/tmp/Endpoint_SlaveEndpointTest_NoAuthorizer_0_IA9Y4W/meta'
I0811 11:36:12.353467  5195 status_update_manager.cpp:203] Recovering status update manager
I0811 11:36:12.353837  5192 containerizer.cpp:598] Recovering containerizer
I0811 11:36:12.355985  5190 provisioner.cpp:416] Provisioner recovery complete
I0811 11:36:12.356593  5192 slave.cpp:6210] Finished recovery
I0811 11:36:12.357341  5192 slave.cpp:6392] Querying resource estimator for oversubscribable
resources
I0811 11:36:12.357887  5193 slave.cpp:6406] Received oversubscribable resources {} from the
resource estimator
I0811 11:36:12.362491  5192 process.cpp:3933] Handling HTTP event for process 'slave(803)'
with path: '/slave(803)/monitor/statistics'
I0811 11:36:12.364500  5193 http.cpp:1166] HTTP GET for /slave(803)/monitor/statistics from
172.17.0.4:38118
I0811 11:36:12.364581  5193 http.cpp:957] Authorizing principal 'test-principal' to GET the
'/monitor/statistics' endpoint
I0811 11:36:12.378933  5170 slave.cpp:843] Agent terminating
[       OK ] Endpoint/SlaveEndpointTest.NoAuthorizer/0 (59 ms)
[ RUN      ] Endpoint/SlaveEndpointTest.NoAuthorizer/1
I0811 11:36:12.394911  5170 containerizer.cpp:246] Using isolation: posix/cpu,posix/mem,filesystem/posix,network/cni,environment_secret
W0811 11:36:12.395539  5170 backend.cpp:76] Failed to create 'aufs' backend: AufsBackend requires
root privileges
W0811 11:36:12.395843  5170 backend.cpp:76] Failed to create 'bind' backend: BindBackend requires
root privileges
I0811 11:36:12.395913  5170 provisioner.cpp:255] Using default backend 'copy'
I0811 11:36:12.398232  5170 cluster.cpp:448] Creating default 'local' authorizer
I0811 11:36:12.400506  5191 slave.cpp:250] Mesos agent started on (804)@172.17.0.4:33738
I0811 11:36:12.400534  5191 slave.cpp:251] Flags at startup: --acls="" --appc_simple_discovery_uri_prefix="http://"
--appc_store_dir="/tmp/Endpoint_SlaveEndpointTest_NoAuthorizer_1_vNE9rT/store/appc" --authenticate_http_readonly="true"
--authenticate_http_readwrite="true" --authenticatee="crammd5" --authentication_backoff_factor="1secs"
--authorizer="local" --cgroups_cpu_enable_pids_and_tids_count="false" --cgroups_enable_cfs="false"
--cgroups_hierarchy="/sys/fs/cgroup" --cgroups_limit_swap="false" --cgroups_root="mesos" --container_disk_watch_interval="15secs"
--containerizers="mesos" --credential="/tmp/Endpoint_SlaveEndpointTest_NoAuthorizer_1_vNE9rT/credential"
--default_role="*" --disk_watch_interval="1mins" --docker="docker" --docker_kill_orphans="true"
--docker_registry="https://registry-1.docker.io" --docker_remove_delay="6hrs" --docker_socket="/var/run/docker.sock"
--docker_stop_timeout="0ns" --docker_store_dir="/tmp/Endpoint_SlaveEndpointTest_NoAuthorizer_1_vNE9rT/store/docker"
--docker_volume_checkpoint_dir="/var/run/mesos/isolators/docker/volume" --enforce_container_disk_quota="false"
--executor_registration_timeout="1mins" --executor_reregistration_timeout="2secs" --executor_shutdown_grace_period="5secs"
--fetcher_cache_dir="/tmp/Endpoint_SlaveEndpointTest_NoAuthorizer_1_vNE9rT/fetch" --fetcher_cache_size="2GB"
--frameworks_home="" --gc_delay="1weeks" --gc_disk_headroom="0.1" --hadoop_home="" --help="false"
--hostname_lookup="true" --http_command_executor="false" --http_credentials="/tmp/Endpoint_SlaveEndpointTest_NoAuthorizer_1_vNE9rT/http_credentials"
--http_heartbeat_interval="30secs" --initialize_driver_logging="true" --isolation="posix/cpu,posix/mem"
--launcher="posix" --launcher_dir="/mesos/mesos-1.4.0/_build/src" --logbufsecs="0" --logging_level="INFO"
--max_completed_executors_per_framework="150" --oversubscribed_resources_interval="15secs"
--perf_duration="10secs" --perf_interval="1mins" --port="5051" --qos_correction_interval_min="0ns"
--quiet="false" --recover="reconnect" --recovery_timeout="15mins" --registration_backoff_factor="10ms"
--resources="cpus:2;gpus:0;mem:1024;disk:1024;ports:[31000-32000]" --revocable_cpu_low_priority="true"
--runtime_dir="/tmp/Endpoint_SlaveEndpointTest_NoAuthorizer_1_vNE9rT" --sandbox_directory="/mnt/mesos/sandbox"
--strict="true" --switch_user="true" --systemd_enable_support="true" --systemd_runtime_directory="/run/systemd/system"
--version="false" --work_dir="/tmp/Endpoint_SlaveEndpointTest_NoAuthorizer_1_jZV7jv"
I0811 11:36:12.401363  5191 credentials.hpp:86] Loading credential for authentication from
'/tmp/Endpoint_SlaveEndpointTest_NoAuthorizer_1_vNE9rT/credential'
I0811 11:36:12.401569  5191 slave.cpp:283] Agent using credential for: test-principal
I0811 11:36:12.401599  5191 credentials.hpp:37] Loading credentials for authentication from
'/tmp/Endpoint_SlaveEndpointTest_NoAuthorizer_1_vNE9rT/http_credentials'
I0811 11:36:12.401852  5191 http.cpp:1026] Creating default 'basic' HTTP authenticator for
realm 'mesos-agent-readonly'
I0811 11:36:12.402065  5191 http.cpp:1026] Creating default 'basic' HTTP authenticator for
realm 'mesos-agent-readwrite'
I0811 11:36:12.403610  5191 slave.cpp:565] Agent resources: [{"name":"cpus","scalar":{"value":2.0},"type":"SCALAR"},{"name":"mem","scalar":{"value":1024.0},"type":"SCALAR"},{"name":"disk","scalar":{"value":1024.0},"type":"SCALAR"},{"name":"ports","ranges":{"range":[{"begin":31000,"end":32000}]},"type":"RANGES"}]
I0811 11:36:12.403867  5191 slave.cpp:573] Agent attributes: [  ]
I0811 11:36:12.403882  5191 slave.cpp:582] Agent hostname: a0fdaf75194e
I0811 11:36:12.404273  5194 status_update_manager.cpp:177] Pausing sending status updates
I0811 11:36:12.416563  5192 state.cpp:64] Recovering state from '/tmp/Endpoint_SlaveEndpointTest_NoAuthorizer_1_jZV7jv/meta'
I0811 11:36:12.424923  5190 status_update_manager.cpp:203] Recovering status update manager
I0811 11:36:12.425292  5190 containerizer.cpp:598] Recovering containerizer
I0811 11:36:12.427181  5195 provisioner.cpp:416] Provisioner recovery complete
I0811 11:36:12.427809  5193 slave.cpp:6210] Finished recovery
I0811 11:36:12.428382  5193 slave.cpp:6392] Querying resource estimator for oversubscribable
resources
I0811 11:36:12.429126  5194 slave.cpp:6406] Received oversubscribable resources {} from the
resource estimator
I0811 11:36:12.433296  5189 process.cpp:3933] Handling HTTP event for process 'slave(804)'
with path: '/slave(804)/monitor/statistics.json'
I0811 11:36:12.440134  5196 http.cpp:1166] HTTP GET for /slave(804)/monitor/statistics.json
from 172.17.0.4:38122
I0811 11:36:12.440234  5196 http.cpp:957] Authorizing principal 'test-principal' to GET the
'/monitor/statistics.json' endpoint
I0811 11:36:12.444972  5170 slave.cpp:843] Agent terminating
[       OK ] Endpoint/SlaveEndpointTest.NoAuthorizer/1 (86 ms)
[ RUN      ] Endpoint/SlaveEndpointTest.NoAuthorizer/2
I0811 11:36:12.482925  5170 containerizer.cpp:246] Using isolation: posix/cpu,posix/mem,filesystem/posix,network/cni,environment_secret
W0811 11:36:12.483558  5170 backend.cpp:76] Failed to create 'aufs' backend: AufsBackend requires
root privileges
W0811 11:36:12.483810  5170 backend.cpp:76] Failed to create 'bind' backend: BindBackend requires
root privileges
I0811 11:36:12.483860  5170 provisioner.cpp:255] Using default backend 'copy'
I0811 11:36:12.486768  5170 cluster.cpp:448] Creating default 'local' authorizer
I0811 11:36:12.489091  5194 slave.cpp:250] Mesos agent started on (805)@172.17.0.4:33738
I0811 11:36:12.489118  5194 slave.cpp:251] Flags at startup: --acls="" --appc_simple_discovery_uri_prefix="http://"
--appc_store_dir="/tmp/Endpoint_SlaveEndpointTest_NoAuthorizer_2_VdDfOs/store/appc" --authenticate_http_readonly="true"
--authenticate_http_readwrite="true" --authenticatee="crammd5" --authentication_backoff_factor="1secs"
--authorizer="local" --cgroups_cpu_enable_pids_and_tids_count="false" --cgroups_enable_cfs="false"
--cgroups_hierarchy="/sys/fs/cgroup" --cgroups_limit_swap="false" --cgroups_root="mesos" --container_disk_watch_interval="15secs"
--containerizers="mesos" --credential="/tmp/Endpoint_SlaveEndpointTest_NoAuthorizer_2_VdDfOs/credential"
--default_role="*" --disk_watch_interval="1mins" --docker="docker" --docker_kill_orphans="true"
--docker_registry="https://registry-1.docker.io" --docker_remove_delay="6hrs" --docker_socket="/var/run/docker.sock"
--docker_stop_timeout="0ns" --docker_store_dir="/tmp/Endpoint_SlaveEndpointTest_NoAuthorizer_2_VdDfOs/store/docker"
--docker_volume_checkpoint_dir="/var/run/mesos/isolators/docker/volume" --enforce_container_disk_quota="false"
--executor_registration_timeout="1mins" --executor_reregistration_timeout="2secs" --executor_shutdown_grace_period="5secs"
--fetcher_cache_dir="/tmp/Endpoint_SlaveEndpointTest_NoAuthorizer_2_VdDfOs/fetch" --fetcher_cache_size="2GB"
--frameworks_home="" --gc_delay="1weeks" --gc_disk_headroom="0.1" --hadoop_home="" --help="false"
--hostname_lookup="true" --http_command_executor="false" --http_credentials="/tmp/Endpoint_SlaveEndpointTest_NoAuthorizer_2_VdDfOs/http_credentials"
--http_heartbeat_interval="30secs" --initialize_driver_logging="true" --isolation="posix/cpu,posix/mem"
--launcher="posix" --launcher_dir="/mesos/mesos-1.4.0/_build/src" --logbufsecs="0" --logging_level="INFO"
--max_completed_executors_per_framework="150" --oversubscribed_resources_interval="15secs"
--perf_duration="10secs" --perf_interval="1mins" --port="5051" --qos_correction_interval_min="0ns"
--quiet="false" --recover="reconnect" --recovery_timeout="15mins" --registration_backoff_factor="10ms"
--resources="cpus:2;gpus:0;mem:1024;disk:1024;ports:[31000-32000]" --revocable_cpu_low_priority="true"
--runtime_dir="/tmp/Endpoint_SlaveEndpointTest_NoAuthorizer_2_VdDfOs" --sandbox_directory="/mnt/mesos/sandbox"
--strict="true" --switch_user="true" --systemd_enable_support="true" --systemd_runtime_directory="/run/systemd/system"
--version="false" --work_dir="/tmp/Endpoint_SlaveEndpointTest_NoAuthorizer_2_J2JRq4"
I0811 11:36:12.489513  5194 credentials.hpp:86] Loading credential for authentication from
'/tmp/Endpoint_SlaveEndpointTest_NoAuthorizer_2_VdDfOs/credential'
I0811 11:36:12.489708  5194 slave.cpp:283] Agent using credential for: test-principal
I0811 11:36:12.489730  5194 credentials.hpp:37] Loading credentials for authentication from
'/tmp/Endpoint_SlaveEndpointTest_NoAuthorizer_2_VdDfOs/http_credentials'
I0811 11:36:12.490000  5194 http.cpp:1026] Creating default 'basic' HTTP authenticator for
realm 'mesos-agent-readonly'
I0811 11:36:12.490195  5194 http.cpp:1026] Creating default 'basic' HTTP authenticator for
realm 'mesos-agent-readwrite'
I0811 11:36:12.496574  5194 slave.cpp:565] Agent resources: [{"name":"cpus","scalar":{"value":2.0},"type":"SCALAR"},{"name":"mem","scalar":{"value":1024.0},"type":"SCALAR"},{"name":"disk","scalar":{"value":1024.0},"type":"SCALAR"},{"name":"ports","ranges":{"range":[{"begin":31000,"end":32000}]},"type":"RANGES"}]
I0811 11:36:12.497328  5194 slave.cpp:573] Agent attributes: [  ]
I0811 11:36:12.497993  5194 slave.cpp:582] Agent hostname: a0fdaf75194e
I0811 11:36:12.498395  5196 status_update_manager.cpp:177] Pausing sending status updates
I0811 11:36:12.501021  5196 state.cpp:64] Recovering state from '/tmp/Endpoint_SlaveEndpointTest_NoAuthorizer_2_J2JRq4/meta'
I0811 11:36:12.511005  5191 status_update_manager.cpp:203] Recovering status update manager
I0811 11:36:12.511333  5191 containerizer.cpp:598] Recovering containerizer
I0811 11:36:12.513664  5195 provisioner.cpp:416] Provisioner recovery complete
I0811 11:36:12.514310  5195 slave.cpp:6210] Finished recovery
I0811 11:36:12.515120  5195 slave.cpp:6392] Querying resource estimator for oversubscribable
resources
I0811 11:36:12.515514  5192 slave.cpp:6406] Received oversubscribable resources {} from the
resource estimator
I0811 11:36:12.519950  5192 process.cpp:3933] Handling HTTP event for process 'slave(805)'
with path: '/slave(805)/containers'
I0811 11:36:12.522230  5194 http.cpp:1166] HTTP GET for /slave(805)/containers from 172.17.0.4:38124
I0811 11:36:12.522357  5194 http.cpp:957] Authorizing principal 'test-principal' to GET the
'/containers' endpoint
I0811 11:36:12.534816  5195 slave.cpp:843] Agent terminating
[       OK ] Endpoint/SlaveEndpointTest.NoAuthorizer/2 (92 ms)
[----------] 9 tests from Endpoint/SlaveEndpointTest (864 ms total)

[----------] 2 tests from ContainerizerType/DefaultContainerDNSFlagTest
[ RUN      ] ContainerizerType/DefaultContainerDNSFlagTest.ValidateFlag/0
[       OK ] ContainerizerType/DefaultContainerDNSFlagTest.ValidateFlag/0 (14 ms)
[ RUN      ] ContainerizerType/DefaultContainerDNSFlagTest.ValidateFlag/1
[       OK ] ContainerizerType/DefaultContainerDNSFlagTest.ValidateFlag/1 (11 ms)
[----------] 2 tests from ContainerizerType/DefaultContainerDNSFlagTest (25 ms total)

[----------] Global test environment tear-down
[==========] 1655 tests from 182 test cases ran. (799064 ms total)
[  PASSED  ] 1650 tests.
[  FAILED  ] 5 tests, listed below:
[  FAILED  ] DefaultExecutorCheckTest.CommandCheckDeliveredAndReconciled
[  FAILED  ] DefaultExecutorCheckTest.CommandCheckStatusChange
[  FAILED  ] DefaultExecutorCheckTest.CommandCheckSeesParentsEnv
[  FAILED  ] DefaultExecutorCheckTest.CommandCheckSharesWorkDirWithTask
[  FAILED  ] ContentType/AgentAPIStreamingTest.AttachInputToNestedContainerSession/0, where
GetParam() = application/x-protobuf

 5 FAILED TESTS
  YOU HAVE 20 DISABLED TESTS

I0811 11:36:12.650663  5197 process.cpp:1072] Failed to accept socket: future discarded
make[4]: *** [check-local] Error 1
make[4]: Leaving directory `/mesos/mesos-1.4.0/_build/src'
make[3]: *** [check-am] Error 2
make[3]: Leaving directory `/mesos/mesos-1.4.0/_build/src'
make[2]: *** [check] Error 2
make[2]: Leaving directory `/mesos/mesos-1.4.0/_build/src'
make[1]: *** [check-recursive] Error 1
make[1]: Leaving directory `/mesos/mesos-1.4.0/_build'
make: *** [distcheck] Error 1
+ docker rmi mesos-1502444397-17254
Untagged: mesos-1502444397-17254:latest
Deleted: sha256:da718af5ef541171616db58a99a8a06f2d231953fb78a107d836769942f735e4
Deleted: sha256:43dde091f072537b1686e9c699572100d07d3f3fb79918f59a8f767e6004f74d
Deleted: sha256:04d60fbbda3cc97ec62be941d356a1a4cde0485480d15f971ab8c2b3ad97c896
Deleted: sha256:e5bbe91bbba691de5124eada91c11d6d379b4473821fb812152131273210b5b3
Deleted: sha256:67854a9ad7067c531f7b956a1ff7d2037c702e93f174ec32f0a6370c4417a216
Deleted: sha256:8ba2b115e31f7648e22e8e3649aa785e3cb7a2b63c61e74856a16516301c6770
Deleted: sha256:35c0ec679919d6adb33cd50220d5fd6264bc2a783212ed851276cbe6d7df1d10
Deleted: sha256:c0d0da3adafcf5a2a3b50ade9a5de5decfc2918e0fde963a9dc05a1b606e096f
Deleted: sha256:b8cdba4d9438677fae71d8035dc8c14cc0709c9826e875c612d7d0daa3634123
Deleted: sha256:b8fe6fb2fc112c62841700cec20d180e603deae452e5033e480ccb3eaab49ed8
Deleted: sha256:2fcdc6f39c18b85f72fb6c65ba8f4c0c20f21432c26ada13502a4418e0b6b134
Deleted: sha256:aa4cff954fd88bba6980992e4bf8d07eabd6281458be76e2c438033487ecf381
Deleted: sha256:abe4e5c2965524b487fd6332a2162345d025367671528aa9119a105a41a2a4c5
Deleted: sha256:57ab471e7c3c4d99d5b4ba5918f3689cf25ba1bed5535e9ee9bc99f2f2279287
Deleted: sha256:5374304fd252f3e1e8c187bd8952d240ba4c3e23db833626ba1bbf7a77f66d32
Deleted: sha256:1dd8b0c1d533711a27337ff5141ebbac5f65c49fa6902d9adb9d02fc8e874425
Deleted: sha256:5b1e9405943fb4c702c4f4a4d3522836b80bd131706eac5b47bde7caf1e7319b
Deleted: sha256:0ae45b2eb1bac6bb4fa67c2ffe0bac22d806bc1f3eeef053475c0554a114a430
Deleted: sha256:87edfdf490f80e6be4d519ff61aa0e4a8a7934e5c59a2d5481b8a1e4cca07c18
Deleted: sha256:a8402bfbc3b7092755a3ec2817c2dd03fd3012b4c83600258c8a9b30cb232370
Deleted: sha256:cc0c8c5f65afde2a4f44e949da07c9fa41b566a002dd8d2a81b5ee7323a8439b
Deleted: sha256:9daf42f5c8a6bfde4057850eb82984aa5dbc2026ef5097dea9e616a2af976610
Deleted: sha256:767e4c5b17ed049192f23af132db1b86d5a440fce523deb823051a760ab939a0
Deleted: sha256:de54f0f5a1f5835be16e3fe1131a57a40df8defbe935bddc9051e8c5b1069965
Build step 'Execute shell' marked build as failure
Not sending mail to unregistered user yujie.jay@gmail.com

Mime
View raw message