mesos-builds mailing list archives

Site index · List index
Message view « Date » · « Thread »
Top « Date » · « Thread »
From Apache Jenkins Server <jenk...@builds.apache.org>
Subject Build failed in Jenkins: Mesos-Reviewbot #18994
Date Wed, 23 Aug 2017 15:18:15 GMT
See <https://builds.apache.org/job/Mesos-Reviewbot/18994/display/redirect>

------------------------------------------
[...truncated 2.11 MB...]
as: BFD (GNU Binutils for Ubuntu) 2.24 assertion fail ../../bfd/elf.c:2636
as: BFD (GNU Binutils for Ubuntu) 2.24 assertion fail ../../bfd/elf.c:2636
as: BFD (GNU Binutils for Ubuntu) 2.24 assertion fail ../../bfd/elf.c:2636
as: BFD (GNU Binutils for Ubuntu) 2.24 assertion fail ../../bfd/elf.c:2636
as: BFD (GNU Binutils for Ubuntu) 2.24 assertion fail ../../bfd/elf.c:2636
as: BFD (GNU Binutils for Ubuntu) 2.24 assertion fail ../../bfd/elf.c:2636
as: BFD (GNU Binutils for Ubuntu) 2.24 assertion fail ../../bfd/elf.c:2636
as: BFD (GNU Binutils for Ubuntu) 2.24 assertion fail ../../bfd/elf.c:2636
as: BFD (GNU Binutils for Ubuntu) 2.24 assertion fail ../../bfd/elf.c:2636
as: BFD (GNU Binutils for Ubuntu) 2.24 assertion fail ../../bfd/elf.c:2636
as: BFD (GNU Binutils for Ubuntu) 2.24 assertion fail ../../bfd/elf.c:2636
as: BFD (GNU Binutils for Ubuntu) 2.24 assertion fail ../../bfd/elf.c:2636
as: BFD (GNU Binutils for Ubuntu) 2.24 assertion fail ../../bfd/elf.c:2636
as: BFD (GNU Binutils for Ubuntu) 2.24 assertion fail ../../bfd/elf.c:2636
as: BFD (GNU Binutils for Ubuntu) 2.24 assertion fail ../../bfd/elf.c:2636
as: BFD (GNU Binutils for Ubuntu) 2.24 assertion fail ../../bfd/elf.c:2636
as: BFD (GNU Binutils for Ubuntu) 2.24 assertion fail ../../bfd/elf.c:2636
as: BFD (GNU Binutils for Ubuntu) 2.24 assertion fail ../../bfd/elf.c:2636
as: BFD (GNU Binutils for Ubuntu) 2.24 assertion fail ../../bfd/elf.c:2636
as: BFD (GNU Binutils for Ubuntu) 2.24 assertion fail ../../bfd/elf.c:2636
as: BFD (GNU Binutils for Ubuntu) 2.24 assertion fail ../../bfd/elf.c:2636
as: BFD (GNU Binutils for Ubuntu) 2.24 assertion fail ../../bfd/elf.c:2636
as: BFD (GNU Binutils for Ubuntu) 2.24 assertion fail ../../bfd/elf.c:2636
as: BFD (GNU Binutils for Ubuntu) 2.24 assertion fail ../../bfd/elf.c:2636
as: BFD (GNU Binutils for Ubuntu) 2.24 assertion fail ../../bfd/elf.c:2636
as: BFD (GNU Binutils for Ubuntu) 2.24 assertion fail ../../bfd/elf.c:2636
as: BFD (GNU Binutils for Ubuntu) 2.24 assertion fail ../../bfd/elf.c:2636
as: BFD (GNU Binutils for Ubuntu) 2.24 assertion fail ../../bfd/elf.c:2636
as: BFD (GNU Binutils for Ubuntu) 2.24 assertion fail ../../bfd/elf.c:2636
as: BFD (GNU Binutils for Ubuntu) 2.24 assertion fail ../../bfd/elf.c:2636
as: BFD (GNU Binutils for Ubuntu) 2.24 assertion fail ../../bfd/elf.c:2636
as: BFD (GNU Binutils for Ubuntu) 2.24 assertion fail ../../bfd/elf.c:2636
as: BFD (GNU Binutils for Ubuntu) 2.24 assertion fail ../../bfd/elf.c:2636
as: BFD (GNU Binutils for Ubuntu) 2.24 assertion fail ../../bfd/elf.c:2636
as: BFD (GNU Binutils for Ubuntu) 2.24 assertion fail ../../bfd/elf.c:2636
as: BFD (GNU Binutils for Ubuntu) 2.24 assertion fail ../../bfd/elf.c:2636
as: BFD (GNU Binutils for Ubuntu) 2.24 assertion fail ../../bfd/elf.c:2636
as: BFD (GNU Binutils for Ubuntu) 2.24 assertion fail ../../bfd/elf.c:2636
as: BFD (GNU Binutils for Ubuntu) 2.24 assertion fail ../../bfd/elf.c:2636
as: BFD (GNU Binutils for Ubuntu) 2.24 assertion fail ../../bfd/elf.c:2636
as: BFD (GNU Binutils for Ubuntu) 2.24 assertion fail ../../bfd/elf.c:2636
as: BFD (GNU Binutils for Ubuntu) 2.24 assertion fail ../../bfd/elf.c:2636
as: BFD (GNU Binutils for Ubuntu) 2.24 assertion fail ../../bfd/elf.c:2636
as: BFD (GNU Binutils for Ubuntu) 2.24 assertion fail ../../bfd/elf.c:2636
as: BFD (GNU Binutils for Ubuntu) 2.24 assertion fail ../../bfd/elf.c:2636
as: BFD (GNU Binutils for Ubuntu) 2.24 assertion fail ../../bfd/elf.c:2636
as: BFD (GNU Binutils for Ubuntu) 2.24 assertion fail ../../bfd/elf.c:2636
as: BFD (GNU Binutils for Ubuntu) 2.24 assertion fail ../../bfd/elf.c:2636
as: BFD (GNU Binutils for Ubuntu) 2.24 assertion fail ../../bfd/elf.c:2636
as: BFD (GNU Binutils for Ubuntu) 2.24 assertion fail ../../bfd/elf.c:2636
as: BFD (GNU Binutils for Ubuntu) 2.24 assertion fail ../../bfd/elf.c:2636
as: BFD (GNU Binutils for Ubuntu) 2.24 assertion fail ../../bfd/elf.c:2636
as: BFD (GNU Binutils for Ubuntu) 2.24 assertion fail ../../bfd/elf.c:2636
as: BFD (GNU Binutils for Ubuntu) 2.24 assertion fail ../../bfd/elf.c:2636
as: BFD (GNU Binutils for Ubuntu) 2.24 assertion fail ../../bfd/elf.c:2636
as: BFD (GNU Binutils for Ubuntu) 2.24 assertion fail ../../bfd/elf.c:2636
as: BFD (GNU Binutils for Ubuntu) 2.24 assertion fail ../../bfd/elf.c:2636
as: BFD (GNU Binutils for Ubuntu) 2.24 assertion fail ../../bfd/elf.c:2636
as: BFD (GNU Binutils for Ubuntu) 2.24 assertion fail ../../bfd/elf.c:2636
as: BFD (GNU Binutils for Ubuntu) 2.24 assertion fail ../../bfd/elf.c:2636
as: BFD (GNU Binutils for Ubuntu) 2.24 assertion fail ../../bfd/elf.c:2636
as: BFD (GNU Binutils for Ubuntu) 2.24 assertion fail ../../bfd/elf.c:2636
as: BFD (GNU Binutils for Ubuntu) 2.24 assertion fail ../../bfd/elf.c:2636
as: BFD (GNU Binutils for Ubuntu) 2.24 assertion fail ../../bfd/elf.c:2636
as: BFD (GNU Binutils for Ubuntu) 2.24 assertion fail ../../bfd/elf.c:2636
as: BFD (GNU Binutils for Ubuntu) 2.24 assertion fail ../../bfd/elf.c:2636
as: BFD (GNU Binutils for Ubuntu) 2.24 assertion fail ../../bfd/elf.c:2636
as: BFD (GNU Binutils for Ubuntu) 2.24 assertion fail ../../bfd/elf.c:2636
as: BFD (GNU Binutils for Ubuntu) 2.24 assertion fail ../../bfd/elf.c:2636
as: BFD (GNU Binutils for Ubuntu) 2.24 assertion fail ../../bfd/elf.c:2636
as: BFD (GNU Binutils for Ubuntu) 2.24 assertion fail ../../bfd/elf.c:2636
as: BFD (GNU Binutils for Ubuntu) 2.24 assertion fail ../../bfd/elf.c:2636
as: BFD (GNU Binutils for Ubuntu) 2.24 assertion fail ../../bfd/elf.c:2636
as: BFD (GNU Binutils for Ubuntu) 2.24 assertion fail ../../bfd/elf.c:2636
as: BFD (GNU Binutils for Ubuntu) 2.24 assertion fail ../../bfd/elf.c:2636
as: BFD (GNU Binutils for Ubuntu) 2.24 assertion fail ../../bfd/elf.c:2636
as: BFD (GNU Binutils for Ubuntu) 2.24 assertion fail ../../bfd/elf.c:2636
as: BFD (GNU Binutils for Ubuntu) 2.24 assertion fail ../../bfd/elf.c:2636
as: BFD (GNU Binutils for Ubuntu) 2.24 assertion fail ../../bfd/elf.c:2636
as: BFD (GNU Binutils for Ubuntu) 2.24 assertion fail ../../bfd/elf.c:2636
as: BFD (GNU Binutils for Ubuntu) 2.24 assertion fail ../../bfd/elf.c:2636
as: BFD (GNU Binutils for Ubuntu) 2.24 assertion fail ../../bfd/elf.c:2636
as: BFD (GNU Binutils for Ubuntu) 2.24 assertion fail ../../bfd/elf.c:2636
as: BFD (GNU Binutils for Ubuntu) 2.24 assertion fail ../../bfd/elf.c:2636
as: BFD (GNU Binutils for Ubuntu) 2.24 assertion fail ../../bfd/elf.c:2636
as: BFD (GNU Binutils for Ubuntu) 2.24 assertion fail ../../bfd/elf.c:2636
as: BFD (GNU Binutils for Ubuntu) 2.24 assertion fail ../../bfd/elf.c:2636
as: BFD (GNU Binutils for Ubuntu) 2.24 assertion fail ../../bfd/elf.c:2636
as: BFD (GNU Binutils for Ubuntu) 2.24 assertion fail ../../bfd/elf.c:2636
as: BFD (GNU Binutils for Ubuntu) 2.24 assertion fail ../../bfd/elf.c:2636
as: BFD (GNU Binutils for Ubuntu) 2.24 assertion fail ../../bfd/elf.c:2636
as: BFD (GNU Binutils for Ubuntu) 2.24 assertion fail ../../bfd/elf.c:2636
as: BFD (GNU Binutils for Ubuntu) 2.24 assertion fail ../../bfd/elf.c:2636
as: BFD (GNU Binutils for Ubuntu) 2.24 assertion fail ../../bfd/elf.c:2636
as: BFD (GNU Binutils for Ubuntu) 2.24 assertion fail ../../bfd/elf.c:2636
as: BFD (GNU Binutils for Ubuntu) 2.24 assertion fail ../../bfd/elf.c:2636
as: BFD (GNU Binutils for Ubuntu) 2.24 assertion fail ../../bfd/elf.c:2636
as: BFD (GNU Binutils for Ubuntu) 2.24 assertion fail ../../bfd/elf.c:2636
as: BFD (GNU Binutils for Ubuntu) 2.24 assertion fail ../../bfd/elf.c:2636
as: BFD (GNU Binutils for Ubuntu) 2.24 assertion fail ../../bfd/elf.c:2636
as: BFD (GNU Binutils for Ubuntu) 2.24 assertion fail ../../bfd/elf.c:2636
as: BFD (GNU Binutils for Ubuntu) 2.24 assertion fail ../../bfd/elf.c:2636
as: BFD (GNU Binutils for Ubuntu) 2.24 assertion fail ../../bfd/elf.c:2636
as: BFD (GNU Binutils for Ubuntu) 2.24 assertion fail ../../bfd/elf.c:2636
as: BFD (GNU Binutils for Ubuntu) 2.24 assertion fail ../../bfd/elf.c:2636
as: BFD (GNU Binutils for Ubuntu) 2.24 assertion fail ../../bfd/elf.c:2636
as: BFD (GNU Binutils for Ubuntu) 2.24 assertion fail ../../bfd/elf.c:2636
as: BFD (GNU Binutils for Ubuntu) 2.24 assertion fail ../../bfd/elf.c:2636
as: BFD (GNU Binutils for Ubuntu) 2.24 assertion fail ../../bfd/elf.c:2636
as: BFD (GNU Binutils for Ubuntu) 2.24 assertion fail ../../bfd/elf.c:2636
as: BFD (GNU Binutils for Ubuntu) 2.24 assertion fail ../../bfd/elf.c:2636
as: BFD (GNU Binutils for Ubuntu) 2.24 assertion fail ../../bfd/elf.c:2636
as: BFD (GNU Binutils for Ubuntu) 2.24 assertion fail ../../bfd/elf.c:2636
as: BFD (GNU Binutils for Ubuntu) 2.24 assertion fail ../../bfd/elf.c:2636
as: BFD (GNU Binutils for Ubuntu) 2.24 assertion fail ../../bfd/elf.c:2636
as: BFD (GNU Binutils for Ubuntu) 2.24 assertion fail ../../bfd/elf.c:2636
as: BFD (GNU Binutils for Ubuntu) 2.24 assertion fail ../../bfd/elf.c:2636
as: BFD (GNU Binutils for Ubuntu) 2.24 assertion fail ../../bfd/elf.c:2636
as: BFD (GNU Binutils for Ubuntu) 2.24 assertion fail ../../bfd/elf.c:2636
as: BFD (GNU Binutils for Ubuntu) 2.24 assertion fail ../../bfd/elf.c:2636
as: BFD (GNU Binutils for Ubuntu) 2.24 assertion fail ../../bfd/elf.c:2636
as: BFD (GNU Binutils for Ubuntu) 2.24 assertion fail ../../bfd/elf.c:2636
as: BFD (GNU Binutils for Ubuntu) 2.24 assertion fail ../../bfd/elf.c:2636
as: BFD (GNU Binutils for Ubuntu) 2.24 assertion fail ../../bfd/elf.c:2636
as: BFD (GNU Binutils for Ubuntu) 2.24 assertion fail ../../bfd/elf.c:2636
as: BFD (GNU Binutils for Ubuntu) 2.24 assertion fail ../../bfd/elf.c:2636
as: BFD (GNU Binutils for Ubuntu) 2.24 assertion fail ../../bfd/elf.c:2636
as: BFD (GNU Binutils for Ubuntu) 2.24 assertion fail ../../bfd/elf.c:2636
as: BFD (GNU Binutils for Ubuntu) 2.24 assertion fail ../../bfd/elf.c:2636
as: BFD (GNU Binutils for Ubuntu) 2.24 assertion fail ../../bfd/elf.c:2636
as: BFD (GNU Binutils for Ubuntu) 2.24 assertion fail ../../bfd/elf.c:2636
as: BFD (GNU Binutils for Ubuntu) 2.24 assertion fail ../../bfd/elf.c:2636
as: BFD (GNU Binutils for Ubuntu) 2.24 assertion fail ../../bfd/elf.c:2636
as: BFD (GNU Binutils for Ubuntu) 2.24 assertion fail ../../bfd/elf.c:2636
as: BFD (GNU Binutils for Ubuntu) 2.24 assertion fail ../../bfd/elf.c:2636
as: BFD (GNU Binutils for Ubuntu) 2.24 assertion fail ../../bfd/elf.c:2636
as: BFD (GNU Binutils for Ubuntu) 2.24 assertion fail ../../bfd/elf.c:2636
as: BFD (GNU Binutils for Ubuntu) 2.24 assertion fail ../../bfd/elf.c:2636
as: BFD (GNU Binutils for Ubuntu) 2.24 assertion fail ../../bfd/elf.c:2636
as: BFD (GNU Binutils for Ubuntu) 2.24 assertion fail ../../bfd/elf.c:2636
as: BFD (GNU Binutils for Ubuntu) 2.24 assertion fail ../../bfd/elf.c:2636
as: BFD (GNU Binutils for Ubuntu) 2.24 assertion fail ../../bfd/elf.c:2636
as: BFD (GNU Binutils for Ubuntu) 2.24 assertion fail ../../bfd/elf.c:2636
as: BFD (GNU Binutils for Ubuntu) 2.24 assertion fail ../../bfd/elf.c:2636
as: BFD (GNU Binutils for Ubuntu) 2.24 assertion fail ../../bfd/elf.c:2636
as: BFD (GNU Binutils for Ubuntu) 2.24 assertion fail ../../bfd/elf.c:2636
as: BFD (GNU Binutils for Ubuntu) 2.24 assertion fail ../../bfd/elf.c:2636
as: BFD (GNU Binutils for Ubuntu) 2.24 assertion fail ../../bfd/elf.c:2636
as: BFD (GNU Binutils for Ubuntu) 2.24 assertion fail ../../bfd/elf.c:2636
as: BFD (GNU Binutils for Ubuntu) 2.24 assertion fail ../../bfd/elf.c:2636
as: BFD (GNU Binutils for Ubuntu) 2.24 assertion fail ../../bfd/elf.c:2636
as: BFD (GNU Binutils for Ubuntu) 2.24 assertion fail ../../bfd/elf.c:2636
as: BFD (GNU Binutils for Ubuntu) 2.24 assertion fail ../../bfd/elf.c:2636
as: BFD (GNU Binutils for Ubuntu) 2.24 assertion fail ../../bfd/elf.c:2636
as: BFD (GNU Binutils for Ubuntu) 2.24 assertion fail ../../bfd/elf.c:2636
as: BFD (GNU Binutils for Ubuntu) 2.24 assertion fail ../../bfd/elf.c:2636
as: BFD (GNU Binutils for Ubuntu) 2.24 assertion fail ../../bfd/elf.c:2636
as: BFD (GNU Binutils for Ubuntu) 2.24 assertion fail ../../bfd/elf.c:2636
as: BFD (GNU Binutils for Ubuntu) 2.24 assertion fail ../../bfd/elf.c:2636
as: BFD (GNU Binutils for Ubuntu) 2.24 assertion fail ../../bfd/elf.c:2636
as: BFD (GNU Binutils for Ubuntu) 2.24 assertion fail ../../bfd/elf.c:2636
as: BFD (GNU Binutils for Ubuntu) 2.24 assertion fail ../../bfd/elf.c:2636
as: BFD (GNU Binutils for Ubuntu) 2.24 assertion fail ../../bfd/elf.c:2636
as: BFD (GNU Binutils for Ubuntu) 2.24 assertion fail ../../bfd/elf.c:2636
as: BFD (GNU Binutils for Ubuntu) 2.24 assertion fail ../../bfd/elf.c:2636
as: BFD (GNU Binutils for Ubuntu) 2.24 assertion fail ../../bfd/elf.c:2636
as: BFD (GNU Binutils for Ubuntu) 2.24 assertion fail ../../bfd/elf.c:2636
as: BFD (GNU Binutils for Ubuntu) 2.24 assertion fail ../../bfd/elf.c:2636
as: BFD (GNU Binutils for Ubuntu) 2.24 assertion fail ../../bfd/elf.c:2636
as: BFD (GNU Binutils for Ubuntu) 2.24 assertion fail ../../bfd/elf.c:2636
as: BFD (GNU Binutils for Ubuntu) 2.24 assertion fail ../../bfd/elf.c:2636
as: BFD (GNU Binutils for Ubuntu) 2.24 assertion fail ../../bfd/elf.c:2636
as: BFD (GNU Binutils for Ubuntu) 2.24 assertion fail ../../bfd/elf.c:2636
as: BFD (GNU Binutils for Ubuntu) 2.24 assertion fail ../../bfd/elf.c:2636
as: BFD (GNU Binutils for Ubuntu) 2.24 assertion fail ../../bfd/elf.c:2636
as: BFD (GNU Binutils for Ubuntu) 2.24 assertion fail ../../bfd/elf.c:2636
as: BFD (GNU Binutils for Ubuntu) 2.24 assertion fail ../../bfd/elf.c:2636
as: BFD (GNU Binutils for Ubuntu) 2.24 assertion fail ../../bfd/elf.c:2636
as: BFD (GNU Binutils for Ubuntu) 2.24 assertion fail ../../bfd/elf.c:2636
as: BFD (GNU Binutils for Ubuntu) 2.24 assertion fail ../../bfd/elf.c:2636
as: BFD (GNU Binutils for Ubuntu) 2.24 assertion fail ../../bfd/elf.c:2636
as: BFD (GNU Binutils for Ubuntu) 2.24 assertion fail ../../bfd/elf.c:2636
as: BFD (GNU Binutils for Ubuntu) 2.24 assertion fail ../../bfd/elf.c:2636
as: BFD (GNU Binutils for Ubuntu) 2.24 assertion fail ../../bfd/elf.c:2636
as: BFD (GNU Binutils for Ubuntu) 2.24 assertion fail ../../bfd/elf.c:2636
as: BFD (GNU Binutils for Ubuntu) 2.24 assertion fail ../../bfd/elf.c:2636
as: BFD (GNU Binutils for Ubuntu) 2.24 assertion fail ../../bfd/elf.c:2636
as: BFD (GNU Binutils for Ubuntu) 2.24 assertion fail ../../bfd/elf.c:2636
as: BFD (GNU Binutils for Ubuntu) 2.24 assertion fail ../../bfd/elf.c:2636
as: BFD (GNU Binutils for Ubuntu) 2.24 assertion fail ../../bfd/elf.c:2636
as: BFD (GNU Binutils for Ubuntu) 2.24 assertion fail ../../bfd/elf.c:2636
as: BFD (GNU Binutils for Ubuntu) 2.24 assertion fail ../../bfd/elf.c:2636
as: BFD (GNU Binutils for Ubuntu) 2.24 assertion fail ../../bfd/elf.c:2636
/tmp/ccr9tkor.s: Fatal error: can't close scheduler/.libs/libmesos_no_3rdparty_la-scheduler.o:
No space left on device
make[3]: *** [scheduler/libmesos_no_3rdparty_la-scheduler.lo] Error 1
make[3]: *** Waiting for unfinished jobs....
mv -f slave/qos_controllers/.deps/libmesos_no_3rdparty_la-noop.Tpo slave/qos_controllers/.deps/libmesos_no_3rdparty_la-noop.Plo
../../src/slave/metrics.cpp:250:1: fatal error: error writing to /tmp/ccZxARne.s: No space
left on device
 } // namespace mesos {
 ^
compilation terminated.
mv -f slave/.deps/libmesos_no_3rdparty_la-resource_estimator.Tpo slave/.deps/libmesos_no_3rdparty_la-resource_estimator.Plo
The bug is not reproducible, so it is likely a hardware or OS problem.
make[3]: *** [slave/libmesos_no_3rdparty_la-metrics.lo] Error 1
../../src/slave/http.cpp:3044:1: fatal error: error writing to /tmp/ccsmdvQz.s: No space left
on device
 } // namespace mesos {
 ^
compilation terminated.
../../src/slave/slave.cpp:8066:1: fatal error: error writing to /tmp/ccPlqdeF.s: No space
left on device
 } // namespace mesos {
 ^
compilation terminated.
The bug is not reproducible, so it is likely a hardware or OS problem.
make[3]: *** [slave/libmesos_no_3rdparty_la-http.lo] Error 1
The bug is not reproducible, so it is likely a hardware or OS problem.
make[3]: *** [slave/libmesos_no_3rdparty_la-slave.lo] Error 1
make[3]: Leaving directory `/mesos/mesos-1.5.0/_build/src'
make[2]: *** [all] Error 2
make[2]: Leaving directory `/mesos/mesos-1.5.0/_build/src'
make[1]: *** [all-recursive] Error 1
make[1]: Leaving directory `/mesos/mesos-1.5.0/_build'
make: *** [distcheck] Error 1
+ docker rmi mesos-1503498893-12233
Untagged: mesos-1503498893-12233:latest
Deleted: sha256:744afb24bc70e2d70459f898a3a89a5dd16e1c2653b6ee03298104801d7d0840
Deleted: sha256:1c259a2ff56e1e56d8eec986109881d1ede6895e9d0578045080bbed06ccfd8e
Deleted: sha256:23cb1fb537f62115a22c8e7c2daf36d6a84be7a65fd68a652e5064169600a456
Deleted: sha256:5807fc40c0636a6fc9b63c5499940b70d2c68cef653c442670807d5d2bde630e
Deleted: sha256:47f39d7c2bbd812f0d7df9c71f2a43f0885b619f9b7f84d99be97607faefafde
Deleted: sha256:4ee1b9f3d12ea5148c1a5959f99621410ca04cf6b7e4c702279cd08c789e8efd
Deleted: sha256:4ba3f4b869bcb30936df8cc22fcbc31b29fde056ca8e747846e0bf081da2fef3
Deleted: sha256:649f2eb9f4b72a7ba4c4586d0cfa5e52b02afdf3b59d2db7aab49895d9fdf9ec
Deleted: sha256:ef68c13fd065621ac77816fb65116f98fd13d8117590a7f390acc76eb03a1ddf
Deleted: sha256:3bb43fa501fc8c5f5d4dcac16e261144e0a6966c5ff846ffde399aeae70aae68
Deleted: sha256:8ad2edd146b84135f382e383eb0c00eeb7fad4a3e61173265b9064d5fe5d36c7
Deleted: sha256:83233b885a20be58159968c3e31e8da8658d3c07d3149be750653d89a4732593
Deleted: sha256:0a2f401be8252da240c33d6cfc2feba5b31e705e0738b0b747ad357b5b3e4a11
Deleted: sha256:34002045909e0081111374a838a757c847c876f7cd32eba879e1ce680d772958
Deleted: sha256:387283efa7ae4628ab11fe2042b4a166b281eca8c202db754566aa2011a50f76
Deleted: sha256:212b1e5328f03a65dec19eb22cdde4691c2dde7da3950d56bcb72a1d2c2e1435
Deleted: sha256:2911e5dd9c09f61c8c1ccdf30a6d307599420a82677db6760df49a527dd21098
Deleted: sha256:99a3b12aa12c73f4e44ba2c9a56bbcf0c0ed28d87b99fc17600c79e10700023d
Deleted: sha256:3cc7692fdf2d47617af50af7de02859a485e8148770a80cdbd9196dc8544c7a5
Deleted: sha256:4c5595c2c7178f0d7fdd7918c8ff2a2e28b241f22d47e6a338923168ca809af3
Deleted: sha256:ced7a089621e8ce46962c58bcb52606f95f5be0447fa72ccc54b74f713232d59
Deleted: sha256:7786cf44a562d42e496647b3c9326f670f70e2bab08f79579dfec500ff2163ac
Deleted: sha256:0e3df9358ed10a07012d6f11fa5278c51e56aa470fdd5671ab1d68996545f841
Deleted: sha256:dea9ac5e5435a7ee73057d2e07a30ebe1abb87e6bb0011ae6127e831c6382618
Build step 'Execute shell' marked build as failure

Mime
View raw message