mesos-builds mailing list archives

Site index · List index
Message view « Date » · « Thread »
Top « Date » · « Thread »
From Apache Jenkins Server <jenk...@builds.apache.org>
Subject Build failed in Jenkins: Mesos-Buildbot » autotools,gcc,--verbose,GLOG_v=1 MESOS_VERBOSE=1,centos:7,(ubuntu)&&(!ubuntu-us1)&&(!ubuntu-eu2) #4129
Date Fri, 18 Aug 2017 23:25:55 GMT
See <https://builds.apache.org/job/Mesos-Buildbot/BUILDTOOL=autotools,COMPILER=gcc,CONFIGURATION=--verbose,ENVIRONMENT=GLOG_v=1%20MESOS_VERBOSE=1,OS=centos%3A7,label_exp=(ubuntu)&&(!ubuntu-us1)&&(!ubuntu-eu2)/4129/display/redirect?page=changes>

Changes:

[Kapil Arya] Removed diacritics from docs/health-checks.md.

[Kapil Arya] Added secrets docs.

[Kapil Arya] Updated configuration.md to reflect new flags.

[Kapil Arya] Synchronized comment in v1 and unversioned master.proto.

[Kapil Arya] Fixed capitalization and typos in endpoint helps.

[Kapil Arya] Updated endpoints help docs.

[Kapil Arya] Removed WIP from CHANGELOG.

------------------------------------------
[...truncated 30.82 MB...]
I0818 23:25:47.208365  6603 slave.cpp:251] Flags at startup: --acls="" --appc_simple_discovery_uri_prefix="http://"
--appc_store_dir="/tmp/Endpoint_SlaveEndpointTest_AuthorizedRequest_2_5BT62s/store/appc" --authenticate_http_readonly="true"
--authenticate_http_readwrite="true" --authenticatee="crammd5" --authentication_backoff_factor="1secs"
--authorizer="local" --cgroups_cpu_enable_pids_and_tids_count="false" --cgroups_enable_cfs="false"
--cgroups_hierarchy="/sys/fs/cgroup" --cgroups_limit_swap="false" --cgroups_root="mesos" --container_disk_watch_interval="15secs"
--containerizers="mesos" --credential="/tmp/Endpoint_SlaveEndpointTest_AuthorizedRequest_2_5BT62s/credential"
--default_role="*" --disallow_sharing_agent_pid_namespace="false" --disk_watch_interval="1mins"
--docker="docker" --docker_kill_orphans="true" --docker_registry="https://registry-1.docker.io"
--docker_remove_delay="6hrs" --docker_socket="/var/run/docker.sock" --docker_stop_timeout="0ns"
--docker_store_dir="/tmp/Endpoint_SlaveEndpointTest_AuthorizedRequest_2_5BT62s/store/docker"
--docker_volume_checkpoint_dir="/var/run/mesos/isolators/docker/volume" --enforce_container_disk_quota="false"
--executor_registration_timeout="1mins" --executor_reregistration_timeout="2secs" --executor_shutdown_grace_period="5secs"
--fetcher_cache_dir="/tmp/Endpoint_SlaveEndpointTest_AuthorizedRequest_2_5BT62s/fetch" --fetcher_cache_size="2GB"
--frameworks_home="" --gc_delay="1weeks" --gc_disk_headroom="0.1" --hadoop_home="" --help="false"
--hostname_lookup="true" --http_command_executor="false" --http_credentials="/tmp/Endpoint_SlaveEndpointTest_AuthorizedRequest_2_5BT62s/http_credentials"
--http_heartbeat_interval="30secs" --initialize_driver_logging="true" --isolation="posix/cpu,posix/mem"
--launcher="posix" --launcher_dir="/mesos/mesos-1.4.0/_build/src" --logbufsecs="0" --logging_level="INFO"
--max_completed_executors_per_framework="150" --oversubscribed_resources_interval="15secs"
--perf_duration="10secs" --perf_interval="1mins" --port="5051" --qos_correction_interval_min="0ns"
--quiet="false" --recover="reconnect" --recovery_timeout="15mins" --registration_backoff_factor="10ms"
--resources="cpus:2;gpus:0;mem:1024;disk:1024;ports:[31000-32000]" --revocable_cpu_low_priority="true"
--runtime_dir="/tmp/Endpoint_SlaveEndpointTest_AuthorizedRequest_2_5BT62s" --sandbox_directory="/mnt/mesos/sandbox"
--strict="true" --switch_user="true" --systemd_enable_support="true" --systemd_runtime_directory="/run/systemd/system"
--version="false" --work_dir="/tmp/Endpoint_SlaveEndpointTest_AuthorizedRequest_2_9PXZwP"
I0818 23:25:47.208788  6603 credentials.hpp:86] Loading credential for authentication from
'/tmp/Endpoint_SlaveEndpointTest_AuthorizedRequest_2_5BT62s/credential'
I0818 23:25:47.208938  6603 slave.cpp:283] Agent using credential for: test-principal
I0818 23:25:47.208971  6603 credentials.hpp:37] Loading credentials for authentication from
'/tmp/Endpoint_SlaveEndpointTest_AuthorizedRequest_2_5BT62s/http_credentials'
I0818 23:25:47.209219  6603 http.cpp:1026] Creating default 'basic' HTTP authenticator for
realm 'mesos-agent-readonly'
I0818 23:25:47.209401  6603 http.cpp:1026] Creating default 'basic' HTTP authenticator for
realm 'mesos-agent-readwrite'
I0818 23:25:47.210758  6603 slave.cpp:565] Agent resources: [{"name":"cpus","scalar":{"value":2.0},"type":"SCALAR"},{"name":"mem","scalar":{"value":1024.0},"type":"SCALAR"},{"name":"disk","scalar":{"value":1024.0},"type":"SCALAR"},{"name":"ports","ranges":{"range":[{"begin":31000,"end":32000}]},"type":"RANGES"}]
I0818 23:25:47.210997  6603 slave.cpp:573] Agent attributes: [  ]
I0818 23:25:47.211021  6603 slave.cpp:582] Agent hostname: 68be7260bba1
I0818 23:25:47.211176  6608 status_update_manager.cpp:177] Pausing sending status updates
I0818 23:25:47.212471  6611 state.cpp:64] Recovering state from '/tmp/Endpoint_SlaveEndpointTest_AuthorizedRequest_2_9PXZwP/meta'
I0818 23:25:47.212962  6604 status_update_manager.cpp:203] Recovering status update manager
I0818 23:25:47.213227  6607 containerizer.cpp:609] Recovering containerizer
I0818 23:25:47.214478  6605 provisioner.cpp:416] Provisioner recovery complete
I0818 23:25:47.215044  6603 slave.cpp:6210] Finished recovery
I0818 23:25:47.215525  6603 slave.cpp:6392] Querying resource estimator for oversubscribable
resources
I0818 23:25:47.215823  6595 slave.cpp:6406] Received oversubscribable resources {} from the
resource estimator
I0818 23:25:47.218371  6610 process.cpp:3933] Handling HTTP event for process 'slave(796)'
with path: '/slave(796)/containers'
I0818 23:25:47.219795  6598 http.cpp:1166] HTTP GET for /slave(796)/containers from 172.17.0.11:47738
I0818 23:25:47.219918  6598 http.cpp:957] Authorizing principal 'test-principal' to GET the
'/containers' endpoint
I0818 23:25:47.224499  6605 slave.cpp:843] Agent terminating
[       OK ] Endpoint/SlaveEndpointTest.AuthorizedRequest/2 (34 ms)
[ RUN      ] Endpoint/SlaveEndpointTest.UnauthorizedRequest/0
I0818 23:25:47.236615  6570 containerizer.cpp:246] Using isolation: posix/cpu,posix/mem,filesystem/posix,network/cni,environment_secret
W0818 23:25:47.237128  6570 backend.cpp:76] Failed to create 'aufs' backend: AufsBackend requires
root privileges
W0818 23:25:47.237247  6570 backend.cpp:76] Failed to create 'bind' backend: BindBackend requires
root privileges
I0818 23:25:47.237280  6570 provisioner.cpp:255] Using default backend 'copy'
I0818 23:25:47.241158  6602 slave.cpp:250] Mesos agent started on (797)@172.17.0.11:42494
I0818 23:25:47.241183  6602 slave.cpp:251] Flags at startup: --acls="" --appc_simple_discovery_uri_prefix="http://"
--appc_store_dir="/tmp/Endpoint_SlaveEndpointTest_UnauthorizedRequest_0_xt4To1/store/appc"
--authenticate_http_readonly="true" --authenticate_http_readwrite="true" --authenticatee="crammd5"
--authentication_backoff_factor="1secs" --authorizer="local" --cgroups_cpu_enable_pids_and_tids_count="false"
--cgroups_enable_cfs="false" --cgroups_hierarchy="/sys/fs/cgroup" --cgroups_limit_swap="false"
--cgroups_root="mesos" --container_disk_watch_interval="15secs" --containerizers="mesos" --credential="/tmp/Endpoint_SlaveEndpointTest_UnauthorizedRequest_0_xt4To1/credential"
--default_role="*" --disallow_sharing_agent_pid_namespace="false" --disk_watch_interval="1mins"
--docker="docker" --docker_kill_orphans="true" --docker_registry="https://registry-1.docker.io"
--docker_remove_delay="6hrs" --docker_socket="/var/run/docker.sock" --docker_stop_timeout="0ns"
--docker_store_dir="/tmp/Endpoint_SlaveEndpointTest_UnauthorizedRequest_0_xt4To1/store/docker"
--docker_volume_checkpoint_dir="/var/run/mesos/isolators/docker/volume" --enforce_container_disk_quota="false"
--executor_registration_timeout="1mins" --executor_reregistration_timeout="2secs" --executor_shutdown_grace_period="5secs"
--fetcher_cache_dir="/tmp/Endpoint_SlaveEndpointTest_UnauthorizedRequest_0_xt4To1/fetch" --fetcher_cache_size="2GB"
--frameworks_home="" --gc_delay="1weeks" --gc_disk_headroom="0.1" --hadoop_home="" --help="false"
--hostname_lookup="true" --http_command_executor="false" --http_credentials="/tmp/Endpoint_SlaveEndpointTest_UnauthorizedRequest_0_xt4To1/http_credentials"
--http_heartbeat_interval="30secs" --initialize_driver_logging="true" --isolation="posix/cpu,posix/mem"
--launcher="posix" --launcher_dir="/mesos/mesos-1.4.0/_build/src" --logbufsecs="0" --logging_level="INFO"
--max_completed_executors_per_framework="150" --oversubscribed_resources_interval="15secs"
--perf_duration="10secs" --perf_interval="1mins" --port="5051" --qos_correction_interval_min="0ns"
--quiet="false" --recover="reconnect" --recovery_timeout="15mins" --registration_backoff_factor="10ms"
--resources="cpus:2;gpus:0;mem:1024;disk:1024;ports:[31000-32000]" --revocable_cpu_low_priority="true"
--runtime_dir="/tmp/Endpoint_SlaveEndpointTest_UnauthorizedRequest_0_xt4To1" --sandbox_directory="/mnt/mesos/sandbox"
--strict="true" --switch_user="true" --systemd_enable_support="true" --systemd_runtime_directory="/run/systemd/system"
--version="false" --work_dir="/tmp/Endpoint_SlaveEndpointTest_UnauthorizedRequest_0_RFtGNn"
I0818 23:25:47.241593  6602 credentials.hpp:86] Loading credential for authentication from
'/tmp/Endpoint_SlaveEndpointTest_UnauthorizedRequest_0_xt4To1/credential'
I0818 23:25:47.241750  6602 slave.cpp:283] Agent using credential for: test-principal
I0818 23:25:47.241775  6602 credentials.hpp:37] Loading credentials for authentication from
'/tmp/Endpoint_SlaveEndpointTest_UnauthorizedRequest_0_xt4To1/http_credentials'
I0818 23:25:47.242007  6602 http.cpp:1026] Creating default 'basic' HTTP authenticator for
realm 'mesos-agent-readonly'
I0818 23:25:47.242172  6602 http.cpp:1026] Creating default 'basic' HTTP authenticator for
realm 'mesos-agent-readwrite'
I0818 23:25:47.243659  6602 slave.cpp:565] Agent resources: [{"name":"cpus","scalar":{"value":2.0},"type":"SCALAR"},{"name":"mem","scalar":{"value":1024.0},"type":"SCALAR"},{"name":"disk","scalar":{"value":1024.0},"type":"SCALAR"},{"name":"ports","ranges":{"range":[{"begin":31000,"end":32000}]},"type":"RANGES"}]
I0818 23:25:47.243906  6602 slave.cpp:573] Agent attributes: [  ]
I0818 23:25:47.243927  6602 slave.cpp:582] Agent hostname: 68be7260bba1
I0818 23:25:47.244097  6591 status_update_manager.cpp:177] Pausing sending status updates
I0818 23:25:47.245679  6605 state.cpp:64] Recovering state from '/tmp/Endpoint_SlaveEndpointTest_UnauthorizedRequest_0_RFtGNn/meta'
I0818 23:25:47.246160  6604 status_update_manager.cpp:203] Recovering status update manager
I0818 23:25:47.246456  6610 containerizer.cpp:609] Recovering containerizer
I0818 23:25:47.247926  6611 provisioner.cpp:416] Provisioner recovery complete
I0818 23:25:47.248499  6602 slave.cpp:6210] Finished recovery
I0818 23:25:47.249145  6602 slave.cpp:6392] Querying resource estimator for oversubscribable
resources
I0818 23:25:47.249444  6607 slave.cpp:6406] Received oversubscribable resources {} from the
resource estimator
I0818 23:25:47.252164  6594 process.cpp:3933] Handling HTTP event for process 'slave(797)'
with path: '/slave(797)/monitor/statistics'
I0818 23:25:47.253655  6601 http.cpp:1166] HTTP GET for /slave(797)/monitor/statistics from
172.17.0.11:47742
I0818 23:25:47.253762  6601 http.cpp:957] Authorizing principal 'test-principal' to GET the
'/monitor/statistics' endpoint
I0818 23:25:47.256199  6590 slave.cpp:843] Agent terminating
[       OK ] Endpoint/SlaveEndpointTest.UnauthorizedRequest/0 (32 ms)
[ RUN      ] Endpoint/SlaveEndpointTest.UnauthorizedRequest/1
I0818 23:25:47.268784  6570 containerizer.cpp:246] Using isolation: posix/cpu,posix/mem,filesystem/posix,network/cni,environment_secret
W0818 23:25:47.269330  6570 backend.cpp:76] Failed to create 'aufs' backend: AufsBackend requires
root privileges
W0818 23:25:47.269448  6570 backend.cpp:76] Failed to create 'bind' backend: BindBackend requires
root privileges
I0818 23:25:47.269489  6570 provisioner.cpp:255] Using default backend 'copy'
I0818 23:25:47.273314  6598 slave.cpp:250] Mesos agent started on (798)@172.17.0.11:42494
I0818 23:25:47.273344  6598 slave.cpp:251] Flags at startup: --acls="" --appc_simple_discovery_uri_prefix="http://"
--appc_store_dir="/tmp/Endpoint_SlaveEndpointTest_UnauthorizedRequest_1_x9M03z/store/appc"
--authenticate_http_readonly="true" --authenticate_http_readwrite="true" --authenticatee="crammd5"
--authentication_backoff_factor="1secs" --authorizer="local" --cgroups_cpu_enable_pids_and_tids_count="false"
--cgroups_enable_cfs="false" --cgroups_hierarchy="/sys/fs/cgroup" --cgroups_limit_swap="false"
--cgroups_root="mesos" --container_disk_watch_interval="15secs" --containerizers="mesos" --credential="/tmp/Endpoint_SlaveEndpointTest_UnauthorizedRequest_1_x9M03z/credential"
--default_role="*" --disallow_sharing_agent_pid_namespace="false" --disk_watch_interval="1mins"
--docker="docker" --docker_kill_orphans="true" --docker_registry="https://registry-1.docker.io"
--docker_remove_delay="6hrs" --docker_socket="/var/run/docker.sock" --docker_stop_timeout="0ns"
--docker_store_dir="/tmp/Endpoint_SlaveEndpointTest_UnauthorizedRequest_1_x9M03z/store/docker"
--docker_volume_checkpoint_dir="/var/run/mesos/isolators/docker/volume" --enforce_container_disk_quota="false"
--executor_registration_timeout="1mins" --executor_reregistration_timeout="2secs" --executor_shutdown_grace_period="5secs"
--fetcher_cache_dir="/tmp/Endpoint_SlaveEndpointTest_UnauthorizedRequest_1_x9M03z/fetch" --fetcher_cache_size="2GB"
--frameworks_home="" --gc_delay="1weeks" --gc_disk_headroom="0.1" --hadoop_home="" --help="false"
--hostname_lookup="true" --http_command_executor="false" --http_credentials="/tmp/Endpoint_SlaveEndpointTest_UnauthorizedRequest_1_x9M03z/http_credentials"
--http_heartbeat_interval="30secs" --initialize_driver_logging="true" --isolation="posix/cpu,posix/mem"
--launcher="posix" --launcher_dir="/mesos/mesos-1.4.0/_build/src" --logbufsecs="0" --logging_level="INFO"
--max_completed_executors_per_framework="150" --oversubscribed_resources_interval="15secs"
--perf_duration="10secs" --perf_interval="1mins" --port="5051" --qos_correction_interval_min="0ns"
--quiet="false" --recover="reconnect" --recovery_timeout="15mins" --registration_backoff_factor="10ms"
--resources="cpus:2;gpus:0;mem:1024;disk:1024;ports:[31000-32000]" --revocable_cpu_low_priority="true"
--runtime_dir="/tmp/Endpoint_SlaveEndpointTest_UnauthorizedRequest_1_x9M03z" --sandbox_directory="/mnt/mesos/sandbox"
--strict="true" --switch_user="true" --systemd_enable_support="true" --systemd_runtime_directory="/run/systemd/system"
--version="false" --work_dir="/tmp/Endpoint_SlaveEndpointTest_UnauthorizedRequest_1_Lx10nW"
I0818 23:25:47.273802  6598 credentials.hpp:86] Loading credential for authentication from
'/tmp/Endpoint_SlaveEndpointTest_UnauthorizedRequest_1_x9M03z/credential'
I0818 23:25:47.273977  6598 slave.cpp:283] Agent using credential for: test-principal
I0818 23:25:47.273999  6598 credentials.hpp:37] Loading credentials for authentication from
'/tmp/Endpoint_SlaveEndpointTest_UnauthorizedRequest_1_x9M03z/http_credentials'
I0818 23:25:47.274246  6598 http.cpp:1026] Creating default 'basic' HTTP authenticator for
realm 'mesos-agent-readonly'
I0818 23:25:47.274422  6598 http.cpp:1026] Creating default 'basic' HTTP authenticator for
realm 'mesos-agent-readwrite'
I0818 23:25:47.275816  6598 slave.cpp:565] Agent resources: [{"name":"cpus","scalar":{"value":2.0},"type":"SCALAR"},{"name":"mem","scalar":{"value":1024.0},"type":"SCALAR"},{"name":"disk","scalar":{"value":1024.0},"type":"SCALAR"},{"name":"ports","ranges":{"range":[{"begin":31000,"end":32000}]},"type":"RANGES"}]
I0818 23:25:47.276067  6598 slave.cpp:573] Agent attributes: [  ]
I0818 23:25:47.276079  6598 slave.cpp:582] Agent hostname: 68be7260bba1
I0818 23:25:47.276264  6600 status_update_manager.cpp:177] Pausing sending status updates
I0818 23:25:47.277601  6603 state.cpp:64] Recovering state from '/tmp/Endpoint_SlaveEndpointTest_UnauthorizedRequest_1_Lx10nW/meta'
I0818 23:25:47.277984  6611 status_update_manager.cpp:203] Recovering status update manager
I0818 23:25:47.278281  6609 containerizer.cpp:609] Recovering containerizer
I0818 23:25:47.279944  6612 provisioner.cpp:416] Provisioner recovery complete
I0818 23:25:47.280493  6601 slave.cpp:6210] Finished recovery
I0818 23:25:47.281026  6601 slave.cpp:6392] Querying resource estimator for oversubscribable
resources
I0818 23:25:47.281321  6596 slave.cpp:6406] Received oversubscribable resources {} from the
resource estimator
I0818 23:25:47.283695  6610 process.cpp:3933] Handling HTTP event for process 'slave(798)'
with path: '/slave(798)/monitor/statistics.json'
I0818 23:25:47.284924  6598 http.cpp:1166] HTTP GET for /slave(798)/monitor/statistics.json
from 172.17.0.11:47744
I0818 23:25:47.285002  6598 http.cpp:957] Authorizing principal 'test-principal' to GET the
'/monitor/statistics.json' endpoint
I0818 23:25:47.287833  6570 slave.cpp:843] Agent terminating
[       OK ] Endpoint/SlaveEndpointTest.UnauthorizedRequest/1 (31 ms)
[ RUN      ] Endpoint/SlaveEndpointTest.UnauthorizedRequest/2
I0818 23:25:47.300220  6570 containerizer.cpp:246] Using isolation: posix/cpu,posix/mem,filesystem/posix,network/cni,environment_secret
W0818 23:25:47.300853  6570 backend.cpp:76] Failed to create 'aufs' backend: AufsBackend requires
root privileges
W0818 23:25:47.300981  6570 backend.cpp:76] Failed to create 'bind' backend: BindBackend requires
root privileges
I0818 23:25:47.301028  6570 provisioner.cpp:255] Using default backend 'copy'
I0818 23:25:47.305505  6610 slave.cpp:250] Mesos agent started on (799)@172.17.0.11:42494
I0818 23:25:47.305528  6610 slave.cpp:251] Flags at startup: --acls="" --appc_simple_discovery_uri_prefix="http://"
--appc_store_dir="/tmp/Endpoint_SlaveEndpointTest_UnauthorizedRequest_2_V6PJ18/store/appc"
--authenticate_http_readonly="true" --authenticate_http_readwrite="true" --authenticatee="crammd5"
--authentication_backoff_factor="1secs" --authorizer="local" --cgroups_cpu_enable_pids_and_tids_count="false"
--cgroups_enable_cfs="false" --cgroups_hierarchy="/sys/fs/cgroup" --cgroups_limit_swap="false"
--cgroups_root="mesos" --container_disk_watch_interval="15secs" --containerizers="mesos" --credential="/tmp/Endpoint_SlaveEndpointTest_UnauthorizedRequest_2_V6PJ18/credential"
--default_role="*" --disallow_sharing_agent_pid_namespace="false" --disk_watch_interval="1mins"
--docker="docker" --docker_kill_orphans="true" --docker_registry="https://registry-1.docker.io"
--docker_remove_delay="6hrs" --docker_socket="/var/run/docker.sock" --docker_stop_timeout="0ns"
--docker_store_dir="/tmp/Endpoint_SlaveEndpointTest_UnauthorizedRequest_2_V6PJ18/store/docker"
--docker_volume_checkpoint_dir="/var/run/mesos/isolators/docker/volume" --enforce_container_disk_quota="false"
--executor_registration_timeout="1mins" --executor_reregistration_timeout="2secs" --executor_shutdown_grace_period="5secs"
--fetcher_cache_dir="/tmp/Endpoint_SlaveEndpointTest_UnauthorizedRequest_2_V6PJ18/fetch" --fetcher_cache_size="2GB"
--frameworks_home="" --gc_delay="1weeks" --gc_disk_headroom="0.1" --hadoop_home="" --help="false"
--hostname_lookup="true" --http_command_executor="false" --http_credentials="/tmp/Endpoint_SlaveEndpointTest_UnauthorizedRequest_2_V6PJ18/http_credentials"
--http_heartbeat_interval="30secs" --initialize_driver_logging="true" --isolation="posix/cpu,posix/mem"
--launcher="posix" --launcher_dir="/mesos/mesos-1.4.0/_build/src" --logbufsecs="0" --logging_level="INFO"
--max_completed_executors_per_framework="150" --oversubscribed_resources_interval="15secs"
--perf_duration="10secs" --perf_interval="1mins" --port="5051" --qos_correction_interval_min="0ns"
--quiet="false" --recover="reconnect" --recovery_timeout="15mins" --registration_backoff_factor="10ms"
--resources="cpus:2;gpus:0;mem:1024;disk:1024;ports:[31000-32000]" --revocable_cpu_low_priority="true"
--runtime_dir="/tmp/Endpoint_SlaveEndpointTest_UnauthorizedRequest_2_V6PJ18" --sandbox_directory="/mnt/mesos/sandbox"
--strict="true" --switch_user="true" --systemd_enable_support="true" --systemd_runtime_directory="/run/systemd/system"
--version="false" --work_dir="/tmp/Endpoint_SlaveEndpointTest_UnauthorizedRequest_2_Nc67gv"
I0818 23:25:47.306052  6610 credentials.hpp:86] Loading credential for authentication from
'/tmp/Endpoint_SlaveEndpointTest_UnauthorizedRequest_2_V6PJ18/credential'
I0818 23:25:47.306211  6610 slave.cpp:283] Agent using credential for: test-principal
I0818 23:25:47.306233  6610 credentials.hpp:37] Loading credentials for authentication from
'/tmp/Endpoint_SlaveEndpointTest_UnauthorizedRequest_2_V6PJ18/http_credentials'
I0818 23:25:47.306466  6610 http.cpp:1026] Creating default 'basic' HTTP authenticator for
realm 'mesos-agent-readonly'
I0818 23:25:47.306628  6610 http.cpp:1026] Creating default 'basic' HTTP authenticator for
realm 'mesos-agent-readwrite'
I0818 23:25:47.307993  6610 slave.cpp:565] Agent resources: [{"name":"cpus","scalar":{"value":2.0},"type":"SCALAR"},{"name":"mem","scalar":{"value":1024.0},"type":"SCALAR"},{"name":"disk","scalar":{"value":1024.0},"type":"SCALAR"},{"name":"ports","ranges":{"range":[{"begin":31000,"end":32000}]},"type":"RANGES"}]
I0818 23:25:47.308236  6610 slave.cpp:573] Agent attributes: [  ]
I0818 23:25:47.308249  6610 slave.cpp:582] Agent hostname: 68be7260bba1
I0818 23:25:47.308411  6608 status_update_manager.cpp:177] Pausing sending status updates
I0818 23:25:47.310029  6612 state.cpp:64] Recovering state from '/tmp/Endpoint_SlaveEndpointTest_UnauthorizedRequest_2_Nc67gv/meta'
I0818 23:25:47.310416  6594 status_update_manager.cpp:203] Recovering status update manager
I0818 23:25:47.310758  6589 containerizer.cpp:609] Recovering containerizer
I0818 23:25:47.312168  6601 provisioner.cpp:416] Provisioner recovery complete
I0818 23:25:47.312554  6604 slave.cpp:6210] Finished recovery
I0818 23:25:47.313132  6604 slave.cpp:6392] Querying resource estimator for oversubscribable
resources
I0818 23:25:47.313365  6591 slave.cpp:6406] Received oversubscribable resources {} from the
resource estimator
I0818 23:25:47.316006  6607 process.cpp:3933] Handling HTTP event for process 'slave(799)'
with path: '/slave(799)/containers'
I0818 23:25:47.317342  6596 http.cpp:1166] HTTP GET for /slave(799)/containers from 172.17.0.11:47746
I0818 23:25:47.317417  6596 http.cpp:957] Authorizing principal 'test-principal' to GET the
'/containers' endpoint
I0818 23:25:47.319963  6605 slave.cpp:843] Agent terminating
[       OK ] Endpoint/SlaveEndpointTest.UnauthorizedRequest/2 (33 ms)
[ RUN      ] Endpoint/SlaveEndpointTest.NoAuthorizer/0
I0818 23:25:47.334887  6570 containerizer.cpp:246] Using isolation: posix/cpu,posix/mem,filesystem/posix,network/cni,environment_secret
W0818 23:25:47.335556  6570 backend.cpp:76] Failed to create 'aufs' backend: AufsBackend requires
root privileges
W0818 23:25:47.335691  6570 backend.cpp:76] Failed to create 'bind' backend: BindBackend requires
root privileges
I0818 23:25:47.335739  6570 provisioner.cpp:255] Using default backend 'copy'
I0818 23:25:47.337957  6570 cluster.cpp:448] Creating default 'local' authorizer
I0818 23:25:47.340265  6598 slave.cpp:250] Mesos agent started on (800)@172.17.0.11:42494
I0818 23:25:47.340296  6598 slave.cpp:251] Flags at startup: --acls="" --appc_simple_discovery_uri_prefix="http://"
--appc_store_dir="/tmp/Endpoint_SlaveEndpointTest_NoAuthorizer_0_zNuzjI/store/appc" --authenticate_http_readonly="true"
--authenticate_http_readwrite="true" --authenticatee="crammd5" --authentication_backoff_factor="1secs"
--authorizer="local" --cgroups_cpu_enable_pids_and_tids_count="false" --cgroups_enable_cfs="false"
--cgroups_hierarchy="/sys/fs/cgroup" --cgroups_limit_swap="false" --cgroups_root="mesos" --container_disk_watch_interval="15secs"
--containerizers="mesos" --credential="/tmp/Endpoint_SlaveEndpointTest_NoAuthorizer_0_zNuzjI/credential"
--default_role="*" --disallow_sharing_agent_pid_namespace="false" --disk_watch_interval="1mins"
--docker="docker" --docker_kill_orphans="true" --docker_registry="https://registry-1.docker.io"
--docker_remove_delay="6hrs" --docker_socket="/var/run/docker.sock" --docker_stop_timeout="0ns"
--docker_store_dir="/tmp/Endpoint_SlaveEndpointTest_NoAuthorizer_0_zNuzjI/store/docker" --docker_volume_checkpoint_dir="/var/run/mesos/isolators/docker/volume"
--enforce_container_disk_quota="false" --executor_registration_timeout="1mins" --executor_reregistration_timeout="2secs"
--executor_shutdown_grace_period="5secs" --fetcher_cache_dir="/tmp/Endpoint_SlaveEndpointTest_NoAuthorizer_0_zNuzjI/fetch"
--fetcher_cache_size="2GB" --frameworks_home="" --gc_delay="1weeks" --gc_disk_headroom="0.1"
--hadoop_home="" --help="false" --hostname_lookup="true" --http_command_executor="false" --http_credentials="/tmp/Endpoint_SlaveEndpointTest_NoAuthorizer_0_zNuzjI/http_credentials"
--http_heartbeat_interval="30secs" --initialize_driver_logging="true" --isolation="posix/cpu,posix/mem"
--launcher="posix" --launcher_dir="/mesos/mesos-1.4.0/_build/src" --logbufsecs="0" --logging_level="INFO"
--max_completed_executors_per_framework="150" --oversubscribed_resources_interval="15secs"
--perf_duration="10secs" --perf_interval="1mins" --port="5051" --qos_correction_interval_min="0ns"
--quiet="false" --recover="reconnect" --recovery_timeout="15mins" --registration_backoff_factor="10ms"
--resources="cpus:2;gpus:0;mem:1024;disk:1024;ports:[31000-32000]" --revocable_cpu_low_priority="true"
--runtime_dir="/tmp/Endpoint_SlaveEndpointTest_NoAuthorizer_0_zNuzjI" --sandbox_directory="/mnt/mesos/sandbox"
--strict="true" --switch_user="true" --systemd_enable_support="true" --systemd_runtime_directory="/run/systemd/system"
--version="false" --work_dir="/tmp/Endpoint_SlaveEndpointTest_NoAuthorizer_0_PRGPt4"
I0818 23:25:47.340750  6598 credentials.hpp:86] Loading credential for authentication from
'/tmp/Endpoint_SlaveEndpointTest_NoAuthorizer_0_zNuzjI/credential'
I0818 23:25:47.340916  6598 slave.cpp:283] Agent using credential for: test-principal
I0818 23:25:47.340941  6598 credentials.hpp:37] Loading credentials for authentication from
'/tmp/Endpoint_SlaveEndpointTest_NoAuthorizer_0_zNuzjI/http_credentials'
I0818 23:25:47.341208  6598 http.cpp:1026] Creating default 'basic' HTTP authenticator for
realm 'mesos-agent-readonly'
I0818 23:25:47.341377  6598 http.cpp:1026] Creating default 'basic' HTTP authenticator for
realm 'mesos-agent-readwrite'
I0818 23:25:47.342934  6598 slave.cpp:565] Agent resources: [{"name":"cpus","scalar":{"value":2.0},"type":"SCALAR"},{"name":"mem","scalar":{"value":1024.0},"type":"SCALAR"},{"name":"disk","scalar":{"value":1024.0},"type":"SCALAR"},{"name":"ports","ranges":{"range":[{"begin":31000,"end":32000}]},"type":"RANGES"}]
I0818 23:25:47.343196  6598 slave.cpp:573] Agent attributes: [  ]
I0818 23:25:47.343210  6598 slave.cpp:582] Agent hostname: 68be7260bba1
I0818 23:25:47.343376  6610 status_update_manager.cpp:177] Pausing sending status updates
I0818 23:25:47.344703  6596 state.cpp:64] Recovering state from '/tmp/Endpoint_SlaveEndpointTest_NoAuthorizer_0_PRGPt4/meta'
I0818 23:25:47.344993  6593 status_update_manager.cpp:203] Recovering status update manager
I0818 23:25:47.345224  6603 containerizer.cpp:609] Recovering containerizer
I0818 23:25:47.346973  6594 provisioner.cpp:416] Provisioner recovery complete
I0818 23:25:47.347582  6605 slave.cpp:6210] Finished recovery
I0818 23:25:47.348214  6605 slave.cpp:6392] Querying resource estimator for oversubscribable
resources
I0818 23:25:47.348507  6606 slave.cpp:6406] Received oversubscribable resources {} from the
resource estimator
I0818 23:25:47.351161  6601 process.cpp:3933] Handling HTTP event for process 'slave(800)'
with path: '/slave(800)/monitor/statistics'
I0818 23:25:47.352674  6596 http.cpp:1166] HTTP GET for /slave(800)/monitor/statistics from
172.17.0.11:47750
I0818 23:25:47.352747  6596 http.cpp:957] Authorizing principal 'test-principal' to GET the
'/monitor/statistics' endpoint
I0818 23:25:47.356467  6570 slave.cpp:843] Agent terminating
[       OK ] Endpoint/SlaveEndpointTest.NoAuthorizer/0 (35 ms)
[ RUN      ] Endpoint/SlaveEndpointTest.NoAuthorizer/1
I0818 23:25:47.369637  6570 containerizer.cpp:246] Using isolation: posix/cpu,posix/mem,filesystem/posix,network/cni,environment_secret
W0818 23:25:47.370146  6570 backend.cpp:76] Failed to create 'aufs' backend: AufsBackend requires
root privileges
W0818 23:25:47.370260  6570 backend.cpp:76] Failed to create 'bind' backend: BindBackend requires
root privileges
I0818 23:25:47.370292  6570 provisioner.cpp:255] Using default backend 'copy'
I0818 23:25:47.372169  6570 cluster.cpp:448] Creating default 'local' authorizer
I0818 23:25:47.374460  6608 slave.cpp:250] Mesos agent started on (801)@172.17.0.11:42494
I0818 23:25:47.374503  6608 slave.cpp:251] Flags at startup: --acls="" --appc_simple_discovery_uri_prefix="http://"
--appc_store_dir="/tmp/Endpoint_SlaveEndpointTest_NoAuthorizer_1_T3MmWh/store/appc" --authenticate_http_readonly="true"
--authenticate_http_readwrite="true" --authenticatee="crammd5" --authentication_backoff_factor="1secs"
--authorizer="local" --cgroups_cpu_enable_pids_and_tids_count="false" --cgroups_enable_cfs="false"
--cgroups_hierarchy="/sys/fs/cgroup" --cgroups_limit_swap="false" --cgroups_root="mesos" --container_disk_watch_interval="15secs"
--containerizers="mesos" --credential="/tmp/Endpoint_SlaveEndpointTest_NoAuthorizer_1_T3MmWh/credential"
--default_role="*" --disallow_sharing_agent_pid_namespace="false" --disk_watch_interval="1mins"
--docker="docker" --docker_kill_orphans="true" --docker_registry="https://registry-1.docker.io"
--docker_remove_delay="6hrs" --docker_socket="/var/run/docker.sock" --docker_stop_timeout="0ns"
--docker_store_dir="/tmp/Endpoint_SlaveEndpointTest_NoAuthorizer_1_T3MmWh/store/docker" --docker_volume_checkpoint_dir="/var/run/mesos/isolators/docker/volume"
--enforce_container_disk_quota="false" --executor_registration_timeout="1mins" --executor_reregistration_timeout="2secs"
--executor_shutdown_grace_period="5secs" --fetcher_cache_dir="/tmp/Endpoint_SlaveEndpointTest_NoAuthorizer_1_T3MmWh/fetch"
--fetcher_cache_size="2GB" --frameworks_home="" --gc_delay="1weeks" --gc_disk_headroom="0.1"
--hadoop_home="" --help="false" --hostname_lookup="true" --http_command_executor="false" --http_credentials="/tmp/Endpoint_SlaveEndpointTest_NoAuthorizer_1_T3MmWh/http_credentials"
--http_heartbeat_interval="30secs" --initialize_driver_logging="true" --isolation="posix/cpu,posix/mem"
--launcher="posix" --launcher_dir="/mesos/mesos-1.4.0/_build/src" --logbufsecs="0" --logging_level="INFO"
--max_completed_executors_per_framework="150" --oversubscribed_resources_interval="15secs"
--perf_duration="10secs" --perf_interval="1mins" --port="5051" --qos_correction_interval_min="0ns"
--quiet="false" --recover="reconnect" --recovery_timeout="15mins" --registration_backoff_factor="10ms"
--resources="cpus:2;gpus:0;mem:1024;disk:1024;ports:[31000-32000]" --revocable_cpu_low_priority="true"
--runtime_dir="/tmp/Endpoint_SlaveEndpointTest_NoAuthorizer_1_T3MmWh" --sandbox_directory="/mnt/mesos/sandbox"
--strict="true" --switch_user="true" --systemd_enable_support="true" --systemd_runtime_directory="/run/systemd/system"
--version="false" --work_dir="/tmp/Endpoint_SlaveEndpointTest_NoAuthorizer_1_nKEo1D"
I0818 23:25:47.375018  6608 credentials.hpp:86] Loading credential for authentication from
'/tmp/Endpoint_SlaveEndpointTest_NoAuthorizer_1_T3MmWh/credential'
I0818 23:25:47.375196  6608 slave.cpp:283] Agent using credential for: test-principal
I0818 23:25:47.375222  6608 credentials.hpp:37] Loading credentials for authentication from
'/tmp/Endpoint_SlaveEndpointTest_NoAuthorizer_1_T3MmWh/http_credentials'
I0818 23:25:47.375479  6608 http.cpp:1026] Creating default 'basic' HTTP authenticator for
realm 'mesos-agent-readonly'
I0818 23:25:47.375677  6608 http.cpp:1026] Creating default 'basic' HTTP authenticator for
realm 'mesos-agent-readwrite'
I0818 23:25:47.377185  6608 slave.cpp:565] Agent resources: [{"name":"cpus","scalar":{"value":2.0},"type":"SCALAR"},{"name":"mem","scalar":{"value":1024.0},"type":"SCALAR"},{"name":"disk","scalar":{"value":1024.0},"type":"SCALAR"},{"name":"ports","ranges":{"range":[{"begin":31000,"end":32000}]},"type":"RANGES"}]
I0818 23:25:47.377451  6608 slave.cpp:573] Agent attributes: [  ]
I0818 23:25:47.377465  6608 slave.cpp:582] Agent hostname: 68be7260bba1
I0818 23:25:47.377631  6606 status_update_manager.cpp:177] Pausing sending status updates
I0818 23:25:47.379179  6592 state.cpp:64] Recovering state from '/tmp/Endpoint_SlaveEndpointTest_NoAuthorizer_1_nKEo1D/meta'
I0818 23:25:47.379483  6602 status_update_manager.cpp:203] Recovering status update manager
I0818 23:25:47.379673  6611 containerizer.cpp:609] Recovering containerizer
I0818 23:25:47.381002  6605 provisioner.cpp:416] Provisioner recovery complete
I0818 23:25:47.381482  6589 slave.cpp:6210] Finished recovery
I0818 23:25:47.381953  6589 slave.cpp:6392] Querying resource estimator for oversubscribable
resources
I0818 23:25:47.382287  6601 slave.cpp:6406] Received oversubscribable resources {} from the
resource estimator
I0818 23:25:47.385187  6593 process.cpp:3933] Handling HTTP event for process 'slave(801)'
with path: '/slave(801)/monitor/statistics.json'
I0818 23:25:47.386384  6603 http.cpp:1166] HTTP GET for /slave(801)/monitor/statistics.json
from 172.17.0.11:47752
I0818 23:25:47.386451  6603 http.cpp:957] Authorizing principal 'test-principal' to GET the
'/monitor/statistics.json' endpoint
I0818 23:25:47.390324  6570 slave.cpp:843] Agent terminating
[       OK ] Endpoint/SlaveEndpointTest.NoAuthorizer/1 (33 ms)
[ RUN      ] Endpoint/SlaveEndpointTest.NoAuthorizer/2
I0818 23:25:47.403467  6570 containerizer.cpp:246] Using isolation: posix/cpu,posix/mem,filesystem/posix,network/cni,environment_secret
W0818 23:25:47.403975  6570 backend.cpp:76] Failed to create 'aufs' backend: AufsBackend requires
root privileges
W0818 23:25:47.404079  6570 backend.cpp:76] Failed to create 'bind' backend: BindBackend requires
root privileges
I0818 23:25:47.404109  6570 provisioner.cpp:255] Using default backend 'copy'
I0818 23:25:47.406311  6570 cluster.cpp:448] Creating default 'local' authorizer
I0818 23:25:47.408474  6610 slave.cpp:250] Mesos agent started on (802)@172.17.0.11:42494
I0818 23:25:47.408500  6610 slave.cpp:251] Flags at startup: --acls="" --appc_simple_discovery_uri_prefix="http://"
--appc_store_dir="/tmp/Endpoint_SlaveEndpointTest_NoAuthorizer_2_Pey9SR/store/appc" --authenticate_http_readonly="true"
--authenticate_http_readwrite="true" --authenticatee="crammd5" --authentication_backoff_factor="1secs"
--authorizer="local" --cgroups_cpu_enable_pids_and_tids_count="false" --cgroups_enable_cfs="false"
--cgroups_hierarchy="/sys/fs/cgroup" --cgroups_limit_swap="false" --cgroups_root="mesos" --container_disk_watch_interval="15secs"
--containerizers="mesos" --credential="/tmp/Endpoint_SlaveEndpointTest_NoAuthorizer_2_Pey9SR/credential"
--default_role="*" --disallow_sharing_agent_pid_namespace="false" --disk_watch_interval="1mins"
--docker="docker" --docker_kill_orphans="true" --docker_registry="https://registry-1.docker.io"
--docker_remove_delay="6hrs" --docker_socket="/var/run/docker.sock" --docker_stop_timeout="0ns"
--docker_store_dir="/tmp/Endpoint_SlaveEndpointTest_NoAuthorizer_2_Pey9SR/store/docker" --docker_volume_checkpoint_dir="/var/run/mesos/isolators/docker/volume"
--enforce_container_disk_quota="false" --executor_registration_timeout="1mins" --executor_reregistration_timeout="2secs"
--executor_shutdown_grace_period="5secs" --fetcher_cache_dir="/tmp/Endpoint_SlaveEndpointTest_NoAuthorizer_2_Pey9SR/fetch"
--fetcher_cache_size="2GB" --frameworks_home="" --gc_delay="1weeks" --gc_disk_headroom="0.1"
--hadoop_home="" --help="false" --hostname_lookup="true" --http_command_executor="false" --http_credentials="/tmp/Endpoint_SlaveEndpointTest_NoAuthorizer_2_Pey9SR/http_credentials"
--http_heartbeat_interval="30secs" --initialize_driver_logging="true" --isolation="posix/cpu,posix/mem"
--launcher="posix" --launcher_dir="/mesos/mesos-1.4.0/_build/src" --logbufsecs="0" --logging_level="INFO"
--max_completed_executors_per_framework="150" --oversubscribed_resources_interval="15secs"
--perf_duration="10secs" --perf_interval="1mins" --port="5051" --qos_correction_interval_min="0ns"
--quiet="false" --recover="reconnect" --recovery_timeout="15mins" --registration_backoff_factor="10ms"
--resources="cpus:2;gpus:0;mem:1024;disk:1024;ports:[31000-32000]" --revocable_cpu_low_priority="true"
--runtime_dir="/tmp/Endpoint_SlaveEndpointTest_NoAuthorizer_2_Pey9SR" --sandbox_directory="/mnt/mesos/sandbox"
--strict="true" --switch_user="true" --systemd_enable_support="true" --systemd_runtime_directory="/run/systemd/system"
--version="false" --work_dir="/tmp/Endpoint_SlaveEndpointTest_NoAuthorizer_2_fFncTd"
I0818 23:25:47.408915  6610 credentials.hpp:86] Loading credential for authentication from
'/tmp/Endpoint_SlaveEndpointTest_NoAuthorizer_2_Pey9SR/credential'
I0818 23:25:47.409082  6610 slave.cpp:283] Agent using credential for: test-principal
I0818 23:25:47.409109  6610 credentials.hpp:37] Loading credentials for authentication from
'/tmp/Endpoint_SlaveEndpointTest_NoAuthorizer_2_Pey9SR/http_credentials'
I0818 23:25:47.409358  6610 http.cpp:1026] Creating default 'basic' HTTP authenticator for
realm 'mesos-agent-readonly'
I0818 23:25:47.409534  6610 http.cpp:1026] Creating default 'basic' HTTP authenticator for
realm 'mesos-agent-readwrite'
I0818 23:25:47.410863  6610 slave.cpp:565] Agent resources: [{"name":"cpus","scalar":{"value":2.0},"type":"SCALAR"},{"name":"mem","scalar":{"value":1024.0},"type":"SCALAR"},{"name":"disk","scalar":{"value":1024.0},"type":"SCALAR"},{"name":"ports","ranges":{"range":[{"begin":31000,"end":32000}]},"type":"RANGES"}]
I0818 23:25:47.411099  6610 slave.cpp:573] Agent attributes: [  ]
I0818 23:25:47.411113  6610 slave.cpp:582] Agent hostname: 68be7260bba1
I0818 23:25:47.411291  6605 status_update_manager.cpp:177] Pausing sending status updates
I0818 23:25:47.412861  6591 state.cpp:64] Recovering state from '/tmp/Endpoint_SlaveEndpointTest_NoAuthorizer_2_fFncTd/meta'
I0818 23:25:47.413244  6602 status_update_manager.cpp:203] Recovering status update manager
I0818 23:25:47.413496  6599 containerizer.cpp:609] Recovering containerizer
I0818 23:25:47.414999  6596 provisioner.cpp:416] Provisioner recovery complete
I0818 23:25:47.415418  6610 slave.cpp:6210] Finished recovery
I0818 23:25:47.415864  6610 slave.cpp:6392] Querying resource estimator for oversubscribable
resources
I0818 23:25:47.416165  6593 slave.cpp:6406] Received oversubscribable resources {} from the
resource estimator
I0818 23:25:47.418807  6594 process.cpp:3933] Handling HTTP event for process 'slave(802)'
with path: '/slave(802)/containers'
I0818 23:25:47.420039  6596 http.cpp:1166] HTTP GET for /slave(802)/containers from 172.17.0.11:47754
I0818 23:25:47.420106  6596 http.cpp:957] Authorizing principal 'test-principal' to GET the
'/containers' endpoint
I0818 23:25:47.424167  6570 slave.cpp:843] Agent terminating
[       OK ] Endpoint/SlaveEndpointTest.NoAuthorizer/2 (34 ms)
[----------] 9 tests from Endpoint/SlaveEndpointTest (308 ms total)

[----------] 2 tests from ContainerizerType/DefaultContainerDNSFlagTest
[ RUN      ] ContainerizerType/DefaultContainerDNSFlagTest.ValidateFlag/0
[       OK ] ContainerizerType/DefaultContainerDNSFlagTest.ValidateFlag/0 (11 ms)
[ RUN      ] ContainerizerType/DefaultContainerDNSFlagTest.ValidateFlag/1
[       OK ] ContainerizerType/DefaultContainerDNSFlagTest.ValidateFlag/1 (10 ms)
[----------] 2 tests from ContainerizerType/DefaultContainerDNSFlagTest (21 ms total)

[----------] Global test environment tear-down
[==========] 1652 tests from 182 test cases ran. (578672 ms total)
[  PASSED  ] 1651 tests.
[  FAILED  ] 1 test, listed below:
[  FAILED  ] CommandExecutorCheckTest.CommandCheckDeliveredAndReconciled

 1 FAILED TEST
  YOU HAVE 20 DISABLED TESTS

I0818 23:25:47.517909  6613 process.cpp:1072] Failed to accept socket: future discarded
make[4]: *** [check-local] Error 1
make[4]: Leaving directory `/mesos/mesos-1.4.0/_build/src'
make[3]: *** [check-am] Error 2
make[3]: Leaving directory `/mesos/mesos-1.4.0/_build/src'
make[2]: *** [check] Error 2
make[2]: Leaving directory `/mesos/mesos-1.4.0/_build/src'
make[1]: *** [check-recursive] Error 1
make[1]: Leaving directory `/mesos/mesos-1.4.0/_build'
make: *** [distcheck] Error 1
+ docker rmi mesos-1503096091-10736
Untagged: mesos-1503096091-10736:latest
Deleted: sha256:7cb24e33917981ec49ee6b62d3045e4903a6a9e066011c26c928a26a21a94f63
Deleted: sha256:00e87f97941827de3311b0ce39bbcc84a9c7d5c42041226a9b5dda7f06ca766b
Deleted: sha256:be0109ff708ae12fd394cb208abf8b6df7ef3b7c918d50fe83826984cde83c6a
Deleted: sha256:de3d3acca1525168b8485aa829125785bbe6508d0b8eaa77c7f28226b1cee425
Deleted: sha256:f2d55b81b3b5bad0de816c0df7457e61bbcee8ed8148da372782e2ac62d44ea5
Deleted: sha256:62ee71ae0bc3c126e13452be07ff2b181cb99656daf6b07c170f9b32409b71dc
Deleted: sha256:84e6abd4fdd3e9c074eb2d2e25d572aa4ff1c7be495c0bd163a09115dd3e0de1
Deleted: sha256:82899c51d0f6929b2f1fdc6d7e4bef0c9785425578d9ca5dcfc6c5e475a7e674
Deleted: sha256:48b666af47a95d20ed993f7bd6c8fca90837005d8504b494f0c1137d4e324438
Deleted: sha256:19a96ae24d51f237579ec48c59c9183cf6080d54aee9cb94501054bb0c1f1468
Deleted: sha256:d4429558bd760cb016b1fd962658c5a3fd7ebc269d75fdb94e1896ca402000b1
Deleted: sha256:940b7bc3b3a4b18206fe90d2355f13dd2382013e46eed1aca153eaefac9e4488
Deleted: sha256:a9d2b86a0cb6fa2deb76782465552578e652b67558f48e02b33e3e58f2c13af8
Deleted: sha256:c5d346ec713acf0437b82fb830c0910afbf9ae29286568f984dbc3ae68422287
Deleted: sha256:0a415ae6cbd0859faaaaa1de435de546f8933334788b1736cccf9cf1cd076f6b
Deleted: sha256:234de802af33b263bb243c9b9c1d4c9043a65161573cf058674cb6b21b247bd4
Deleted: sha256:cf605e9be3229092b440b491aae422c5a6f567cceeeefaacb3fe2e59f944701f
Deleted: sha256:121cb722dc8178c46b8d326045b7ddae2213e0e846468729897cdf512f1b183c
Deleted: sha256:1729234a95416f7737f0facf4cb682854d7e8ce03f2137bdaed2013e633ad836
Deleted: sha256:07929f3ed4f2c64f431d558d3d525f7c8738de457dcf7c75d4dd2e4a9d8d522c
Deleted: sha256:a59eecacb1b777e1cd3e880b47dcfc96eca37c23b3dbf9da28aa9ad20e48826a
Deleted: sha256:9ee6e44d85299c324506023a7dc481e48bb272957da8f742070cd997f35edcc9
Deleted: sha256:2f7f4bba17babf0dc93d7ae73cf42a5217eca029d235d0a95319f000d04dab02
Deleted: sha256:64b2859247c5b1325c40cae6c9a0fd2a9c76155314304649af0c284d4d9e00f0
Deleted: sha256:d3ab164a3b292561f7339bbb71d0b5f18dd4b53d27696d71d8e4a2ebe950e1e8
Build step 'Execute shell' marked build as failure

Mime
View raw message