mesos-builds mailing list archives

Site index · List index
Message view « Date » · « Thread »
Top « Date » · « Thread »
From Apache Jenkins Server <jenk...@builds.apache.org>
Subject Build failed in Jenkins: Mesos-Buildbot » autotools,gcc,--verbose,GLOG_v=1 MESOS_VERBOSE=1,ubuntu:14.04,(ubuntu)&&(!ubuntu-us1)&&(!ubuntu-eu2) #4156
Date Fri, 25 Aug 2017 15:50:13 GMT
See <https://builds.apache.org/job/Mesos-Buildbot/BUILDTOOL=autotools,COMPILER=gcc,CONFIGURATION=--verbose,ENVIRONMENT=GLOG_v=1%20MESOS_VERBOSE=1,OS=ubuntu%3A14.04,label_exp=(ubuntu)&&(!ubuntu-us1)&&(!ubuntu-eu2)/4156/display/redirect?page=changes>

Changes:

[zhq527725] Updated docker executor to return IPv6 address of a container.

[zhq527725] Added test filter for docker user network tests.

[zhq527725] Added a test for IPv6 containers on docker user networks.

------------------------------------------
[...truncated 30.72 MB...]
I0825 15:50:06.470739  5705 slave.cpp:253] Flags at startup: --acls="" --appc_simple_discovery_uri_prefix="http://"
--appc_store_dir="/tmp/Endpoint_SlaveEndpointTest_AuthorizedRequest_2_KkIBsd/store/appc" --authenticate_http_readonly="true"
--authenticate_http_readwrite="true" --authenticatee="crammd5" --authentication_backoff_factor="1secs"
--authorizer="local" --cgroups_cpu_enable_pids_and_tids_count="false" --cgroups_enable_cfs="false"
--cgroups_hierarchy="/sys/fs/cgroup" --cgroups_limit_swap="false" --cgroups_root="mesos" --container_disk_watch_interval="15secs"
--containerizers="mesos" --credential="/tmp/Endpoint_SlaveEndpointTest_AuthorizedRequest_2_KkIBsd/credential"
--default_role="*" --disallow_sharing_agent_pid_namespace="false" --disk_watch_interval="1mins"
--docker="docker" --docker_kill_orphans="true" --docker_registry="https://registry-1.docker.io"
--docker_remove_delay="6hrs" --docker_socket="/var/run/docker.sock" --docker_stop_timeout="0ns"
--docker_store_dir="/tmp/Endpoint_SlaveEndpointTest_AuthorizedRequest_2_KkIBsd/store/docker"
--docker_volume_checkpoint_dir="/var/run/mesos/isolators/docker/volume" --enforce_container_disk_quota="false"
--executor_registration_timeout="1mins" --executor_reregistration_timeout="2secs" --executor_shutdown_grace_period="5secs"
--fetcher_cache_dir="/tmp/Endpoint_SlaveEndpointTest_AuthorizedRequest_2_KkIBsd/fetch" --fetcher_cache_size="2GB"
--frameworks_home="" --gc_delay="1weeks" --gc_disk_headroom="0.1" --hadoop_home="" --help="false"
--hostname_lookup="true" --http_command_executor="false" --http_credentials="/tmp/Endpoint_SlaveEndpointTest_AuthorizedRequest_2_KkIBsd/http_credentials"
--http_heartbeat_interval="30secs" --initialize_driver_logging="true" --isolation="posix/cpu,posix/mem"
--launcher="posix" --launcher_dir="/mesos/mesos-1.5.0/_build/src" --logbufsecs="0" --logging_level="INFO"
--max_completed_executors_per_framework="150" --oversubscribed_resources_interval="15secs"
--perf_duration="10secs" --perf_interval="1mins" --port="5051" --qos_correction_interval_min="0ns"
--quiet="false" --recover="reconnect" --recovery_timeout="15mins" --registration_backoff_factor="10ms"
--resources="cpus:2;gpus:0;mem:1024;disk:1024;ports:[31000-32000]" --revocable_cpu_low_priority="true"
--runtime_dir="/tmp/Endpoint_SlaveEndpointTest_AuthorizedRequest_2_KkIBsd" --sandbox_directory="/mnt/mesos/sandbox"
--strict="true" --switch_user="true" --systemd_enable_support="true" --systemd_runtime_directory="/run/systemd/system"
--version="false" --work_dir="/tmp/Endpoint_SlaveEndpointTest_AuthorizedRequest_2_aHLleQ"
I0825 15:50:06.471067  5705 credentials.hpp:86] Loading credential for authentication from
'/tmp/Endpoint_SlaveEndpointTest_AuthorizedRequest_2_KkIBsd/credential'
I0825 15:50:06.471204  5705 slave.cpp:285] Agent using credential for: test-principal
I0825 15:50:06.471225  5705 credentials.hpp:37] Loading credentials for authentication from
'/tmp/Endpoint_SlaveEndpointTest_AuthorizedRequest_2_KkIBsd/http_credentials'
I0825 15:50:06.471444  5705 http.cpp:1026] Creating default 'basic' HTTP authenticator for
realm 'mesos-agent-readonly'
I0825 15:50:06.471587  5705 http.cpp:1026] Creating default 'basic' HTTP authenticator for
realm 'mesos-agent-readwrite'
I0825 15:50:06.472878  5705 slave.cpp:581] Agent resources: [{"name":"cpus","scalar":{"value":2.0},"type":"SCALAR"},{"name":"mem","scalar":{"value":1024.0},"type":"SCALAR"},{"name":"disk","scalar":{"value":1024.0},"type":"SCALAR"},{"name":"ports","ranges":{"range":[{"begin":31000,"end":32000}]},"type":"RANGES"}]
I0825 15:50:06.473099  5705 slave.cpp:589] Agent attributes: [  ]
I0825 15:50:06.473111  5705 slave.cpp:598] Agent hostname: fe77cb5869e5
I0825 15:50:06.473260  5704 status_update_manager.cpp:177] Pausing sending status updates
I0825 15:50:06.474511  5724 state.cpp:64] Recovering state from '/tmp/Endpoint_SlaveEndpointTest_AuthorizedRequest_2_aHLleQ/meta'
I0825 15:50:06.474784  5718 status_update_manager.cpp:203] Recovering status update manager
I0825 15:50:06.474934  5707 containerizer.cpp:643] Recovering containerizer
I0825 15:50:06.476171  5720 provisioner.cpp:416] Provisioner recovery complete
I0825 15:50:06.476483  5721 slave.cpp:6264] Finished recovery
I0825 15:50:06.476893  5721 slave.cpp:6446] Querying resource estimator for oversubscribable
resources
I0825 15:50:06.477119  5706 slave.cpp:6460] Received oversubscribable resources {} from the
resource estimator
I0825 15:50:06.479183  5723 process.cpp:3933] Handling HTTP event for process 'slave(802)'
with path: '/slave(802)/containers'
I0825 15:50:06.480235  5714 http.cpp:1166] HTTP GET for /slave(802)/containers from 172.17.0.3:50892
I0825 15:50:06.480301  5714 http.cpp:957] Authorizing principal 'test-principal' to GET the
'/containers' endpoint
I0825 15:50:06.483598  5724 slave.cpp:859] Agent terminating
[       OK ] Endpoint/SlaveEndpointTest.AuthorizedRequest/2 (29 ms)
[ RUN      ] Endpoint/SlaveEndpointTest.UnauthorizedRequest/0
I0825 15:50:06.498685  5682 containerizer.cpp:288] Using isolation { environment_secret, posix/cpu,
posix/mem, filesystem/posix, network/cni }
W0825 15:50:06.499234  5682 backend.cpp:76] Failed to create 'aufs' backend: AufsBackend requires
root privileges
W0825 15:50:06.499370  5682 backend.cpp:76] Failed to create 'bind' backend: BindBackend requires
root privileges
I0825 15:50:06.499415  5682 provisioner.cpp:255] Using default backend 'copy'
I0825 15:50:06.503639  5709 slave.cpp:252] Mesos agent started on (803)@172.17.0.3:35261
I0825 15:50:06.503660  5709 slave.cpp:253] Flags at startup: --acls="" --appc_simple_discovery_uri_prefix="http://"
--appc_store_dir="/tmp/Endpoint_SlaveEndpointTest_UnauthorizedRequest_0_TFNLCI/store/appc"
--authenticate_http_readonly="true" --authenticate_http_readwrite="true" --authenticatee="crammd5"
--authentication_backoff_factor="1secs" --authorizer="local" --cgroups_cpu_enable_pids_and_tids_count="false"
--cgroups_enable_cfs="false" --cgroups_hierarchy="/sys/fs/cgroup" --cgroups_limit_swap="false"
--cgroups_root="mesos" --container_disk_watch_interval="15secs" --containerizers="mesos" --credential="/tmp/Endpoint_SlaveEndpointTest_UnauthorizedRequest_0_TFNLCI/credential"
--default_role="*" --disallow_sharing_agent_pid_namespace="false" --disk_watch_interval="1mins"
--docker="docker" --docker_kill_orphans="true" --docker_registry="https://registry-1.docker.io"
--docker_remove_delay="6hrs" --docker_socket="/var/run/docker.sock" --docker_stop_timeout="0ns"
--docker_store_dir="/tmp/Endpoint_SlaveEndpointTest_UnauthorizedRequest_0_TFNLCI/store/docker"
--docker_volume_checkpoint_dir="/var/run/mesos/isolators/docker/volume" --enforce_container_disk_quota="false"
--executor_registration_timeout="1mins" --executor_reregistration_timeout="2secs" --executor_shutdown_grace_period="5secs"
--fetcher_cache_dir="/tmp/Endpoint_SlaveEndpointTest_UnauthorizedRequest_0_TFNLCI/fetch" --fetcher_cache_size="2GB"
--frameworks_home="" --gc_delay="1weeks" --gc_disk_headroom="0.1" --hadoop_home="" --help="false"
--hostname_lookup="true" --http_command_executor="false" --http_credentials="/tmp/Endpoint_SlaveEndpointTest_UnauthorizedRequest_0_TFNLCI/http_credentials"
--http_heartbeat_interval="30secs" --initialize_driver_logging="true" --isolation="posix/cpu,posix/mem"
--launcher="posix" --launcher_dir="/mesos/mesos-1.5.0/_build/src" --logbufsecs="0" --logging_level="INFO"
--max_completed_executors_per_framework="150" --oversubscribed_resources_interval="15secs"
--perf_duration="10secs" --perf_interval="1mins" --port="5051" --qos_correction_interval_min="0ns"
--quiet="false" --recover="reconnect" --recovery_timeout="15mins" --registration_backoff_factor="10ms"
--resources="cpus:2;gpus:0;mem:1024;disk:1024;ports:[31000-32000]" --revocable_cpu_low_priority="true"
--runtime_dir="/tmp/Endpoint_SlaveEndpointTest_UnauthorizedRequest_0_TFNLCI" --sandbox_directory="/mnt/mesos/sandbox"
--strict="true" --switch_user="true" --systemd_enable_support="true" --systemd_runtime_directory="/run/systemd/system"
--version="false" --work_dir="/tmp/Endpoint_SlaveEndpointTest_UnauthorizedRequest_0_msSUjl"
I0825 15:50:06.504076  5709 credentials.hpp:86] Loading credential for authentication from
'/tmp/Endpoint_SlaveEndpointTest_UnauthorizedRequest_0_TFNLCI/credential'
I0825 15:50:06.504252  5709 slave.cpp:285] Agent using credential for: test-principal
I0825 15:50:06.504273  5709 credentials.hpp:37] Loading credentials for authentication from
'/tmp/Endpoint_SlaveEndpointTest_UnauthorizedRequest_0_TFNLCI/http_credentials'
I0825 15:50:06.504549  5709 http.cpp:1026] Creating default 'basic' HTTP authenticator for
realm 'mesos-agent-readonly'
I0825 15:50:06.504743  5709 http.cpp:1026] Creating default 'basic' HTTP authenticator for
realm 'mesos-agent-readwrite'
I0825 15:50:06.506202  5709 slave.cpp:581] Agent resources: [{"name":"cpus","scalar":{"value":2.0},"type":"SCALAR"},{"name":"mem","scalar":{"value":1024.0},"type":"SCALAR"},{"name":"disk","scalar":{"value":1024.0},"type":"SCALAR"},{"name":"ports","ranges":{"range":[{"begin":31000,"end":32000}]},"type":"RANGES"}]
I0825 15:50:06.506448  5709 slave.cpp:589] Agent attributes: [  ]
I0825 15:50:06.506481  5709 slave.cpp:598] Agent hostname: fe77cb5869e5
I0825 15:50:06.506649  5724 status_update_manager.cpp:177] Pausing sending status updates
I0825 15:50:06.508054  5718 state.cpp:64] Recovering state from '/tmp/Endpoint_SlaveEndpointTest_UnauthorizedRequest_0_msSUjl/meta'
I0825 15:50:06.508438  5713 status_update_manager.cpp:203] Recovering status update manager
I0825 15:50:06.508668  5710 containerizer.cpp:643] Recovering containerizer
I0825 15:50:06.510079  5701 provisioner.cpp:416] Provisioner recovery complete
I0825 15:50:06.510432  5709 slave.cpp:6264] Finished recovery
I0825 15:50:06.510874  5709 slave.cpp:6446] Querying resource estimator for oversubscribable
resources
I0825 15:50:06.511133  5723 slave.cpp:6460] Received oversubscribable resources {} from the
resource estimator
I0825 15:50:06.513252  5708 process.cpp:3933] Handling HTTP event for process 'slave(803)'
with path: '/slave(803)/monitor/statistics'
I0825 15:50:06.514453  5713 http.cpp:1166] HTTP GET for /slave(803)/monitor/statistics from
172.17.0.3:50894
I0825 15:50:06.514538  5713 http.cpp:957] Authorizing principal 'test-principal' to GET the
'/monitor/statistics' endpoint
I0825 15:50:06.516613  5718 slave.cpp:859] Agent terminating
[       OK ] Endpoint/SlaveEndpointTest.UnauthorizedRequest/0 (31 ms)
[ RUN      ] Endpoint/SlaveEndpointTest.UnauthorizedRequest/1
I0825 15:50:06.527164  5682 containerizer.cpp:288] Using isolation { environment_secret, posix/cpu,
posix/mem, filesystem/posix, network/cni }
W0825 15:50:06.527632  5682 backend.cpp:76] Failed to create 'aufs' backend: AufsBackend requires
root privileges
W0825 15:50:06.527735  5682 backend.cpp:76] Failed to create 'bind' backend: BindBackend requires
root privileges
I0825 15:50:06.527773  5682 provisioner.cpp:255] Using default backend 'copy'
I0825 15:50:06.531003  5720 slave.cpp:252] Mesos agent started on (804)@172.17.0.3:35261
I0825 15:50:06.531035  5720 slave.cpp:253] Flags at startup: --acls="" --appc_simple_discovery_uri_prefix="http://"
--appc_store_dir="/tmp/Endpoint_SlaveEndpointTest_UnauthorizedRequest_1_R8bk5d/store/appc"
--authenticate_http_readonly="true" --authenticate_http_readwrite="true" --authenticatee="crammd5"
--authentication_backoff_factor="1secs" --authorizer="local" --cgroups_cpu_enable_pids_and_tids_count="false"
--cgroups_enable_cfs="false" --cgroups_hierarchy="/sys/fs/cgroup" --cgroups_limit_swap="false"
--cgroups_root="mesos" --container_disk_watch_interval="15secs" --containerizers="mesos" --credential="/tmp/Endpoint_SlaveEndpointTest_UnauthorizedRequest_1_R8bk5d/credential"
--default_role="*" --disallow_sharing_agent_pid_namespace="false" --disk_watch_interval="1mins"
--docker="docker" --docker_kill_orphans="true" --docker_registry="https://registry-1.docker.io"
--docker_remove_delay="6hrs" --docker_socket="/var/run/docker.sock" --docker_stop_timeout="0ns"
--docker_store_dir="/tmp/Endpoint_SlaveEndpointTest_UnauthorizedRequest_1_R8bk5d/store/docker"
--docker_volume_checkpoint_dir="/var/run/mesos/isolators/docker/volume" --enforce_container_disk_quota="false"
--executor_registration_timeout="1mins" --executor_reregistration_timeout="2secs" --executor_shutdown_grace_period="5secs"
--fetcher_cache_dir="/tmp/Endpoint_SlaveEndpointTest_UnauthorizedRequest_1_R8bk5d/fetch" --fetcher_cache_size="2GB"
--frameworks_home="" --gc_delay="1weeks" --gc_disk_headroom="0.1" --hadoop_home="" --help="false"
--hostname_lookup="true" --http_command_executor="false" --http_credentials="/tmp/Endpoint_SlaveEndpointTest_UnauthorizedRequest_1_R8bk5d/http_credentials"
--http_heartbeat_interval="30secs" --initialize_driver_logging="true" --isolation="posix/cpu,posix/mem"
--launcher="posix" --launcher_dir="/mesos/mesos-1.5.0/_build/src" --logbufsecs="0" --logging_level="INFO"
--max_completed_executors_per_framework="150" --oversubscribed_resources_interval="15secs"
--perf_duration="10secs" --perf_interval="1mins" --port="5051" --qos_correction_interval_min="0ns"
--quiet="false" --recover="reconnect" --recovery_timeout="15mins" --registration_backoff_factor="10ms"
--resources="cpus:2;gpus:0;mem:1024;disk:1024;ports:[31000-32000]" --revocable_cpu_low_priority="true"
--runtime_dir="/tmp/Endpoint_SlaveEndpointTest_UnauthorizedRequest_1_R8bk5d" --sandbox_directory="/mnt/mesos/sandbox"
--strict="true" --switch_user="true" --systemd_enable_support="true" --systemd_runtime_directory="/run/systemd/system"
--version="false" --work_dir="/tmp/Endpoint_SlaveEndpointTest_UnauthorizedRequest_1_LQK5HQ"
I0825 15:50:06.531592  5720 credentials.hpp:86] Loading credential for authentication from
'/tmp/Endpoint_SlaveEndpointTest_UnauthorizedRequest_1_R8bk5d/credential'
I0825 15:50:06.531782  5720 slave.cpp:285] Agent using credential for: test-principal
I0825 15:50:06.531813  5720 credentials.hpp:37] Loading credentials for authentication from
'/tmp/Endpoint_SlaveEndpointTest_UnauthorizedRequest_1_R8bk5d/http_credentials'
I0825 15:50:06.532143  5720 http.cpp:1026] Creating default 'basic' HTTP authenticator for
realm 'mesos-agent-readonly'
I0825 15:50:06.532323  5720 http.cpp:1026] Creating default 'basic' HTTP authenticator for
realm 'mesos-agent-readwrite'
I0825 15:50:06.533632  5720 slave.cpp:581] Agent resources: [{"name":"cpus","scalar":{"value":2.0},"type":"SCALAR"},{"name":"mem","scalar":{"value":1024.0},"type":"SCALAR"},{"name":"disk","scalar":{"value":1024.0},"type":"SCALAR"},{"name":"ports","ranges":{"range":[{"begin":31000,"end":32000}]},"type":"RANGES"}]
I0825 15:50:06.533852  5720 slave.cpp:589] Agent attributes: [  ]
I0825 15:50:06.533866  5720 slave.cpp:598] Agent hostname: fe77cb5869e5
I0825 15:50:06.533979  5723 status_update_manager.cpp:177] Pausing sending status updates
I0825 15:50:06.535226  5717 state.cpp:64] Recovering state from '/tmp/Endpoint_SlaveEndpointTest_UnauthorizedRequest_1_LQK5HQ/meta'
I0825 15:50:06.535495  5719 status_update_manager.cpp:203] Recovering status update manager
I0825 15:50:06.535676  5703 containerizer.cpp:643] Recovering containerizer
I0825 15:50:06.536844  5709 provisioner.cpp:416] Provisioner recovery complete
I0825 15:50:06.537183  5710 slave.cpp:6264] Finished recovery
I0825 15:50:06.537565  5710 slave.cpp:6446] Querying resource estimator for oversubscribable
resources
I0825 15:50:06.537768  5721 slave.cpp:6460] Received oversubscribable resources {} from the
resource estimator
I0825 15:50:06.539778  5714 process.cpp:3933] Handling HTTP event for process 'slave(804)'
with path: '/slave(804)/monitor/statistics.json'
I0825 15:50:06.540915  5717 http.cpp:1166] HTTP GET for /slave(804)/monitor/statistics.json
from 172.17.0.3:50896
I0825 15:50:06.540988  5717 http.cpp:957] Authorizing principal 'test-principal' to GET the
'/monitor/statistics.json' endpoint
I0825 15:50:06.543077  5682 slave.cpp:859] Agent terminating
[       OK ] Endpoint/SlaveEndpointTest.UnauthorizedRequest/1 (26 ms)
[ RUN      ] Endpoint/SlaveEndpointTest.UnauthorizedRequest/2
I0825 15:50:06.555310  5682 containerizer.cpp:288] Using isolation { environment_secret, posix/cpu,
posix/mem, filesystem/posix, network/cni }
W0825 15:50:06.556040  5682 backend.cpp:76] Failed to create 'aufs' backend: AufsBackend requires
root privileges
W0825 15:50:06.556190  5682 backend.cpp:76] Failed to create 'bind' backend: BindBackend requires
root privileges
I0825 15:50:06.556221  5682 provisioner.cpp:255] Using default backend 'copy'
I0825 15:50:06.559900  5718 slave.cpp:252] Mesos agent started on (805)@172.17.0.3:35261
I0825 15:50:06.559928  5718 slave.cpp:253] Flags at startup: --acls="" --appc_simple_discovery_uri_prefix="http://"
--appc_store_dir="/tmp/Endpoint_SlaveEndpointTest_UnauthorizedRequest_2_z0QGNJ/store/appc"
--authenticate_http_readonly="true" --authenticate_http_readwrite="true" --authenticatee="crammd5"
--authentication_backoff_factor="1secs" --authorizer="local" --cgroups_cpu_enable_pids_and_tids_count="false"
--cgroups_enable_cfs="false" --cgroups_hierarchy="/sys/fs/cgroup" --cgroups_limit_swap="false"
--cgroups_root="mesos" --container_disk_watch_interval="15secs" --containerizers="mesos" --credential="/tmp/Endpoint_SlaveEndpointTest_UnauthorizedRequest_2_z0QGNJ/credential"
--default_role="*" --disallow_sharing_agent_pid_namespace="false" --disk_watch_interval="1mins"
--docker="docker" --docker_kill_orphans="true" --docker_registry="https://registry-1.docker.io"
--docker_remove_delay="6hrs" --docker_socket="/var/run/docker.sock" --docker_stop_timeout="0ns"
--docker_store_dir="/tmp/Endpoint_SlaveEndpointTest_UnauthorizedRequest_2_z0QGNJ/store/docker"
--docker_volume_checkpoint_dir="/var/run/mesos/isolators/docker/volume" --enforce_container_disk_quota="false"
--executor_registration_timeout="1mins" --executor_reregistration_timeout="2secs" --executor_shutdown_grace_period="5secs"
--fetcher_cache_dir="/tmp/Endpoint_SlaveEndpointTest_UnauthorizedRequest_2_z0QGNJ/fetch" --fetcher_cache_size="2GB"
--frameworks_home="" --gc_delay="1weeks" --gc_disk_headroom="0.1" --hadoop_home="" --help="false"
--hostname_lookup="true" --http_command_executor="false" --http_credentials="/tmp/Endpoint_SlaveEndpointTest_UnauthorizedRequest_2_z0QGNJ/http_credentials"
--http_heartbeat_interval="30secs" --initialize_driver_logging="true" --isolation="posix/cpu,posix/mem"
--launcher="posix" --launcher_dir="/mesos/mesos-1.5.0/_build/src" --logbufsecs="0" --logging_level="INFO"
--max_completed_executors_per_framework="150" --oversubscribed_resources_interval="15secs"
--perf_duration="10secs" --perf_interval="1mins" --port="5051" --qos_correction_interval_min="0ns"
--quiet="false" --recover="reconnect" --recovery_timeout="15mins" --registration_backoff_factor="10ms"
--resources="cpus:2;gpus:0;mem:1024;disk:1024;ports:[31000-32000]" --revocable_cpu_low_priority="true"
--runtime_dir="/tmp/Endpoint_SlaveEndpointTest_UnauthorizedRequest_2_z0QGNJ" --sandbox_directory="/mnt/mesos/sandbox"
--strict="true" --switch_user="true" --systemd_enable_support="true" --systemd_runtime_directory="/run/systemd/system"
--version="false" --work_dir="/tmp/Endpoint_SlaveEndpointTest_UnauthorizedRequest_2_hy5tmm"
I0825 15:50:06.560328  5718 credentials.hpp:86] Loading credential for authentication from
'/tmp/Endpoint_SlaveEndpointTest_UnauthorizedRequest_2_z0QGNJ/credential'
I0825 15:50:06.560499  5718 slave.cpp:285] Agent using credential for: test-principal
I0825 15:50:06.560524  5718 credentials.hpp:37] Loading credentials for authentication from
'/tmp/Endpoint_SlaveEndpointTest_UnauthorizedRequest_2_z0QGNJ/http_credentials'
I0825 15:50:06.560927  5718 http.cpp:1026] Creating default 'basic' HTTP authenticator for
realm 'mesos-agent-readonly'
I0825 15:50:06.561136  5718 http.cpp:1026] Creating default 'basic' HTTP authenticator for
realm 'mesos-agent-readwrite'
I0825 15:50:06.563218  5718 slave.cpp:581] Agent resources: [{"name":"cpus","scalar":{"value":2.0},"type":"SCALAR"},{"name":"mem","scalar":{"value":1024.0},"type":"SCALAR"},{"name":"disk","scalar":{"value":1024.0},"type":"SCALAR"},{"name":"ports","ranges":{"range":[{"begin":31000,"end":32000}]},"type":"RANGES"}]
I0825 15:50:06.563629  5718 slave.cpp:589] Agent attributes: [  ]
I0825 15:50:06.563663  5718 slave.cpp:598] Agent hostname: fe77cb5869e5
I0825 15:50:06.563829  5719 status_update_manager.cpp:177] Pausing sending status updates
I0825 15:50:06.565389  5723 state.cpp:64] Recovering state from '/tmp/Endpoint_SlaveEndpointTest_UnauthorizedRequest_2_hy5tmm/meta'
I0825 15:50:06.565644  5711 status_update_manager.cpp:203] Recovering status update manager
I0825 15:50:06.565827  5712 containerizer.cpp:643] Recovering containerizer
I0825 15:50:06.567157  5708 provisioner.cpp:416] Provisioner recovery complete
I0825 15:50:06.567468  5718 slave.cpp:6264] Finished recovery
I0825 15:50:06.567890  5718 slave.cpp:6446] Querying resource estimator for oversubscribable
resources
I0825 15:50:06.568105  5720 slave.cpp:6460] Received oversubscribable resources {} from the
resource estimator
I0825 15:50:06.570233  5715 process.cpp:3933] Handling HTTP event for process 'slave(805)'
with path: '/slave(805)/containers'
I0825 15:50:06.571274  5701 http.cpp:1166] HTTP GET for /slave(805)/containers from 172.17.0.3:50898
I0825 15:50:06.571336  5701 http.cpp:957] Authorizing principal 'test-principal' to GET the
'/containers' endpoint
I0825 15:50:06.573153  5710 slave.cpp:859] Agent terminating
[       OK ] Endpoint/SlaveEndpointTest.UnauthorizedRequest/2 (30 ms)
[ RUN      ] Endpoint/SlaveEndpointTest.NoAuthorizer/0
I0825 15:50:06.585458  5682 containerizer.cpp:288] Using isolation { environment_secret, posix/cpu,
posix/mem, filesystem/posix, network/cni }
W0825 15:50:06.586156  5682 backend.cpp:76] Failed to create 'aufs' backend: AufsBackend requires
root privileges
W0825 15:50:06.586310  5682 backend.cpp:76] Failed to create 'bind' backend: BindBackend requires
root privileges
I0825 15:50:06.586341  5682 provisioner.cpp:255] Using default backend 'copy'
I0825 15:50:06.588696  5682 cluster.cpp:448] Creating default 'local' authorizer
I0825 15:50:06.591080  5708 slave.cpp:252] Mesos agent started on (806)@172.17.0.3:35261
I0825 15:50:06.591106  5708 slave.cpp:253] Flags at startup: --acls="" --appc_simple_discovery_uri_prefix="http://"
--appc_store_dir="/tmp/Endpoint_SlaveEndpointTest_NoAuthorizer_0_HAuRNf/store/appc" --authenticate_http_readonly="true"
--authenticate_http_readwrite="true" --authenticatee="crammd5" --authentication_backoff_factor="1secs"
--authorizer="local" --cgroups_cpu_enable_pids_and_tids_count="false" --cgroups_enable_cfs="false"
--cgroups_hierarchy="/sys/fs/cgroup" --cgroups_limit_swap="false" --cgroups_root="mesos" --container_disk_watch_interval="15secs"
--containerizers="mesos" --credential="/tmp/Endpoint_SlaveEndpointTest_NoAuthorizer_0_HAuRNf/credential"
--default_role="*" --disallow_sharing_agent_pid_namespace="false" --disk_watch_interval="1mins"
--docker="docker" --docker_kill_orphans="true" --docker_registry="https://registry-1.docker.io"
--docker_remove_delay="6hrs" --docker_socket="/var/run/docker.sock" --docker_stop_timeout="0ns"
--docker_store_dir="/tmp/Endpoint_SlaveEndpointTest_NoAuthorizer_0_HAuRNf/store/docker" --docker_volume_checkpoint_dir="/var/run/mesos/isolators/docker/volume"
--enforce_container_disk_quota="false" --executor_registration_timeout="1mins" --executor_reregistration_timeout="2secs"
--executor_shutdown_grace_period="5secs" --fetcher_cache_dir="/tmp/Endpoint_SlaveEndpointTest_NoAuthorizer_0_HAuRNf/fetch"
--fetcher_cache_size="2GB" --frameworks_home="" --gc_delay="1weeks" --gc_disk_headroom="0.1"
--hadoop_home="" --help="false" --hostname_lookup="true" --http_command_executor="false" --http_credentials="/tmp/Endpoint_SlaveEndpointTest_NoAuthorizer_0_HAuRNf/http_credentials"
--http_heartbeat_interval="30secs" --initialize_driver_logging="true" --isolation="posix/cpu,posix/mem"
--launcher="posix" --launcher_dir="/mesos/mesos-1.5.0/_build/src" --logbufsecs="0" --logging_level="INFO"
--max_completed_executors_per_framework="150" --oversubscribed_resources_interval="15secs"
--perf_duration="10secs" --perf_interval="1mins" --port="5051" --qos_correction_interval_min="0ns"
--quiet="false" --recover="reconnect" --recovery_timeout="15mins" --registration_backoff_factor="10ms"
--resources="cpus:2;gpus:0;mem:1024;disk:1024;ports:[31000-32000]" --revocable_cpu_low_priority="true"
--runtime_dir="/tmp/Endpoint_SlaveEndpointTest_NoAuthorizer_0_HAuRNf" --sandbox_directory="/mnt/mesos/sandbox"
--strict="true" --switch_user="true" --systemd_enable_support="true" --systemd_runtime_directory="/run/systemd/system"
--version="false" --work_dir="/tmp/Endpoint_SlaveEndpointTest_NoAuthorizer_0_PqEfiS"
I0825 15:50:06.591441  5708 credentials.hpp:86] Loading credential for authentication from
'/tmp/Endpoint_SlaveEndpointTest_NoAuthorizer_0_HAuRNf/credential'
I0825 15:50:06.591581  5708 slave.cpp:285] Agent using credential for: test-principal
I0825 15:50:06.591603  5708 credentials.hpp:37] Loading credentials for authentication from
'/tmp/Endpoint_SlaveEndpointTest_NoAuthorizer_0_HAuRNf/http_credentials'
I0825 15:50:06.591821  5708 http.cpp:1026] Creating default 'basic' HTTP authenticator for
realm 'mesos-agent-readonly'
I0825 15:50:06.591965  5708 http.cpp:1026] Creating default 'basic' HTTP authenticator for
realm 'mesos-agent-readwrite'
I0825 15:50:06.593245  5708 slave.cpp:581] Agent resources: [{"name":"cpus","scalar":{"value":2.0},"type":"SCALAR"},{"name":"mem","scalar":{"value":1024.0},"type":"SCALAR"},{"name":"disk","scalar":{"value":1024.0},"type":"SCALAR"},{"name":"ports","ranges":{"range":[{"begin":31000,"end":32000}]},"type":"RANGES"}]
I0825 15:50:06.593467  5708 slave.cpp:589] Agent attributes: [  ]
I0825 15:50:06.593479  5708 slave.cpp:598] Agent hostname: fe77cb5869e5
I0825 15:50:06.593582  5710 status_update_manager.cpp:177] Pausing sending status updates
I0825 15:50:06.594882  5714 state.cpp:64] Recovering state from '/tmp/Endpoint_SlaveEndpointTest_NoAuthorizer_0_PqEfiS/meta'
I0825 15:50:06.595149  5706 status_update_manager.cpp:203] Recovering status update manager
I0825 15:50:06.595322  5706 containerizer.cpp:643] Recovering containerizer
I0825 15:50:06.596489  5709 provisioner.cpp:416] Provisioner recovery complete
I0825 15:50:06.596776  5711 slave.cpp:6264] Finished recovery
I0825 15:50:06.597157  5711 slave.cpp:6446] Querying resource estimator for oversubscribable
resources
I0825 15:50:06.597375  5719 slave.cpp:6460] Received oversubscribable resources {} from the
resource estimator
I0825 15:50:06.599417  5703 process.cpp:3933] Handling HTTP event for process 'slave(806)'
with path: '/slave(806)/monitor/statistics'
I0825 15:50:06.600519  5720 http.cpp:1166] HTTP GET for /slave(806)/monitor/statistics from
172.17.0.3:50900
I0825 15:50:06.600589  5720 http.cpp:957] Authorizing principal 'test-principal' to GET the
'/monitor/statistics' endpoint
I0825 15:50:06.603873  5702 slave.cpp:859] Agent terminating
[       OK ] Endpoint/SlaveEndpointTest.NoAuthorizer/0 (33 ms)
[ RUN      ] Endpoint/SlaveEndpointTest.NoAuthorizer/1
I0825 15:50:06.617141  5682 containerizer.cpp:288] Using isolation { environment_secret, posix/cpu,
posix/mem, filesystem/posix, network/cni }
W0825 15:50:06.617616  5682 backend.cpp:76] Failed to create 'aufs' backend: AufsBackend requires
root privileges
W0825 15:50:06.617719  5682 backend.cpp:76] Failed to create 'bind' backend: BindBackend requires
root privileges
I0825 15:50:06.617750  5682 provisioner.cpp:255] Using default backend 'copy'
I0825 15:50:06.619318  5682 cluster.cpp:448] Creating default 'local' authorizer
I0825 15:50:06.621119  5708 slave.cpp:252] Mesos agent started on (807)@172.17.0.3:35261
I0825 15:50:06.621141  5708 slave.cpp:253] Flags at startup: --acls="" --appc_simple_discovery_uri_prefix="http://"
--appc_store_dir="/tmp/Endpoint_SlaveEndpointTest_NoAuthorizer_1_hAhl7L/store/appc" --authenticate_http_readonly="true"
--authenticate_http_readwrite="true" --authenticatee="crammd5" --authentication_backoff_factor="1secs"
--authorizer="local" --cgroups_cpu_enable_pids_and_tids_count="false" --cgroups_enable_cfs="false"
--cgroups_hierarchy="/sys/fs/cgroup" --cgroups_limit_swap="false" --cgroups_root="mesos" --container_disk_watch_interval="15secs"
--containerizers="mesos" --credential="/tmp/Endpoint_SlaveEndpointTest_NoAuthorizer_1_hAhl7L/credential"
--default_role="*" --disallow_sharing_agent_pid_namespace="false" --disk_watch_interval="1mins"
--docker="docker" --docker_kill_orphans="true" --docker_registry="https://registry-1.docker.io"
--docker_remove_delay="6hrs" --docker_socket="/var/run/docker.sock" --docker_stop_timeout="0ns"
--docker_store_dir="/tmp/Endpoint_SlaveEndpointTest_NoAuthorizer_1_hAhl7L/store/docker" --docker_volume_checkpoint_dir="/var/run/mesos/isolators/docker/volume"
--enforce_container_disk_quota="false" --executor_registration_timeout="1mins" --executor_reregistration_timeout="2secs"
--executor_shutdown_grace_period="5secs" --fetcher_cache_dir="/tmp/Endpoint_SlaveEndpointTest_NoAuthorizer_1_hAhl7L/fetch"
--fetcher_cache_size="2GB" --frameworks_home="" --gc_delay="1weeks" --gc_disk_headroom="0.1"
--hadoop_home="" --help="false" --hostname_lookup="true" --http_command_executor="false" --http_credentials="/tmp/Endpoint_SlaveEndpointTest_NoAuthorizer_1_hAhl7L/http_credentials"
--http_heartbeat_interval="30secs" --initialize_driver_logging="true" --isolation="posix/cpu,posix/mem"
--launcher="posix" --launcher_dir="/mesos/mesos-1.5.0/_build/src" --logbufsecs="0" --logging_level="INFO"
--max_completed_executors_per_framework="150" --oversubscribed_resources_interval="15secs"
--perf_duration="10secs" --perf_interval="1mins" --port="5051" --qos_correction_interval_min="0ns"
--quiet="false" --recover="reconnect" --recovery_timeout="15mins" --registration_backoff_factor="10ms"
--resources="cpus:2;gpus:0;mem:1024;disk:1024;ports:[31000-32000]" --revocable_cpu_low_priority="true"
--runtime_dir="/tmp/Endpoint_SlaveEndpointTest_NoAuthorizer_1_hAhl7L" --sandbox_directory="/mnt/mesos/sandbox"
--strict="true" --switch_user="true" --systemd_enable_support="true" --systemd_runtime_directory="/run/systemd/system"
--version="false" --work_dir="/tmp/Endpoint_SlaveEndpointTest_NoAuthorizer_1_ntvKwo"
I0825 15:50:06.621469  5708 credentials.hpp:86] Loading credential for authentication from
'/tmp/Endpoint_SlaveEndpointTest_NoAuthorizer_1_hAhl7L/credential'
I0825 15:50:06.621606  5708 slave.cpp:285] Agent using credential for: test-principal
I0825 15:50:06.621629  5708 credentials.hpp:37] Loading credentials for authentication from
'/tmp/Endpoint_SlaveEndpointTest_NoAuthorizer_1_hAhl7L/http_credentials'
I0825 15:50:06.621850  5708 http.cpp:1026] Creating default 'basic' HTTP authenticator for
realm 'mesos-agent-readonly'
I0825 15:50:06.621999  5708 http.cpp:1026] Creating default 'basic' HTTP authenticator for
realm 'mesos-agent-readwrite'
I0825 15:50:06.623276  5708 slave.cpp:581] Agent resources: [{"name":"cpus","scalar":{"value":2.0},"type":"SCALAR"},{"name":"mem","scalar":{"value":1024.0},"type":"SCALAR"},{"name":"disk","scalar":{"value":1024.0},"type":"SCALAR"},{"name":"ports","ranges":{"range":[{"begin":31000,"end":32000}]},"type":"RANGES"}]
I0825 15:50:06.623498  5708 slave.cpp:589] Agent attributes: [  ]
I0825 15:50:06.623513  5708 slave.cpp:598] Agent hostname: fe77cb5869e5
I0825 15:50:06.623633  5702 status_update_manager.cpp:177] Pausing sending status updates
I0825 15:50:06.624879  5723 state.cpp:64] Recovering state from '/tmp/Endpoint_SlaveEndpointTest_NoAuthorizer_1_ntvKwo/meta'
I0825 15:50:06.625126  5701 status_update_manager.cpp:203] Recovering status update manager
I0825 15:50:06.625280  5710 containerizer.cpp:643] Recovering containerizer
I0825 15:50:06.626425  5713 provisioner.cpp:416] Provisioner recovery complete
I0825 15:50:06.626691  5715 slave.cpp:6264] Finished recovery
I0825 15:50:06.627100  5715 slave.cpp:6446] Querying resource estimator for oversubscribable
resources
I0825 15:50:06.627300  5717 slave.cpp:6460] Received oversubscribable resources {} from the
resource estimator
I0825 15:50:06.629365  5702 process.cpp:3933] Handling HTTP event for process 'slave(807)'
with path: '/slave(807)/monitor/statistics.json'
I0825 15:50:06.630451  5722 http.cpp:1166] HTTP GET for /slave(807)/monitor/statistics.json
from 172.17.0.3:50902
I0825 15:50:06.630512  5722 http.cpp:957] Authorizing principal 'test-principal' to GET the
'/monitor/statistics.json' endpoint
I0825 15:50:06.633024  5723 slave.cpp:859] Agent terminating
[       OK ] Endpoint/SlaveEndpointTest.NoAuthorizer/1 (26 ms)
[ RUN      ] Endpoint/SlaveEndpointTest.NoAuthorizer/2
I0825 15:50:06.643605  5682 containerizer.cpp:288] Using isolation { environment_secret, posix/cpu,
posix/mem, filesystem/posix, network/cni }
W0825 15:50:06.644085  5682 backend.cpp:76] Failed to create 'aufs' backend: AufsBackend requires
root privileges
W0825 15:50:06.644189  5682 backend.cpp:76] Failed to create 'bind' backend: BindBackend requires
root privileges
I0825 15:50:06.644222  5682 provisioner.cpp:255] Using default backend 'copy'
I0825 15:50:06.645792  5682 cluster.cpp:448] Creating default 'local' authorizer
I0825 15:50:06.647554  5722 slave.cpp:252] Mesos agent started on (808)@172.17.0.3:35261
I0825 15:50:06.647578  5722 slave.cpp:253] Flags at startup: --acls="" --appc_simple_discovery_uri_prefix="http://"
--appc_store_dir="/tmp/Endpoint_SlaveEndpointTest_NoAuthorizer_2_Jki8Gi/store/appc" --authenticate_http_readonly="true"
--authenticate_http_readwrite="true" --authenticatee="crammd5" --authentication_backoff_factor="1secs"
--authorizer="local" --cgroups_cpu_enable_pids_and_tids_count="false" --cgroups_enable_cfs="false"
--cgroups_hierarchy="/sys/fs/cgroup" --cgroups_limit_swap="false" --cgroups_root="mesos" --container_disk_watch_interval="15secs"
--containerizers="mesos" --credential="/tmp/Endpoint_SlaveEndpointTest_NoAuthorizer_2_Jki8Gi/credential"
--default_role="*" --disallow_sharing_agent_pid_namespace="false" --disk_watch_interval="1mins"
--docker="docker" --docker_kill_orphans="true" --docker_registry="https://registry-1.docker.io"
--docker_remove_delay="6hrs" --docker_socket="/var/run/docker.sock" --docker_stop_timeout="0ns"
--docker_store_dir="/tmp/Endpoint_SlaveEndpointTest_NoAuthorizer_2_Jki8Gi/store/docker" --docker_volume_checkpoint_dir="/var/run/mesos/isolators/docker/volume"
--enforce_container_disk_quota="false" --executor_registration_timeout="1mins" --executor_reregistration_timeout="2secs"
--executor_shutdown_grace_period="5secs" --fetcher_cache_dir="/tmp/Endpoint_SlaveEndpointTest_NoAuthorizer_2_Jki8Gi/fetch"
--fetcher_cache_size="2GB" --frameworks_home="" --gc_delay="1weeks" --gc_disk_headroom="0.1"
--hadoop_home="" --help="false" --hostname_lookup="true" --http_command_executor="false" --http_credentials="/tmp/Endpoint_SlaveEndpointTest_NoAuthorizer_2_Jki8Gi/http_credentials"
--http_heartbeat_interval="30secs" --initialize_driver_logging="true" --isolation="posix/cpu,posix/mem"
--launcher="posix" --launcher_dir="/mesos/mesos-1.5.0/_build/src" --logbufsecs="0" --logging_level="INFO"
--max_completed_executors_per_framework="150" --oversubscribed_resources_interval="15secs"
--perf_duration="10secs" --perf_interval="1mins" --port="5051" --qos_correction_interval_min="0ns"
--quiet="false" --recover="reconnect" --recovery_timeout="15mins" --registration_backoff_factor="10ms"
--resources="cpus:2;gpus:0;mem:1024;disk:1024;ports:[31000-32000]" --revocable_cpu_low_priority="true"
--runtime_dir="/tmp/Endpoint_SlaveEndpointTest_NoAuthorizer_2_Jki8Gi" --sandbox_directory="/mnt/mesos/sandbox"
--strict="true" --switch_user="true" --systemd_enable_support="true" --systemd_runtime_directory="/run/systemd/system"
--version="false" --work_dir="/tmp/Endpoint_SlaveEndpointTest_NoAuthorizer_2_dKXA2U"
I0825 15:50:06.647948  5722 credentials.hpp:86] Loading credential for authentication from
'/tmp/Endpoint_SlaveEndpointTest_NoAuthorizer_2_Jki8Gi/credential'
I0825 15:50:06.648093  5722 slave.cpp:285] Agent using credential for: test-principal
I0825 15:50:06.648115  5722 credentials.hpp:37] Loading credentials for authentication from
'/tmp/Endpoint_SlaveEndpointTest_NoAuthorizer_2_Jki8Gi/http_credentials'
I0825 15:50:06.648336  5722 http.cpp:1026] Creating default 'basic' HTTP authenticator for
realm 'mesos-agent-readonly'
I0825 15:50:06.648485  5722 http.cpp:1026] Creating default 'basic' HTTP authenticator for
realm 'mesos-agent-readwrite'
I0825 15:50:06.649798  5722 slave.cpp:581] Agent resources: [{"name":"cpus","scalar":{"value":2.0},"type":"SCALAR"},{"name":"mem","scalar":{"value":1024.0},"type":"SCALAR"},{"name":"disk","scalar":{"value":1024.0},"type":"SCALAR"},{"name":"ports","ranges":{"range":[{"begin":31000,"end":32000}]},"type":"RANGES"}]
I0825 15:50:06.650023  5722 slave.cpp:589] Agent attributes: [  ]
I0825 15:50:06.650037  5722 slave.cpp:598] Agent hostname: fe77cb5869e5
I0825 15:50:06.650161  5716 status_update_manager.cpp:177] Pausing sending status updates
I0825 15:50:06.651383  5724 state.cpp:64] Recovering state from '/tmp/Endpoint_SlaveEndpointTest_NoAuthorizer_2_dKXA2U/meta'
I0825 15:50:06.651655  5719 status_update_manager.cpp:203] Recovering status update manager
I0825 15:50:06.651813  5708 containerizer.cpp:643] Recovering containerizer
I0825 15:50:06.653008  5711 provisioner.cpp:416] Provisioner recovery complete
I0825 15:50:06.653339  5717 slave.cpp:6264] Finished recovery
I0825 15:50:06.653738  5717 slave.cpp:6446] Querying resource estimator for oversubscribable
resources
I0825 15:50:06.653941  5721 slave.cpp:6460] Received oversubscribable resources {} from the
resource estimator
I0825 15:50:06.655927  5718 process.cpp:3933] Handling HTTP event for process 'slave(808)'
with path: '/slave(808)/containers'
I0825 15:50:06.657033  5714 http.cpp:1166] HTTP GET for /slave(808)/containers from 172.17.0.3:50904
I0825 15:50:06.657104  5714 http.cpp:957] Authorizing principal 'test-principal' to GET the
'/containers' endpoint
I0825 15:50:06.660478  5682 slave.cpp:859] Agent terminating
[       OK ] Endpoint/SlaveEndpointTest.NoAuthorizer/2 (28 ms)
[----------] 9 tests from Endpoint/SlaveEndpointTest (261 ms total)

[----------] 2 tests from ContainerizerType/DefaultContainerDNSFlagTest
[ RUN      ] ContainerizerType/DefaultContainerDNSFlagTest.ValidateFlag/0
[       OK ] ContainerizerType/DefaultContainerDNSFlagTest.ValidateFlag/0 (10 ms)
[ RUN      ] ContainerizerType/DefaultContainerDNSFlagTest.ValidateFlag/1
[       OK ] ContainerizerType/DefaultContainerDNSFlagTest.ValidateFlag/1 (9 ms)
[----------] 2 tests from ContainerizerType/DefaultContainerDNSFlagTest (19 ms total)

[----------] Global test environment tear-down
[==========] 1660 tests from 182 test cases ran. (503642 ms total)
[  PASSED  ] 1659 tests.
[  FAILED  ] 1 test, listed below:
[  FAILED  ] ExamplesTest.PersistentVolumeFramework

 1 FAILED TEST
  YOU HAVE 20 DISABLED TESTS

I0825 15:50:06.743933  5725 process.cpp:1072] Failed to accept socket: future discarded
make[4]: *** [check-local] Error 1
make[4]: Leaving directory `/mesos/mesos-1.5.0/_build/src'
make[3]: *** [check-am] Error 2
make[3]: Leaving directory `/mesos/mesos-1.5.0/_build/src'
make[2]: *** [check] Error 2
make[2]: Leaving directory `/mesos/mesos-1.5.0/_build/src'
make[1]: *** [check-recursive] Error 1
make[1]: Leaving directory `/mesos/mesos-1.5.0/_build'
make: *** [distcheck] Error 1
+ docker rmi mesos-1503673042-4235
Untagged: mesos-1503673042-4235:latest
Deleted: sha256:1357a8a955ca6435c57906e50f026a562fa7226523058ce294a386a092a28577
Deleted: sha256:d64f56083f6c4a2582d7fd5c88026faf0cf1d19ab325e22d5bf2994bf9c56882
Deleted: sha256:fc36d62586b923e583e81c401354294235aee9b743c894d6a256688fcd319081
Deleted: sha256:2bf4341a7e807f744ab78122930e4272b62942d83b5ce6224e4e8d68839d6181
Deleted: sha256:ba5b5b38ccb9c1269d2da15fc0afda28635f8f7aae86e8ec32993c0e3300378a
Deleted: sha256:61e43434ace75377c7f025e6ea83aa72dede55f75ae785065dd0d91334b74084
Deleted: sha256:7e8c0b87624466af572a7bbafbbdbafd707ceea8231668b239a8d5961a91c692
Deleted: sha256:08ecb11b1fd68c7b2d9b2d0aa4283a34dc60a1438c9faea0b8336527144d8540
Deleted: sha256:4fd31ae07c46a4e069c14cb16d719ac2de59dfe77ff584a8077d10a890884ef3
Deleted: sha256:885550995b2df51c7af374b62807c33766dbe5d7aac6f4630c48365c3a53da9b
Deleted: sha256:c87e6a011729e111981cd818ed670522f9c6ee2feda409a28fdfdfb82cc30033
Deleted: sha256:888c3dab179680284b25c38bb73c58ad36bf150ef39c98cd1149876cb3634d84
Deleted: sha256:a8d408cb1ef354c67f92e6e32ba5fee1570046c7a68f7285f64ba7fe73d6e0b8
Deleted: sha256:ec6f385ed47011ff2847d90525b3377d6da9c56b9b0b8f16f548fd3194acf53c
Deleted: sha256:92f329da17131e688f28e689054b4c7be6bfbef99b75cd384ab87c8986275534
Deleted: sha256:801ab3bc295906c93a8dad556f0d5fd3d024326f9c8d3d636982edfbd0fe54d9
Deleted: sha256:544f412fe15aca822f7c0c2fa696075017808559970ca427733c9d63ebedc3d3
Deleted: sha256:8b26c5f04c3e7f2f8a0a0c0541163ee5596b9efec2fe77d0f8bee63d75d1159f
Deleted: sha256:8d87c68c6e802780d4fb0c705f2d74aaf42657e35792f5071d097ce3580511e1
Deleted: sha256:6a523a0d2f1b7131e66fa69634bf917bb449209fcd7dd5eb628a3e18c3cd77c6
Deleted: sha256:c2332b2da0c9898c78e5b37911a0fc200b9d25cc2b870a2cda129e01fd87977b
Deleted: sha256:cd96046bfd3111640d4119507a885aec47475a94078f13c225a40b48cf86e394
Deleted: sha256:eab5f854e5743e82f18047270e8c9cf47f8f043506912949e3b82ee7f9cf61aa
Deleted: sha256:505e8842a58fcc0514e0a010173bf2c64289b70d73135b626016aac042b90bc0
Build step 'Execute shell' marked build as failure
Not sending mail to unregistered user zhq527725@gmail.com

Mime
View raw message