mesos-builds mailing list archives

Site index · List index
Message view « Date » · « Thread »
Top « Date » · « Thread »
From Apache Jenkins Server <jenk...@builds.apache.org>
Subject Build failed in Jenkins: Mesos-Reviewbot #19130
Date Wed, 30 Aug 2017 19:34:32 GMT
See <https://builds.apache.org/job/Mesos-Reviewbot/19130/display/redirect?page=changes>

Changes:

[xujyan] Removed an unused function argument.

------------------------------------------
[...truncated 31.09 MB...]
I0830 19:34:27.739433  5820 slave.cpp:252] Mesos agent started on (806)@172.17.0.7:36899
I0830 19:34:27.739480  5820 slave.cpp:253] Flags at startup: --acls="" --appc_simple_discovery_uri_prefix="http://"
--appc_store_dir="/tmp/Endpoint_SlaveEndpointTest_AuthorizedRequest_2_m9ZI9Q/store/appc" --authenticate_http_readonly="true"
--authenticate_http_readwrite="true" --authenticatee="crammd5" --authentication_backoff_factor="1secs"
--authorizer="local" --cgroups_cpu_enable_pids_and_tids_count="false" --cgroups_enable_cfs="false"
--cgroups_hierarchy="/sys/fs/cgroup" --cgroups_limit_swap="false" --cgroups_root="mesos" --container_disk_watch_interval="15secs"
--containerizers="mesos" --credential="/tmp/Endpoint_SlaveEndpointTest_AuthorizedRequest_2_m9ZI9Q/credential"
--default_role="*" --disallow_sharing_agent_pid_namespace="false" --disk_watch_interval="1mins"
--docker="docker" --docker_kill_orphans="true" --docker_registry="https://registry-1.docker.io"
--docker_remove_delay="6hrs" --docker_socket="/var/run/docker.sock" --docker_stop_timeout="0ns"
--docker_store_dir="/tmp/Endpoint_SlaveEndpointTest_AuthorizedRequest_2_m9ZI9Q/store/docker"
--docker_volume_checkpoint_dir="/var/run/mesos/isolators/docker/volume" --enforce_container_disk_quota="false"
--executor_registration_timeout="1mins" --executor_reregistration_timeout="2secs" --executor_shutdown_grace_period="5secs"
--fetcher_cache_dir="/tmp/Endpoint_SlaveEndpointTest_AuthorizedRequest_2_m9ZI9Q/fetch" --fetcher_cache_size="2GB"
--frameworks_home="" --gc_delay="1weeks" --gc_disk_headroom="0.1" --hadoop_home="" --help="false"
--hostname_lookup="true" --http_command_executor="false" --http_credentials="/tmp/Endpoint_SlaveEndpointTest_AuthorizedRequest_2_m9ZI9Q/http_credentials"
--http_heartbeat_interval="30secs" --initialize_driver_logging="true" --isolation="posix/cpu,posix/mem"
--launcher="posix" --launcher_dir="/mesos/mesos-1.5.0/_build/src" --logbufsecs="0" --logging_level="INFO"
--max_completed_executors_per_framework="150" --oversubscribed_resources_interval="15secs"
--perf_duration="10secs" --perf_interval="1mins" --port="5051" --qos_correction_interval_min="0ns"
--quiet="false" --recover="reconnect" --recovery_timeout="15mins" --registration_backoff_factor="10ms"
--resources="cpus:2;gpus:0;mem:1024;disk:1024;ports:[31000-32000]" --revocable_cpu_low_priority="true"
--runtime_dir="/tmp/Endpoint_SlaveEndpointTest_AuthorizedRequest_2_m9ZI9Q" --sandbox_directory="/mnt/mesos/sandbox"
--strict="true" --switch_user="true" --systemd_enable_support="true" --systemd_runtime_directory="/run/systemd/system"
--version="false" --work_dir="/tmp/Endpoint_SlaveEndpointTest_AuthorizedRequest_2_cmPOrV"
--zk_session_timeout="10secs"
I0830 19:34:27.740221  5820 credentials.hpp:86] Loading credential for authentication from
'/tmp/Endpoint_SlaveEndpointTest_AuthorizedRequest_2_m9ZI9Q/credential'
I0830 19:34:27.740546  5820 slave.cpp:285] Agent using credential for: test-principal
I0830 19:34:27.740581  5820 credentials.hpp:37] Loading credentials for authentication from
'/tmp/Endpoint_SlaveEndpointTest_AuthorizedRequest_2_m9ZI9Q/http_credentials'
I0830 19:34:27.741066  5820 http.cpp:1045] Creating default 'basic' HTTP authenticator for
realm 'mesos-agent-readonly'
I0830 19:34:27.741328  5820 http.cpp:1045] Creating default 'basic' HTTP authenticator for
realm 'mesos-agent-readwrite'
I0830 19:34:27.743861  5820 slave.cpp:581] Agent resources: [{"name":"cpus","scalar":{"value":2.0},"type":"SCALAR"},{"name":"mem","scalar":{"value":1024.0},"type":"SCALAR"},{"name":"disk","scalar":{"value":1024.0},"type":"SCALAR"},{"name":"ports","ranges":{"range":[{"begin":31000,"end":32000}]},"type":"RANGES"}]
I0830 19:34:27.744259  5820 slave.cpp:589] Agent attributes: [  ]
I0830 19:34:27.744357  5820 slave.cpp:598] Agent hostname: 811dd01bde70
I0830 19:34:27.744900  5813 status_update_manager.cpp:177] Pausing sending status updates
I0830 19:34:27.747161  5809 state.cpp:64] Recovering state from '/tmp/Endpoint_SlaveEndpointTest_AuthorizedRequest_2_cmPOrV/meta'
I0830 19:34:27.747591  5821 status_update_manager.cpp:203] Recovering status update manager
I0830 19:34:27.747853  5803 containerizer.cpp:646] Recovering containerizer
I0830 19:34:27.749789  5822 provisioner.cpp:416] Provisioner recovery complete
I0830 19:34:27.750413  5820 slave.cpp:6296] Finished recovery
I0830 19:34:27.751159  5820 slave.cpp:6478] Querying resource estimator for oversubscribable
resources
I0830 19:34:27.751510  5807 slave.cpp:6492] Received oversubscribable resources {} from the
resource estimator
I0830 19:34:27.755105  5813 process.cpp:3956] Handling HTTP event for process 'slave(806)'
with path: '/slave(806)/containers'
I0830 19:34:27.756732  5817 http.cpp:1185] HTTP GET for /slave(806)/containers from 172.17.0.7:48408
I0830 19:34:27.756863  5817 http.cpp:976] Authorizing principal 'test-principal' to GET the
'/containers' endpoint
I0830 19:34:27.762549  5780 slave.cpp:859] Agent terminating
[       OK ] Endpoint/SlaveEndpointTest.AuthorizedRequest/2 (42 ms)
[ RUN      ] Endpoint/SlaveEndpointTest.UnauthorizedRequest/0
I0830 19:34:27.776998  5780 containerizer.cpp:290] Using isolation { environment_secret, posix/cpu,
posix/mem, filesystem/posix, network/cni }
W0830 19:34:27.777899  5780 backend.cpp:76] Failed to create 'aufs' backend: AufsBackend requires
root privileges
W0830 19:34:27.778066  5780 backend.cpp:76] Failed to create 'bind' backend: BindBackend requires
root privileges
I0830 19:34:27.778116  5780 provisioner.cpp:255] Using default backend 'copy'
I0830 19:34:27.783608  5821 slave.cpp:252] Mesos agent started on (807)@172.17.0.7:36899
I0830 19:34:27.783648  5821 slave.cpp:253] Flags at startup: --acls="" --appc_simple_discovery_uri_prefix="http://"
--appc_store_dir="/tmp/Endpoint_SlaveEndpointTest_UnauthorizedRequest_0_SndSkA/store/appc"
--authenticate_http_readonly="true" --authenticate_http_readwrite="true" --authenticatee="crammd5"
--authentication_backoff_factor="1secs" --authorizer="local" --cgroups_cpu_enable_pids_and_tids_count="false"
--cgroups_enable_cfs="false" --cgroups_hierarchy="/sys/fs/cgroup" --cgroups_limit_swap="false"
--cgroups_root="mesos" --container_disk_watch_interval="15secs" --containerizers="mesos" --credential="/tmp/Endpoint_SlaveEndpointTest_UnauthorizedRequest_0_SndSkA/credential"
--default_role="*" --disallow_sharing_agent_pid_namespace="false" --disk_watch_interval="1mins"
--docker="docker" --docker_kill_orphans="true" --docker_registry="https://registry-1.docker.io"
--docker_remove_delay="6hrs" --docker_socket="/var/run/docker.sock" --docker_stop_timeout="0ns"
--docker_store_dir="/tmp/Endpoint_SlaveEndpointTest_UnauthorizedRequest_0_SndSkA/store/docker"
--docker_volume_checkpoint_dir="/var/run/mesos/isolators/docker/volume" --enforce_container_disk_quota="false"
--executor_registration_timeout="1mins" --executor_reregistration_timeout="2secs" --executor_shutdown_grace_period="5secs"
--fetcher_cache_dir="/tmp/Endpoint_SlaveEndpointTest_UnauthorizedRequest_0_SndSkA/fetch" --fetcher_cache_size="2GB"
--frameworks_home="" --gc_delay="1weeks" --gc_disk_headroom="0.1" --hadoop_home="" --help="false"
--hostname_lookup="true" --http_command_executor="false" --http_credentials="/tmp/Endpoint_SlaveEndpointTest_UnauthorizedRequest_0_SndSkA/http_credentials"
--http_heartbeat_interval="30secs" --initialize_driver_logging="true" --isolation="posix/cpu,posix/mem"
--launcher="posix" --launcher_dir="/mesos/mesos-1.5.0/_build/src" --logbufsecs="0" --logging_level="INFO"
--max_completed_executors_per_framework="150" --oversubscribed_resources_interval="15secs"
--perf_duration="10secs" --perf_interval="1mins" --port="5051" --qos_correction_interval_min="0ns"
--quiet="false" --recover="reconnect" --recovery_timeout="15mins" --registration_backoff_factor="10ms"
--resources="cpus:2;gpus:0;mem:1024;disk:1024;ports:[31000-32000]" --revocable_cpu_low_priority="true"
--runtime_dir="/tmp/Endpoint_SlaveEndpointTest_UnauthorizedRequest_0_SndSkA" --sandbox_directory="/mnt/mesos/sandbox"
--strict="true" --switch_user="true" --systemd_enable_support="true" --systemd_runtime_directory="/run/systemd/system"
--version="false" --work_dir="/tmp/Endpoint_SlaveEndpointTest_UnauthorizedRequest_0_KtFDwE"
--zk_session_timeout="10secs"
I0830 19:34:27.784082  5821 credentials.hpp:86] Loading credential for authentication from
'/tmp/Endpoint_SlaveEndpointTest_UnauthorizedRequest_0_SndSkA/credential'
I0830 19:34:27.784307  5821 slave.cpp:285] Agent using credential for: test-principal
I0830 19:34:27.784330  5821 credentials.hpp:37] Loading credentials for authentication from
'/tmp/Endpoint_SlaveEndpointTest_UnauthorizedRequest_0_SndSkA/http_credentials'
I0830 19:34:27.784596  5821 http.cpp:1045] Creating default 'basic' HTTP authenticator for
realm 'mesos-agent-readonly'
I0830 19:34:27.784826  5821 http.cpp:1045] Creating default 'basic' HTTP authenticator for
realm 'mesos-agent-readwrite'
I0830 19:34:27.786345  5821 slave.cpp:581] Agent resources: [{"name":"cpus","scalar":{"value":2.0},"type":"SCALAR"},{"name":"mem","scalar":{"value":1024.0},"type":"SCALAR"},{"name":"disk","scalar":{"value":1024.0},"type":"SCALAR"},{"name":"ports","ranges":{"range":[{"begin":31000,"end":32000}]},"type":"RANGES"}]
I0830 19:34:27.786597  5821 slave.cpp:589] Agent attributes: [  ]
I0830 19:34:27.786614  5821 slave.cpp:598] Agent hostname: 811dd01bde70
I0830 19:34:27.786792  5799 status_update_manager.cpp:177] Pausing sending status updates
I0830 19:34:27.788606  5816 state.cpp:64] Recovering state from '/tmp/Endpoint_SlaveEndpointTest_UnauthorizedRequest_0_KtFDwE/meta'
I0830 19:34:27.789014  5807 status_update_manager.cpp:203] Recovering status update manager
I0830 19:34:27.789259  5814 containerizer.cpp:646] Recovering containerizer
I0830 19:34:27.790794  5805 provisioner.cpp:416] Provisioner recovery complete
I0830 19:34:27.791239  5821 slave.cpp:6296] Finished recovery
I0830 19:34:27.792034  5821 slave.cpp:6478] Querying resource estimator for oversubscribable
resources
I0830 19:34:27.792352  5810 slave.cpp:6492] Received oversubscribable resources {} from the
resource estimator
I0830 19:34:27.796247  5818 process.cpp:3956] Handling HTTP event for process 'slave(807)'
with path: '/slave(807)/monitor/statistics'
I0830 19:34:27.797950  5815 http.cpp:1185] HTTP GET for /slave(807)/monitor/statistics from
172.17.0.7:48410
I0830 19:34:27.798065  5815 http.cpp:976] Authorizing principal 'test-principal' to GET the
'/monitor/statistics' endpoint
I0830 19:34:27.801110  5803 slave.cpp:859] Agent terminating
[       OK ] Endpoint/SlaveEndpointTest.UnauthorizedRequest/0 (39 ms)
[ RUN      ] Endpoint/SlaveEndpointTest.UnauthorizedRequest/1
I0830 19:34:27.817987  5780 containerizer.cpp:290] Using isolation { environment_secret, posix/cpu,
posix/mem, filesystem/posix, network/cni }
W0830 19:34:27.818794  5780 backend.cpp:76] Failed to create 'aufs' backend: AufsBackend requires
root privileges
W0830 19:34:27.818949  5780 backend.cpp:76] Failed to create 'bind' backend: BindBackend requires
root privileges
I0830 19:34:27.818996  5780 provisioner.cpp:255] Using default backend 'copy'
I0830 19:34:27.823334  5811 slave.cpp:252] Mesos agent started on (808)@172.17.0.7:36899
I0830 19:34:27.823379  5811 slave.cpp:253] Flags at startup: --acls="" --appc_simple_discovery_uri_prefix="http://"
--appc_store_dir="/tmp/Endpoint_SlaveEndpointTest_UnauthorizedRequest_1_UNoTTj/store/appc"
--authenticate_http_readonly="true" --authenticate_http_readwrite="true" --authenticatee="crammd5"
--authentication_backoff_factor="1secs" --authorizer="local" --cgroups_cpu_enable_pids_and_tids_count="false"
--cgroups_enable_cfs="false" --cgroups_hierarchy="/sys/fs/cgroup" --cgroups_limit_swap="false"
--cgroups_root="mesos" --container_disk_watch_interval="15secs" --containerizers="mesos" --credential="/tmp/Endpoint_SlaveEndpointTest_UnauthorizedRequest_1_UNoTTj/credential"
--default_role="*" --disallow_sharing_agent_pid_namespace="false" --disk_watch_interval="1mins"
--docker="docker" --docker_kill_orphans="true" --docker_registry="https://registry-1.docker.io"
--docker_remove_delay="6hrs" --docker_socket="/var/run/docker.sock" --docker_stop_timeout="0ns"
--docker_store_dir="/tmp/Endpoint_SlaveEndpointTest_UnauthorizedRequest_1_UNoTTj/store/docker"
--docker_volume_checkpoint_dir="/var/run/mesos/isolators/docker/volume" --enforce_container_disk_quota="false"
--executor_registration_timeout="1mins" --executor_reregistration_timeout="2secs" --executor_shutdown_grace_period="5secs"
--fetcher_cache_dir="/tmp/Endpoint_SlaveEndpointTest_UnauthorizedRequest_1_UNoTTj/fetch" --fetcher_cache_size="2GB"
--frameworks_home="" --gc_delay="1weeks" --gc_disk_headroom="0.1" --hadoop_home="" --help="false"
--hostname_lookup="true" --http_command_executor="false" --http_credentials="/tmp/Endpoint_SlaveEndpointTest_UnauthorizedRequest_1_UNoTTj/http_credentials"
--http_heartbeat_interval="30secs" --initialize_driver_logging="true" --isolation="posix/cpu,posix/mem"
--launcher="posix" --launcher_dir="/mesos/mesos-1.5.0/_build/src" --logbufsecs="0" --logging_level="INFO"
--max_completed_executors_per_framework="150" --oversubscribed_resources_interval="15secs"
--perf_duration="10secs" --perf_interval="1mins" --port="5051" --qos_correction_interval_min="0ns"
--quiet="false" --recover="reconnect" --recovery_timeout="15mins" --registration_backoff_factor="10ms"
--resources="cpus:2;gpus:0;mem:1024;disk:1024;ports:[31000-32000]" --revocable_cpu_low_priority="true"
--runtime_dir="/tmp/Endpoint_SlaveEndpointTest_UnauthorizedRequest_1_UNoTTj" --sandbox_directory="/mnt/mesos/sandbox"
--strict="true" --switch_user="true" --systemd_enable_support="true" --systemd_runtime_directory="/run/systemd/system"
--version="false" --work_dir="/tmp/Endpoint_SlaveEndpointTest_UnauthorizedRequest_1_mStGZn"
--zk_session_timeout="10secs"
I0830 19:34:27.823938  5811 credentials.hpp:86] Loading credential for authentication from
'/tmp/Endpoint_SlaveEndpointTest_UnauthorizedRequest_1_UNoTTj/credential'
I0830 19:34:27.824193  5811 slave.cpp:285] Agent using credential for: test-principal
I0830 19:34:27.824226  5811 credentials.hpp:37] Loading credentials for authentication from
'/tmp/Endpoint_SlaveEndpointTest_UnauthorizedRequest_1_UNoTTj/http_credentials'
I0830 19:34:27.824522  5811 http.cpp:1045] Creating default 'basic' HTTP authenticator for
realm 'mesos-agent-readonly'
I0830 19:34:27.824740  5811 http.cpp:1045] Creating default 'basic' HTTP authenticator for
realm 'mesos-agent-readwrite'
I0830 19:34:27.826236  5811 slave.cpp:581] Agent resources: [{"name":"cpus","scalar":{"value":2.0},"type":"SCALAR"},{"name":"mem","scalar":{"value":1024.0},"type":"SCALAR"},{"name":"disk","scalar":{"value":1024.0},"type":"SCALAR"},{"name":"ports","ranges":{"range":[{"begin":31000,"end":32000}]},"type":"RANGES"}]
I0830 19:34:27.826485  5811 slave.cpp:589] Agent attributes: [  ]
I0830 19:34:27.826500  5811 slave.cpp:598] Agent hostname: 811dd01bde70
I0830 19:34:27.826654  5807 status_update_manager.cpp:177] Pausing sending status updates
I0830 19:34:27.828491  5808 state.cpp:64] Recovering state from '/tmp/Endpoint_SlaveEndpointTest_UnauthorizedRequest_1_mStGZn/meta'
I0830 19:34:27.828899  5799 status_update_manager.cpp:203] Recovering status update manager
I0830 19:34:27.829120  5822 containerizer.cpp:646] Recovering containerizer
I0830 19:34:27.830565  5806 provisioner.cpp:416] Provisioner recovery complete
I0830 19:34:27.830914  5811 slave.cpp:6296] Finished recovery
I0830 19:34:27.831542  5811 slave.cpp:6478] Querying resource estimator for oversubscribable
resources
I0830 19:34:27.831823  5817 slave.cpp:6492] Received oversubscribable resources {} from the
resource estimator
I0830 19:34:27.835089  5803 process.cpp:3956] Handling HTTP event for process 'slave(808)'
with path: '/slave(808)/monitor/statistics.json'
I0830 19:34:27.836534  5804 http.cpp:1185] HTTP GET for /slave(808)/monitor/statistics.json
from 172.17.0.7:48414
I0830 19:34:27.836621  5804 http.cpp:976] Authorizing principal 'test-principal' to GET the
'/monitor/statistics.json' endpoint
I0830 19:34:27.838795  5808 slave.cpp:859] Agent terminating
[       OK ] Endpoint/SlaveEndpointTest.UnauthorizedRequest/1 (35 ms)
[ RUN      ] Endpoint/SlaveEndpointTest.UnauthorizedRequest/2
I0830 19:34:27.851531  5780 containerizer.cpp:290] Using isolation { environment_secret, posix/cpu,
posix/mem, filesystem/posix, network/cni }
W0830 19:34:27.852092  5780 backend.cpp:76] Failed to create 'aufs' backend: AufsBackend requires
root privileges
W0830 19:34:27.852218  5780 backend.cpp:76] Failed to create 'bind' backend: BindBackend requires
root privileges
I0830 19:34:27.852255  5780 provisioner.cpp:255] Using default backend 'copy'
I0830 19:34:27.856159  5809 slave.cpp:252] Mesos agent started on (809)@172.17.0.7:36899
I0830 19:34:27.856194  5809 slave.cpp:253] Flags at startup: --acls="" --appc_simple_discovery_uri_prefix="http://"
--appc_store_dir="/tmp/Endpoint_SlaveEndpointTest_UnauthorizedRequest_2_Ez7BO3/store/appc"
--authenticate_http_readonly="true" --authenticate_http_readwrite="true" --authenticatee="crammd5"
--authentication_backoff_factor="1secs" --authorizer="local" --cgroups_cpu_enable_pids_and_tids_count="false"
--cgroups_enable_cfs="false" --cgroups_hierarchy="/sys/fs/cgroup" --cgroups_limit_swap="false"
--cgroups_root="mesos" --container_disk_watch_interval="15secs" --containerizers="mesos" --credential="/tmp/Endpoint_SlaveEndpointTest_UnauthorizedRequest_2_Ez7BO3/credential"
--default_role="*" --disallow_sharing_agent_pid_namespace="false" --disk_watch_interval="1mins"
--docker="docker" --docker_kill_orphans="true" --docker_registry="https://registry-1.docker.io"
--docker_remove_delay="6hrs" --docker_socket="/var/run/docker.sock" --docker_stop_timeout="0ns"
--docker_store_dir="/tmp/Endpoint_SlaveEndpointTest_UnauthorizedRequest_2_Ez7BO3/store/docker"
--docker_volume_checkpoint_dir="/var/run/mesos/isolators/docker/volume" --enforce_container_disk_quota="false"
--executor_registration_timeout="1mins" --executor_reregistration_timeout="2secs" --executor_shutdown_grace_period="5secs"
--fetcher_cache_dir="/tmp/Endpoint_SlaveEndpointTest_UnauthorizedRequest_2_Ez7BO3/fetch" --fetcher_cache_size="2GB"
--frameworks_home="" --gc_delay="1weeks" --gc_disk_headroom="0.1" --hadoop_home="" --help="false"
--hostname_lookup="true" --http_command_executor="false" --http_credentials="/tmp/Endpoint_SlaveEndpointTest_UnauthorizedRequest_2_Ez7BO3/http_credentials"
--http_heartbeat_interval="30secs" --initialize_driver_logging="true" --isolation="posix/cpu,posix/mem"
--launcher="posix" --launcher_dir="/mesos/mesos-1.5.0/_build/src" --logbufsecs="0" --logging_level="INFO"
--max_completed_executors_per_framework="150" --oversubscribed_resources_interval="15secs"
--perf_duration="10secs" --perf_interval="1mins" --port="5051" --qos_correction_interval_min="0ns"
--quiet="false" --recover="reconnect" --recovery_timeout="15mins" --registration_backoff_factor="10ms"
--resources="cpus:2;gpus:0;mem:1024;disk:1024;ports:[31000-32000]" --revocable_cpu_low_priority="true"
--runtime_dir="/tmp/Endpoint_SlaveEndpointTest_UnauthorizedRequest_2_Ez7BO3" --sandbox_directory="/mnt/mesos/sandbox"
--strict="true" --switch_user="true" --systemd_enable_support="true" --systemd_runtime_directory="/run/systemd/system"
--version="false" --work_dir="/tmp/Endpoint_SlaveEndpointTest_UnauthorizedRequest_2_Qz0bP7"
--zk_session_timeout="10secs"
I0830 19:34:27.856817  5809 credentials.hpp:86] Loading credential for authentication from
'/tmp/Endpoint_SlaveEndpointTest_UnauthorizedRequest_2_Ez7BO3/credential'
I0830 19:34:27.857054  5809 slave.cpp:285] Agent using credential for: test-principal
I0830 19:34:27.857084  5809 credentials.hpp:37] Loading credentials for authentication from
'/tmp/Endpoint_SlaveEndpointTest_UnauthorizedRequest_2_Ez7BO3/http_credentials'
I0830 19:34:27.857435  5809 http.cpp:1045] Creating default 'basic' HTTP authenticator for
realm 'mesos-agent-readonly'
I0830 19:34:27.857663  5809 http.cpp:1045] Creating default 'basic' HTTP authenticator for
realm 'mesos-agent-readwrite'
I0830 19:34:27.859807  5809 slave.cpp:581] Agent resources: [{"name":"cpus","scalar":{"value":2.0},"type":"SCALAR"},{"name":"mem","scalar":{"value":1024.0},"type":"SCALAR"},{"name":"disk","scalar":{"value":1024.0},"type":"SCALAR"},{"name":"ports","ranges":{"range":[{"begin":31000,"end":32000}]},"type":"RANGES"}]
I0830 19:34:27.860184  5809 slave.cpp:589] Agent attributes: [  ]
I0830 19:34:27.860208  5809 slave.cpp:598] Agent hostname: 811dd01bde70
I0830 19:34:27.860373  5822 status_update_manager.cpp:177] Pausing sending status updates
I0830 19:34:27.862532  5816 state.cpp:64] Recovering state from '/tmp/Endpoint_SlaveEndpointTest_UnauthorizedRequest_2_Qz0bP7/meta'
I0830 19:34:27.862872  5818 status_update_manager.cpp:203] Recovering status update manager
I0830 19:34:27.863088  5815 containerizer.cpp:646] Recovering containerizer
I0830 19:34:27.864482  5805 provisioner.cpp:416] Provisioner recovery complete
I0830 19:34:27.864902  5811 slave.cpp:6296] Finished recovery
I0830 19:34:27.865525  5811 slave.cpp:6478] Querying resource estimator for oversubscribable
resources
I0830 19:34:27.865820  5803 slave.cpp:6492] Received oversubscribable resources {} from the
resource estimator
I0830 19:34:27.868839  5820 process.cpp:3956] Handling HTTP event for process 'slave(809)'
with path: '/slave(809)/containers'
I0830 19:34:27.870190  5818 http.cpp:1185] HTTP GET for /slave(809)/containers from 172.17.0.7:48416
I0830 19:34:27.870261  5818 http.cpp:976] Authorizing principal 'test-principal' to GET the
'/containers' endpoint
I0830 19:34:27.872102  5818 slave.cpp:859] Agent terminating
[       OK ] Endpoint/SlaveEndpointTest.UnauthorizedRequest/2 (31 ms)
[ RUN      ] Endpoint/SlaveEndpointTest.NoAuthorizer/0
I0830 19:34:27.882867  5780 containerizer.cpp:290] Using isolation { environment_secret, posix/cpu,
posix/mem, filesystem/posix, network/cni }
W0830 19:34:27.883352  5780 backend.cpp:76] Failed to create 'aufs' backend: AufsBackend requires
root privileges
W0830 19:34:27.883460  5780 backend.cpp:76] Failed to create 'bind' backend: BindBackend requires
root privileges
I0830 19:34:27.883491  5780 provisioner.cpp:255] Using default backend 'copy'
I0830 19:34:27.885089  5780 cluster.cpp:448] Creating default 'local' authorizer
I0830 19:34:27.886955  5820 slave.cpp:252] Mesos agent started on (810)@172.17.0.7:36899
I0830 19:34:27.886981  5820 slave.cpp:253] Flags at startup: --acls="" --appc_simple_discovery_uri_prefix="http://"
--appc_store_dir="/tmp/Endpoint_SlaveEndpointTest_NoAuthorizer_0_HHuw2N/store/appc" --authenticate_http_readonly="true"
--authenticate_http_readwrite="true" --authenticatee="crammd5" --authentication_backoff_factor="1secs"
--authorizer="local" --cgroups_cpu_enable_pids_and_tids_count="false" --cgroups_enable_cfs="false"
--cgroups_hierarchy="/sys/fs/cgroup" --cgroups_limit_swap="false" --cgroups_root="mesos" --container_disk_watch_interval="15secs"
--containerizers="mesos" --credential="/tmp/Endpoint_SlaveEndpointTest_NoAuthorizer_0_HHuw2N/credential"
--default_role="*" --disallow_sharing_agent_pid_namespace="false" --disk_watch_interval="1mins"
--docker="docker" --docker_kill_orphans="true" --docker_registry="https://registry-1.docker.io"
--docker_remove_delay="6hrs" --docker_socket="/var/run/docker.sock" --docker_stop_timeout="0ns"
--docker_store_dir="/tmp/Endpoint_SlaveEndpointTest_NoAuthorizer_0_HHuw2N/store/docker" --docker_volume_checkpoint_dir="/var/run/mesos/isolators/docker/volume"
--enforce_container_disk_quota="false" --executor_registration_timeout="1mins" --executor_reregistration_timeout="2secs"
--executor_shutdown_grace_period="5secs" --fetcher_cache_dir="/tmp/Endpoint_SlaveEndpointTest_NoAuthorizer_0_HHuw2N/fetch"
--fetcher_cache_size="2GB" --frameworks_home="" --gc_delay="1weeks" --gc_disk_headroom="0.1"
--hadoop_home="" --help="false" --hostname_lookup="true" --http_command_executor="false" --http_credentials="/tmp/Endpoint_SlaveEndpointTest_NoAuthorizer_0_HHuw2N/http_credentials"
--http_heartbeat_interval="30secs" --initialize_driver_logging="true" --isolation="posix/cpu,posix/mem"
--launcher="posix" --launcher_dir="/mesos/mesos-1.5.0/_build/src" --logbufsecs="0" --logging_level="INFO"
--max_completed_executors_per_framework="150" --oversubscribed_resources_interval="15secs"
--perf_duration="10secs" --perf_interval="1mins" --port="5051" --qos_correction_interval_min="0ns"
--quiet="false" --recover="reconnect" --recovery_timeout="15mins" --registration_backoff_factor="10ms"
--resources="cpus:2;gpus:0;mem:1024;disk:1024;ports:[31000-32000]" --revocable_cpu_low_priority="true"
--runtime_dir="/tmp/Endpoint_SlaveEndpointTest_NoAuthorizer_0_HHuw2N" --sandbox_directory="/mnt/mesos/sandbox"
--strict="true" --switch_user="true" --systemd_enable_support="true" --systemd_runtime_directory="/run/systemd/system"
--version="false" --work_dir="/tmp/Endpoint_SlaveEndpointTest_NoAuthorizer_0_DSCpYR" --zk_session_timeout="10secs"
I0830 19:34:27.887548  5820 credentials.hpp:86] Loading credential for authentication from
'/tmp/Endpoint_SlaveEndpointTest_NoAuthorizer_0_HHuw2N/credential'
I0830 19:34:27.887751  5820 slave.cpp:285] Agent using credential for: test-principal
I0830 19:34:27.887779  5820 credentials.hpp:37] Loading credentials for authentication from
'/tmp/Endpoint_SlaveEndpointTest_NoAuthorizer_0_HHuw2N/http_credentials'
I0830 19:34:27.888041  5820 http.cpp:1045] Creating default 'basic' HTTP authenticator for
realm 'mesos-agent-readonly'
I0830 19:34:27.888200  5820 http.cpp:1045] Creating default 'basic' HTTP authenticator for
realm 'mesos-agent-readwrite'
I0830 19:34:27.889494  5820 slave.cpp:581] Agent resources: [{"name":"cpus","scalar":{"value":2.0},"type":"SCALAR"},{"name":"mem","scalar":{"value":1024.0},"type":"SCALAR"},{"name":"disk","scalar":{"value":1024.0},"type":"SCALAR"},{"name":"ports","ranges":{"range":[{"begin":31000,"end":32000}]},"type":"RANGES"}]
I0830 19:34:27.889708  5820 slave.cpp:589] Agent attributes: [  ]
I0830 19:34:27.889722  5820 slave.cpp:598] Agent hostname: 811dd01bde70
I0830 19:34:27.889874  5819 status_update_manager.cpp:177] Pausing sending status updates
I0830 19:34:27.891290  5811 state.cpp:64] Recovering state from '/tmp/Endpoint_SlaveEndpointTest_NoAuthorizer_0_DSCpYR/meta'
I0830 19:34:27.891566  5806 status_update_manager.cpp:203] Recovering status update manager
I0830 19:34:27.891726  5805 containerizer.cpp:646] Recovering containerizer
I0830 19:34:27.892982  5814 provisioner.cpp:416] Provisioner recovery complete
I0830 19:34:27.893319  5801 slave.cpp:6296] Finished recovery
I0830 19:34:27.893821  5801 slave.cpp:6478] Querying resource estimator for oversubscribable
resources
I0830 19:34:27.894059  5812 slave.cpp:6492] Received oversubscribable resources {} from the
resource estimator
I0830 19:34:27.896584  5818 process.cpp:3956] Handling HTTP event for process 'slave(810)'
with path: '/slave(810)/monitor/statistics'
I0830 19:34:27.897792  5806 http.cpp:1185] HTTP GET for /slave(810)/monitor/statistics from
172.17.0.7:48418
I0830 19:34:27.897858  5806 http.cpp:976] Authorizing principal 'test-principal' to GET the
'/monitor/statistics' endpoint
I0830 19:34:27.900373  5801 slave.cpp:859] Agent terminating
[       OK ] Endpoint/SlaveEndpointTest.NoAuthorizer/0 (27 ms)
[ RUN      ] Endpoint/SlaveEndpointTest.NoAuthorizer/1
I0830 19:34:27.910866  5780 containerizer.cpp:290] Using isolation { environment_secret, posix/cpu,
posix/mem, filesystem/posix, network/cni }
W0830 19:34:27.911360  5780 backend.cpp:76] Failed to create 'aufs' backend: AufsBackend requires
root privileges
W0830 19:34:27.911469  5780 backend.cpp:76] Failed to create 'bind' backend: BindBackend requires
root privileges
I0830 19:34:27.911501  5780 provisioner.cpp:255] Using default backend 'copy'
I0830 19:34:27.913180  5780 cluster.cpp:448] Creating default 'local' authorizer
I0830 19:34:27.915031  5800 slave.cpp:252] Mesos agent started on (811)@172.17.0.7:36899
I0830 19:34:27.915058  5800 slave.cpp:253] Flags at startup: --acls="" --appc_simple_discovery_uri_prefix="http://"
--appc_store_dir="/tmp/Endpoint_SlaveEndpointTest_NoAuthorizer_1_mG06wy/store/appc" --authenticate_http_readonly="true"
--authenticate_http_readwrite="true" --authenticatee="crammd5" --authentication_backoff_factor="1secs"
--authorizer="local" --cgroups_cpu_enable_pids_and_tids_count="false" --cgroups_enable_cfs="false"
--cgroups_hierarchy="/sys/fs/cgroup" --cgroups_limit_swap="false" --cgroups_root="mesos" --container_disk_watch_interval="15secs"
--containerizers="mesos" --credential="/tmp/Endpoint_SlaveEndpointTest_NoAuthorizer_1_mG06wy/credential"
--default_role="*" --disallow_sharing_agent_pid_namespace="false" --disk_watch_interval="1mins"
--docker="docker" --docker_kill_orphans="true" --docker_registry="https://registry-1.docker.io"
--docker_remove_delay="6hrs" --docker_socket="/var/run/docker.sock" --docker_stop_timeout="0ns"
--docker_store_dir="/tmp/Endpoint_SlaveEndpointTest_NoAuthorizer_1_mG06wy/store/docker" --docker_volume_checkpoint_dir="/var/run/mesos/isolators/docker/volume"
--enforce_container_disk_quota="false" --executor_registration_timeout="1mins" --executor_reregistration_timeout="2secs"
--executor_shutdown_grace_period="5secs" --fetcher_cache_dir="/tmp/Endpoint_SlaveEndpointTest_NoAuthorizer_1_mG06wy/fetch"
--fetcher_cache_size="2GB" --frameworks_home="" --gc_delay="1weeks" --gc_disk_headroom="0.1"
--hadoop_home="" --help="false" --hostname_lookup="true" --http_command_executor="false" --http_credentials="/tmp/Endpoint_SlaveEndpointTest_NoAuthorizer_1_mG06wy/http_credentials"
--http_heartbeat_interval="30secs" --initialize_driver_logging="true" --isolation="posix/cpu,posix/mem"
--launcher="posix" --launcher_dir="/mesos/mesos-1.5.0/_build/src" --logbufsecs="0" --logging_level="INFO"
--max_completed_executors_per_framework="150" --oversubscribed_resources_interval="15secs"
--perf_duration="10secs" --perf_interval="1mins" --port="5051" --qos_correction_interval_min="0ns"
--quiet="false" --recover="reconnect" --recovery_timeout="15mins" --registration_backoff_factor="10ms"
--resources="cpus:2;gpus:0;mem:1024;disk:1024;ports:[31000-32000]" --revocable_cpu_low_priority="true"
--runtime_dir="/tmp/Endpoint_SlaveEndpointTest_NoAuthorizer_1_mG06wy" --sandbox_directory="/mnt/mesos/sandbox"
--strict="true" --switch_user="true" --systemd_enable_support="true" --systemd_runtime_directory="/run/systemd/system"
--version="false" --work_dir="/tmp/Endpoint_SlaveEndpointTest_NoAuthorizer_1_ZNGQoC" --zk_session_timeout="10secs"
I0830 19:34:27.915642  5800 credentials.hpp:86] Loading credential for authentication from
'/tmp/Endpoint_SlaveEndpointTest_NoAuthorizer_1_mG06wy/credential'
I0830 19:34:27.915848  5800 slave.cpp:285] Agent using credential for: test-principal
I0830 19:34:27.915875  5800 credentials.hpp:37] Loading credentials for authentication from
'/tmp/Endpoint_SlaveEndpointTest_NoAuthorizer_1_mG06wy/http_credentials'
I0830 19:34:27.916129  5800 http.cpp:1045] Creating default 'basic' HTTP authenticator for
realm 'mesos-agent-readonly'
I0830 19:34:27.916301  5800 http.cpp:1045] Creating default 'basic' HTTP authenticator for
realm 'mesos-agent-readwrite'
I0830 19:34:27.917592  5800 slave.cpp:581] Agent resources: [{"name":"cpus","scalar":{"value":2.0},"type":"SCALAR"},{"name":"mem","scalar":{"value":1024.0},"type":"SCALAR"},{"name":"disk","scalar":{"value":1024.0},"type":"SCALAR"},{"name":"ports","ranges":{"range":[{"begin":31000,"end":32000}]},"type":"RANGES"}]
I0830 19:34:27.917807  5800 slave.cpp:589] Agent attributes: [  ]
I0830 19:34:27.917820  5800 slave.cpp:598] Agent hostname: 811dd01bde70
I0830 19:34:27.917951  5817 status_update_manager.cpp:177] Pausing sending status updates
I0830 19:34:27.919463  5805 state.cpp:64] Recovering state from '/tmp/Endpoint_SlaveEndpointTest_NoAuthorizer_1_ZNGQoC/meta'
I0830 19:34:27.919750  5806 status_update_manager.cpp:203] Recovering status update manager
I0830 19:34:27.919929  5799 containerizer.cpp:646] Recovering containerizer
I0830 19:34:27.921195  5819 provisioner.cpp:416] Provisioner recovery complete
I0830 19:34:27.921470  5800 slave.cpp:6296] Finished recovery
I0830 19:34:27.921931  5800 slave.cpp:6478] Querying resource estimator for oversubscribable
resources
I0830 19:34:27.922204  5814 slave.cpp:6492] Received oversubscribable resources {} from the
resource estimator
I0830 19:34:27.924872  5813 process.cpp:3956] Handling HTTP event for process 'slave(811)'
with path: '/slave(811)/monitor/statistics.json'
I0830 19:34:27.926074  5811 http.cpp:1185] HTTP GET for /slave(811)/monitor/statistics.json
from 172.17.0.7:48420
I0830 19:34:27.926141  5811 http.cpp:976] Authorizing principal 'test-principal' to GET the
'/monitor/statistics.json' endpoint
I0830 19:34:27.928606  5800 slave.cpp:859] Agent terminating
[       OK ] Endpoint/SlaveEndpointTest.NoAuthorizer/1 (28 ms)
[ RUN      ] Endpoint/SlaveEndpointTest.NoAuthorizer/2
I0830 19:34:27.939885  5780 containerizer.cpp:290] Using isolation { environment_secret, posix/cpu,
posix/mem, filesystem/posix, network/cni }
W0830 19:34:27.940407  5780 backend.cpp:76] Failed to create 'aufs' backend: AufsBackend requires
root privileges
W0830 19:34:27.940521  5780 backend.cpp:76] Failed to create 'bind' backend: BindBackend requires
root privileges
I0830 19:34:27.940556  5780 provisioner.cpp:255] Using default backend 'copy'
I0830 19:34:27.942315  5780 cluster.cpp:448] Creating default 'local' authorizer
I0830 19:34:27.944229  5806 slave.cpp:252] Mesos agent started on (812)@172.17.0.7:36899
I0830 19:34:27.944250  5806 slave.cpp:253] Flags at startup: --acls="" --appc_simple_discovery_uri_prefix="http://"
--appc_store_dir="/tmp/Endpoint_SlaveEndpointTest_NoAuthorizer_2_aBfGij/store/appc" --authenticate_http_readonly="true"
--authenticate_http_readwrite="true" --authenticatee="crammd5" --authentication_backoff_factor="1secs"
--authorizer="local" --cgroups_cpu_enable_pids_and_tids_count="false" --cgroups_enable_cfs="false"
--cgroups_hierarchy="/sys/fs/cgroup" --cgroups_limit_swap="false" --cgroups_root="mesos" --container_disk_watch_interval="15secs"
--containerizers="mesos" --credential="/tmp/Endpoint_SlaveEndpointTest_NoAuthorizer_2_aBfGij/credential"
--default_role="*" --disallow_sharing_agent_pid_namespace="false" --disk_watch_interval="1mins"
--docker="docker" --docker_kill_orphans="true" --docker_registry="https://registry-1.docker.io"
--docker_remove_delay="6hrs" --docker_socket="/var/run/docker.sock" --docker_stop_timeout="0ns"
--docker_store_dir="/tmp/Endpoint_SlaveEndpointTest_NoAuthorizer_2_aBfGij/store/docker" --docker_volume_checkpoint_dir="/var/run/mesos/isolators/docker/volume"
--enforce_container_disk_quota="false" --executor_registration_timeout="1mins" --executor_reregistration_timeout="2secs"
--executor_shutdown_grace_period="5secs" --fetcher_cache_dir="/tmp/Endpoint_SlaveEndpointTest_NoAuthorizer_2_aBfGij/fetch"
--fetcher_cache_size="2GB" --frameworks_home="" --gc_delay="1weeks" --gc_disk_headroom="0.1"
--hadoop_home="" --help="false" --hostname_lookup="true" --http_command_executor="false" --http_credentials="/tmp/Endpoint_SlaveEndpointTest_NoAuthorizer_2_aBfGij/http_credentials"
--http_heartbeat_interval="30secs" --initialize_driver_logging="true" --isolation="posix/cpu,posix/mem"
--launcher="posix" --launcher_dir="/mesos/mesos-1.5.0/_build/src" --logbufsecs="0" --logging_level="INFO"
--max_completed_executors_per_framework="150" --oversubscribed_resources_interval="15secs"
--perf_duration="10secs" --perf_interval="1mins" --port="5051" --qos_correction_interval_min="0ns"
--quiet="false" --recover="reconnect" --recovery_timeout="15mins" --registration_backoff_factor="10ms"
--resources="cpus:2;gpus:0;mem:1024;disk:1024;ports:[31000-32000]" --revocable_cpu_low_priority="true"
--runtime_dir="/tmp/Endpoint_SlaveEndpointTest_NoAuthorizer_2_aBfGij" --sandbox_directory="/mnt/mesos/sandbox"
--strict="true" --switch_user="true" --systemd_enable_support="true" --systemd_runtime_directory="/run/systemd/system"
--version="false" --work_dir="/tmp/Endpoint_SlaveEndpointTest_NoAuthorizer_2_Toh95m" --zk_session_timeout="10secs"
I0830 19:34:27.944624  5806 credentials.hpp:86] Loading credential for authentication from
'/tmp/Endpoint_SlaveEndpointTest_NoAuthorizer_2_aBfGij/credential'
I0830 19:34:27.944806  5806 slave.cpp:285] Agent using credential for: test-principal
I0830 19:34:27.944826  5806 credentials.hpp:37] Loading credentials for authentication from
'/tmp/Endpoint_SlaveEndpointTest_NoAuthorizer_2_aBfGij/http_credentials'
I0830 19:34:27.945057  5806 http.cpp:1045] Creating default 'basic' HTTP authenticator for
realm 'mesos-agent-readonly'
I0830 19:34:27.945224  5806 http.cpp:1045] Creating default 'basic' HTTP authenticator for
realm 'mesos-agent-readwrite'
I0830 19:34:27.946503  5806 slave.cpp:581] Agent resources: [{"name":"cpus","scalar":{"value":2.0},"type":"SCALAR"},{"name":"mem","scalar":{"value":1024.0},"type":"SCALAR"},{"name":"disk","scalar":{"value":1024.0},"type":"SCALAR"},{"name":"ports","ranges":{"range":[{"begin":31000,"end":32000}]},"type":"RANGES"}]
I0830 19:34:27.946720  5806 slave.cpp:589] Agent attributes: [  ]
I0830 19:34:27.946733  5806 slave.cpp:598] Agent hostname: 811dd01bde70
I0830 19:34:27.946861  5816 status_update_manager.cpp:177] Pausing sending status updates
I0830 19:34:27.948395  5817 state.cpp:64] Recovering state from '/tmp/Endpoint_SlaveEndpointTest_NoAuthorizer_2_Toh95m/meta'
I0830 19:34:27.948668  5819 status_update_manager.cpp:203] Recovering status update manager
I0830 19:34:27.948858  5814 containerizer.cpp:646] Recovering containerizer
I0830 19:34:27.950162  5815 provisioner.cpp:416] Provisioner recovery complete
I0830 19:34:27.950453  5813 slave.cpp:6296] Finished recovery
I0830 19:34:27.950989  5813 slave.cpp:6478] Querying resource estimator for oversubscribable
resources
I0830 19:34:27.951226  5800 slave.cpp:6492] Received oversubscribable resources {} from the
resource estimator
I0830 19:34:27.954005  5803 process.cpp:3956] Handling HTTP event for process 'slave(812)'
with path: '/slave(812)/containers'
I0830 19:34:27.955255  5817 http.cpp:1185] HTTP GET for /slave(812)/containers from 172.17.0.7:48422
I0830 19:34:27.955332  5817 http.cpp:976] Authorizing principal 'test-principal' to GET the
'/containers' endpoint
I0830 19:34:27.958508  5802 slave.cpp:859] Agent terminating
[       OK ] Endpoint/SlaveEndpointTest.NoAuthorizer/2 (29 ms)
[----------] 9 tests from Endpoint/SlaveEndpointTest (307 ms total)

[----------] 2 tests from ContainerizerType/DefaultContainerDNSFlagTest
[ RUN      ] ContainerizerType/DefaultContainerDNSFlagTest.ValidateFlag/0
[       OK ] ContainerizerType/DefaultContainerDNSFlagTest.ValidateFlag/0 (9 ms)
[ RUN      ] ContainerizerType/DefaultContainerDNSFlagTest.ValidateFlag/1
[       OK ] ContainerizerType/DefaultContainerDNSFlagTest.ValidateFlag/1 (8 ms)
[----------] 2 tests from ContainerizerType/DefaultContainerDNSFlagTest (17 ms total)

[----------] Global test environment tear-down
[==========] 1663 tests from 183 test cases ran. (531192 ms total)
[  PASSED  ] 1662 tests.
[  FAILED  ] 1 test, listed below:
[  FAILED  ] MasterTest.IgnoreOldAgentReregistration

 1 FAILED TEST
  YOU HAVE 20 DISABLED TESTS

I0830 19:34:28.031417  5823 process.cpp:1072] Failed to accept socket: future discarded
make[4]: *** [check-local] Error 1
make[4]: Leaving directory `/mesos/mesos-1.5.0/_build/src'
make[3]: *** [check-am] Error 2
make[3]: Leaving directory `/mesos/mesos-1.5.0/_build/src'
make[2]: *** [check] Error 2
make[2]: Leaving directory `/mesos/mesos-1.5.0/_build/src'
make[1]: *** [check-recursive] Error 1
make[1]: Leaving directory `/mesos/mesos-1.5.0/_build'
make: *** [distcheck] Error 1
+ docker rmi mesos-1504118570-27500
Untagged: mesos-1504118570-27500:latest
Deleted: sha256:eeec28c7783dc9b893383675e4d461c56c9ce38db1030e3952b07e5683c3a9ee
Deleted: sha256:4c3e33c8b780e4d04b787a85b83647f3ab418fb28e7dfd33908c3f7748b831a9
Deleted: sha256:f4172a903f362248d67842428f8e28de033d2aae0e768d166e13a0c6a66964d6
Deleted: sha256:8e547b2fd6a117506200d24b73d3bfff09d4c161a146e0a91280ade8cfa05287
Deleted: sha256:f02f5df85d1eb740bc774a2713d8f48cf1b4ed082a13b008ec43a0a715106836
Deleted: sha256:e25937214dd68d1c26fc815025656d3c1f6da24d9729c674dfb31748bf1817f9
Deleted: sha256:84267153686e66f086b791699cd841f2b003cfe16a0a0d7c318aa15485470931
Deleted: sha256:9cf806bf5971d7975a468b1c59b3f165a1a85f2fe564d2815cc98610651bf6ae
Deleted: sha256:28c477d940c55ae572740f43d1c812dbf947cfef7fb855571080441be4ece544
Deleted: sha256:c5fb619bdf77bd701628e4fd3cfefad1c1daf90dbf6f837b8fff51e8366bdd9c
Deleted: sha256:026620027e1804cbba49b2bd067ed9c8adc95409c272fdfae838f55890abb3c7
Deleted: sha256:7573e03a44199a03d06906cdc1b19bb2147a19a8f5ce42d5d4902649c7eb63ec
Deleted: sha256:1e1c7c8796ee67939fa39be8da71842d65efd3bb771a7be56ff21fdc34f33cc8
Deleted: sha256:13359000575231b3b0f105bdcc6b0ca10b2ff8413d5b7663eea0f60811972de2
Deleted: sha256:cf339704254790ecabad4af5f0be00c8955b395a3537916282925ac403f80f9d
Deleted: sha256:82d0aa1274c4a79aeca5c50db77362c6b524fc7a78c516853ffd6c973ac3ff78
Deleted: sha256:6bdef62006d07c1662e92cb7c8a5876c070774450e8c9f4f111167a13c0f3729
Deleted: sha256:3cf4518c0c342a016ae5b784f2f6d949c37dc0bec30ab0093b1405f229c3cc69
Deleted: sha256:4e73557fef4165b929363b62115ab0b4df5f323e00bd56f9dbedbabb4df05270
Deleted: sha256:b749e5658bf2e70b9ab7a66c339adcac9772c67ca1e39cdb8278298bf3d00c57
Deleted: sha256:24f05e072634db9638c63ad86b871df2e501648a49ad413de98515c978c079a6
Deleted: sha256:d59b4d52f3704e144720c677e71652e698bae465ea2a20955f11b97c09fd714c
Deleted: sha256:aa4008475a34c5cd6a819d9924c536564c2594af3a7ab67b170104d656ab0b81
Deleted: sha256:cad49e4961117b210d37a2b0949610dbad9f31c53c794bb4b22257d0e528c5b5
Build step 'Execute shell' marked build as failure

Mime
View raw message