mesos-builds mailing list archives

Site index · List index
Message view « Date » · « Thread »
Top « Date » · « Thread »
From Apache Jenkins Server <jenk...@builds.apache.org>
Subject Build failed in Jenkins: Mesos-Buildbot » cmake,gcc,--verbose --enable-libevent --enable-ssl,GLOG_v=1 MESOS_VERBOSE=1,ubuntu:14.04,(ubuntu)&&(!ubuntu-us1)&&(!ubuntu-eu2) #4131
Date Sat, 19 Aug 2017 11:39:37 GMT
See <https://builds.apache.org/job/Mesos-Buildbot/BUILDTOOL=cmake,COMPILER=gcc,CONFIGURATION=--verbose%20--enable-libevent%20--enable-ssl,ENVIRONMENT=GLOG_v=1%20MESOS_VERBOSE=1,OS=ubuntu%3A14.04,label_exp=(ubuntu)&&(!ubuntu-us1)&&(!ubuntu-eu2)/4131/display/redirect?page=changes>

Changes:

[gregorywmann] Updated the docs for the V1 'HEARTBEAT' event.

[gregorywmann] Added a heartbeat interval to the V1 master operator API.

[gregorywmann] Added the V1 `Teardown` call to teardown a framework.

[gregorywmann] Added a test for the `Teardown` call in V1 operator API.

------------------------------------------
[...truncated 29.99 MB...]
I0819 11:39:28.723851 10736 slave.cpp:6422] Received oversubscribable resources {} from the
resource estimator
I0819 11:39:28.725595 10740 process.cpp:3933] Handling HTTP event for process 'slave(804)'
with path: '/slave(804)/containers'
I0819 11:39:28.727092 10748 http.cpp:1166] HTTP GET for /slave(804)/containers from 172.17.0.7:48430
I0819 11:39:28.727167 10748 http.cpp:957] Authorizing principal 'test-principal' to GET the
'/containers' endpoint
I0819 11:39:28.730705 10741 slave.cpp:859] Agent terminating
[       OK ] Endpoint/SlaveEndpointTest.AuthorizedRequest/2 (31 ms)
[ RUN      ] Endpoint/SlaveEndpointTest.UnauthorizedRequest/0
I0819 11:39:28.745390  2764 containerizer.cpp:246] Using isolation: posix/cpu,posix/mem,filesystem/posix,network/cni,environment_secret
W0819 11:39:28.745990  2764 backend.cpp:76] Failed to create 'aufs' backend: AufsBackend requires
root privileges
W0819 11:39:28.746132  2764 backend.cpp:76] Failed to create 'bind' backend: BindBackend requires
root privileges
I0819 11:39:28.746162  2764 provisioner.cpp:255] Using default backend 'copy'
I0819 11:39:28.750136 10731 slave.cpp:252] Mesos agent started on (805)@172.17.0.7:40519
I0819 11:39:28.750154 10731 slave.cpp:253] Flags at startup: --acls="" --appc_simple_discovery_uri_prefix="http://"
--appc_store_dir="/tmp/Endpoint_SlaveEndpointTest_UnauthorizedRequest_0_QBL18F/store/appc"
--authenticate_http_executors="true" --authenticate_http_readonly="true" --authenticate_http_readwrite="true"
--authenticatee="crammd5" --authentication_backoff_factor="1secs" --authorizer="local" --cgroups_cpu_enable_pids_and_tids_count="false"
--cgroups_enable_cfs="false" --cgroups_hierarchy="/sys/fs/cgroup" --cgroups_limit_swap="false"
--cgroups_root="mesos" --container_disk_watch_interval="15secs" --containerizers="mesos" --credential="/tmp/Endpoint_SlaveEndpointTest_UnauthorizedRequest_0_QBL18F/credential"
--default_role="*" --disallow_sharing_agent_pid_namespace="false" --disk_watch_interval="1mins"
--docker="docker" --docker_kill_orphans="true" --docker_registry="https://registry-1.docker.io"
--docker_remove_delay="6hrs" --docker_socket="/var/run/docker.sock" --docker_stop_timeout="0ns"
--docker_store_dir="/tmp/Endpoint_SlaveEndpointTest_UnauthorizedRequest_0_QBL18F/store/docker"
--docker_volume_checkpoint_dir="/var/run/mesos/isolators/docker/volume" --enforce_container_disk_quota="false"
--executor_registration_timeout="1mins" --executor_reregistration_timeout="2secs" --executor_secret_key="/tmp/Endpoint_SlaveEndpointTest_UnauthorizedRequest_0_QBL18F/executor_secret_key"
--executor_shutdown_grace_period="5secs" --fetcher_cache_dir="/tmp/Endpoint_SlaveEndpointTest_UnauthorizedRequest_0_QBL18F/fetch"
--fetcher_cache_size="2GB" --frameworks_home="" --gc_delay="1weeks" --gc_disk_headroom="0.1"
--hadoop_home="" --help="false" --hostname_lookup="true" --http_command_executor="false" --http_credentials="/tmp/Endpoint_SlaveEndpointTest_UnauthorizedRequest_0_QBL18F/http_credentials"
--http_heartbeat_interval="30secs" --initialize_driver_logging="true" --isolation="posix/cpu,posix/mem"
--launcher="posix" --launcher_dir="/mesos/build/src" --logbufsecs="0" --logging_level="INFO"
--max_completed_executors_per_framework="150" --oversubscribed_resources_interval="15secs"
--perf_duration="10secs" --perf_interval="1mins" --port="5051" --qos_correction_interval_min="0ns"
--quiet="false" --recover="reconnect" --recovery_timeout="15mins" --registration_backoff_factor="10ms"
--resources="cpus:2;gpus:0;mem:1024;disk:1024;ports:[31000-32000]" --revocable_cpu_low_priority="true"
--runtime_dir="/tmp/Endpoint_SlaveEndpointTest_UnauthorizedRequest_0_QBL18F" --sandbox_directory="/mnt/mesos/sandbox"
--strict="true" --switch_user="true" --systemd_enable_support="true" --systemd_runtime_directory="/run/systemd/system"
--version="false" --work_dir="/tmp/Endpoint_SlaveEndpointTest_UnauthorizedRequest_0_gj67QM"
I0819 11:39:28.750602 10731 credentials.hpp:86] Loading credential for authentication from
'/tmp/Endpoint_SlaveEndpointTest_UnauthorizedRequest_0_QBL18F/credential'
I0819 11:39:28.750789 10731 slave.cpp:285] Agent using credential for: test-principal
I0819 11:39:28.750807 10731 credentials.hpp:37] Loading credentials for authentication from
'/tmp/Endpoint_SlaveEndpointTest_UnauthorizedRequest_0_QBL18F/http_credentials'
I0819 11:39:28.751132 10731 http.cpp:1026] Creating default 'basic' HTTP authenticator for
realm 'mesos-agent-executor'
I0819 11:39:28.751255 10731 http.cpp:1047] Creating default 'jwt' HTTP authenticator for realm
'mesos-agent-executor'
I0819 11:39:28.751510 10731 http.cpp:1026] Creating default 'basic' HTTP authenticator for
realm 'mesos-agent-readonly'
I0819 11:39:28.751600 10731 http.cpp:1047] Creating default 'jwt' HTTP authenticator for realm
'mesos-agent-readonly'
I0819 11:39:28.751814 10731 http.cpp:1026] Creating default 'basic' HTTP authenticator for
realm 'mesos-agent-readwrite'
I0819 11:39:28.751929 10731 http.cpp:1047] Creating default 'jwt' HTTP authenticator for realm
'mesos-agent-readwrite'
I0819 11:39:28.753368 10731 slave.cpp:581] Agent resources: [{"name":"cpus","scalar":{"value":2.0},"type":"SCALAR"},{"name":"mem","scalar":{"value":1024.0},"type":"SCALAR"},{"name":"disk","scalar":{"value":1024.0},"type":"SCALAR"},{"name":"ports","ranges":{"range":[{"begin":31000,"end":32000}]},"type":"RANGES"}]
I0819 11:39:28.753623 10731 slave.cpp:589] Agent attributes: [  ]
I0819 11:39:28.753633 10731 slave.cpp:598] Agent hostname: f797ac6c10f6
I0819 11:39:28.753808 10730 status_update_manager.cpp:177] Pausing sending status updates
I0819 11:39:28.755275 10729 state.cpp:64] Recovering state from '/tmp/Endpoint_SlaveEndpointTest_UnauthorizedRequest_0_gj67QM/meta'
I0819 11:39:28.755538 10742 status_update_manager.cpp:203] Recovering status update manager
I0819 11:39:28.755699 10727 containerizer.cpp:609] Recovering containerizer
I0819 11:39:28.757052 10728 provisioner.cpp:416] Provisioner recovery complete
I0819 11:39:28.757385 10735 slave.cpp:6226] Finished recovery
I0819 11:39:28.757731 10735 slave.cpp:6408] Querying resource estimator for oversubscribable
resources
I0819 11:39:28.757902 10726 slave.cpp:6422] Received oversubscribable resources {} from the
resource estimator
I0819 11:39:28.759784 10738 process.cpp:3933] Handling HTTP event for process 'slave(805)'
with path: '/slave(805)/monitor/statistics'
I0819 11:39:28.761436 10746 http.cpp:1166] HTTP GET for /slave(805)/monitor/statistics from
172.17.0.7:48436
I0819 11:39:28.761529 10746 http.cpp:957] Authorizing principal 'test-principal' to GET the
'/monitor/statistics' endpoint
I0819 11:39:28.763186 10739 slave.cpp:859] Agent terminating
[       OK ] Endpoint/SlaveEndpointTest.UnauthorizedRequest/0 (31 ms)
[ RUN      ] Endpoint/SlaveEndpointTest.UnauthorizedRequest/1
I0819 11:39:28.773869  2764 containerizer.cpp:246] Using isolation: posix/cpu,posix/mem,filesystem/posix,network/cni,environment_secret
W0819 11:39:28.774340  2764 backend.cpp:76] Failed to create 'aufs' backend: AufsBackend requires
root privileges
W0819 11:39:28.774448  2764 backend.cpp:76] Failed to create 'bind' backend: BindBackend requires
root privileges
I0819 11:39:28.774484  2764 provisioner.cpp:255] Using default backend 'copy'
I0819 11:39:28.778071 10745 slave.cpp:252] Mesos agent started on (806)@172.17.0.7:40519
I0819 11:39:28.778087 10745 slave.cpp:253] Flags at startup: --acls="" --appc_simple_discovery_uri_prefix="http://"
--appc_store_dir="/tmp/Endpoint_SlaveEndpointTest_UnauthorizedRequest_1_pCj8xf/store/appc"
--authenticate_http_executors="true" --authenticate_http_readonly="true" --authenticate_http_readwrite="true"
--authenticatee="crammd5" --authentication_backoff_factor="1secs" --authorizer="local" --cgroups_cpu_enable_pids_and_tids_count="false"
--cgroups_enable_cfs="false" --cgroups_hierarchy="/sys/fs/cgroup" --cgroups_limit_swap="false"
--cgroups_root="mesos" --container_disk_watch_interval="15secs" --containerizers="mesos" --credential="/tmp/Endpoint_SlaveEndpointTest_UnauthorizedRequest_1_pCj8xf/credential"
--default_role="*" --disallow_sharing_agent_pid_namespace="false" --disk_watch_interval="1mins"
--docker="docker" --docker_kill_orphans="true" --docker_registry="https://registry-1.docker.io"
--docker_remove_delay="6hrs" --docker_socket="/var/run/docker.sock" --docker_stop_timeout="0ns"
--docker_store_dir="/tmp/Endpoint_SlaveEndpointTest_UnauthorizedRequest_1_pCj8xf/store/docker"
--docker_volume_checkpoint_dir="/var/run/mesos/isolators/docker/volume" --enforce_container_disk_quota="false"
--executor_registration_timeout="1mins" --executor_reregistration_timeout="2secs" --executor_secret_key="/tmp/Endpoint_SlaveEndpointTest_UnauthorizedRequest_1_pCj8xf/executor_secret_key"
--executor_shutdown_grace_period="5secs" --fetcher_cache_dir="/tmp/Endpoint_SlaveEndpointTest_UnauthorizedRequest_1_pCj8xf/fetch"
--fetcher_cache_size="2GB" --frameworks_home="" --gc_delay="1weeks" --gc_disk_headroom="0.1"
--hadoop_home="" --help="false" --hostname_lookup="true" --http_command_executor="false" --http_credentials="/tmp/Endpoint_SlaveEndpointTest_UnauthorizedRequest_1_pCj8xf/http_credentials"
--http_heartbeat_interval="30secs" --initialize_driver_logging="true" --isolation="posix/cpu,posix/mem"
--launcher="posix" --launcher_dir="/mesos/build/src" --logbufsecs="0" --logging_level="INFO"
--max_completed_executors_per_framework="150" --oversubscribed_resources_interval="15secs"
--perf_duration="10secs" --perf_interval="1mins" --port="5051" --qos_correction_interval_min="0ns"
--quiet="false" --recover="reconnect" --recovery_timeout="15mins" --registration_backoff_factor="10ms"
--resources="cpus:2;gpus:0;mem:1024;disk:1024;ports:[31000-32000]" --revocable_cpu_low_priority="true"
--runtime_dir="/tmp/Endpoint_SlaveEndpointTest_UnauthorizedRequest_1_pCj8xf" --sandbox_directory="/mnt/mesos/sandbox"
--strict="true" --switch_user="true" --systemd_enable_support="true" --systemd_runtime_directory="/run/systemd/system"
--version="false" --work_dir="/tmp/Endpoint_SlaveEndpointTest_UnauthorizedRequest_1_YkSLbm"
I0819 11:39:28.778488 10745 credentials.hpp:86] Loading credential for authentication from
'/tmp/Endpoint_SlaveEndpointTest_UnauthorizedRequest_1_pCj8xf/credential'
I0819 11:39:28.778679 10745 slave.cpp:285] Agent using credential for: test-principal
I0819 11:39:28.778697 10745 credentials.hpp:37] Loading credentials for authentication from
'/tmp/Endpoint_SlaveEndpointTest_UnauthorizedRequest_1_pCj8xf/http_credentials'
I0819 11:39:28.778960 10745 http.cpp:1026] Creating default 'basic' HTTP authenticator for
realm 'mesos-agent-executor'
I0819 11:39:28.779067 10745 http.cpp:1047] Creating default 'jwt' HTTP authenticator for realm
'mesos-agent-executor'
I0819 11:39:28.779244 10745 http.cpp:1026] Creating default 'basic' HTTP authenticator for
realm 'mesos-agent-readonly'
I0819 11:39:28.779345 10745 http.cpp:1047] Creating default 'jwt' HTTP authenticator for realm
'mesos-agent-readonly'
I0819 11:39:28.779503 10745 http.cpp:1026] Creating default 'basic' HTTP authenticator for
realm 'mesos-agent-readwrite'
I0819 11:39:28.779620 10745 http.cpp:1047] Creating default 'jwt' HTTP authenticator for realm
'mesos-agent-readwrite'
I0819 11:39:28.780935 10745 slave.cpp:581] Agent resources: [{"name":"cpus","scalar":{"value":2.0},"type":"SCALAR"},{"name":"mem","scalar":{"value":1024.0},"type":"SCALAR"},{"name":"disk","scalar":{"value":1024.0},"type":"SCALAR"},{"name":"ports","ranges":{"range":[{"begin":31000,"end":32000}]},"type":"RANGES"}]
I0819 11:39:28.781108 10745 slave.cpp:589] Agent attributes: [  ]
I0819 11:39:28.781124 10745 slave.cpp:598] Agent hostname: f797ac6c10f6
I0819 11:39:28.781242 10736 status_update_manager.cpp:177] Pausing sending status updates
I0819 11:39:28.782701 10726 state.cpp:64] Recovering state from '/tmp/Endpoint_SlaveEndpointTest_UnauthorizedRequest_1_YkSLbm/meta'
I0819 11:39:28.782999 10749 status_update_manager.cpp:203] Recovering status update manager
I0819 11:39:28.783157 10739 containerizer.cpp:609] Recovering containerizer
I0819 11:39:28.784229 10742 provisioner.cpp:416] Provisioner recovery complete
I0819 11:39:28.784481 10737 slave.cpp:6226] Finished recovery
I0819 11:39:28.784947 10737 slave.cpp:6408] Querying resource estimator for oversubscribable
resources
I0819 11:39:28.785140 10738 slave.cpp:6422] Received oversubscribable resources {} from the
resource estimator
I0819 11:39:28.787710 10731 process.cpp:3933] Handling HTTP event for process 'slave(806)'
with path: '/slave(806)/monitor/statistics.json'
I0819 11:39:28.789216 10729 http.cpp:1166] HTTP GET for /slave(806)/monitor/statistics.json
from 172.17.0.7:48438
I0819 11:39:28.789275 10729 http.cpp:957] Authorizing principal 'test-principal' to GET the
'/monitor/statistics.json' endpoint
I0819 11:39:28.791929 10745 slave.cpp:859] Agent terminating
[       OK ] Endpoint/SlaveEndpointTest.UnauthorizedRequest/1 (29 ms)
[ RUN      ] Endpoint/SlaveEndpointTest.UnauthorizedRequest/2
I0819 11:39:28.802806  2764 containerizer.cpp:246] Using isolation: posix/cpu,posix/mem,filesystem/posix,network/cni,environment_secret
W0819 11:39:28.803232  2764 backend.cpp:76] Failed to create 'aufs' backend: AufsBackend requires
root privileges
W0819 11:39:28.803349  2764 backend.cpp:76] Failed to create 'bind' backend: BindBackend requires
root privileges
I0819 11:39:28.803380  2764 provisioner.cpp:255] Using default backend 'copy'
I0819 11:39:28.806484 10740 slave.cpp:252] Mesos agent started on (807)@172.17.0.7:40519
I0819 11:39:28.806499 10740 slave.cpp:253] Flags at startup: --acls="" --appc_simple_discovery_uri_prefix="http://"
--appc_store_dir="/tmp/Endpoint_SlaveEndpointTest_UnauthorizedRequest_2_dqvieP/store/appc"
--authenticate_http_executors="true" --authenticate_http_readonly="true" --authenticate_http_readwrite="true"
--authenticatee="crammd5" --authentication_backoff_factor="1secs" --authorizer="local" --cgroups_cpu_enable_pids_and_tids_count="false"
--cgroups_enable_cfs="false" --cgroups_hierarchy="/sys/fs/cgroup" --cgroups_limit_swap="false"
--cgroups_root="mesos" --container_disk_watch_interval="15secs" --containerizers="mesos" --credential="/tmp/Endpoint_SlaveEndpointTest_UnauthorizedRequest_2_dqvieP/credential"
--default_role="*" --disallow_sharing_agent_pid_namespace="false" --disk_watch_interval="1mins"
--docker="docker" --docker_kill_orphans="true" --docker_registry="https://registry-1.docker.io"
--docker_remove_delay="6hrs" --docker_socket="/var/run/docker.sock" --docker_stop_timeout="0ns"
--docker_store_dir="/tmp/Endpoint_SlaveEndpointTest_UnauthorizedRequest_2_dqvieP/store/docker"
--docker_volume_checkpoint_dir="/var/run/mesos/isolators/docker/volume" --enforce_container_disk_quota="false"
--executor_registration_timeout="1mins" --executor_reregistration_timeout="2secs" --executor_secret_key="/tmp/Endpoint_SlaveEndpointTest_UnauthorizedRequest_2_dqvieP/executor_secret_key"
--executor_shutdown_grace_period="5secs" --fetcher_cache_dir="/tmp/Endpoint_SlaveEndpointTest_UnauthorizedRequest_2_dqvieP/fetch"
--fetcher_cache_size="2GB" --frameworks_home="" --gc_delay="1weeks" --gc_disk_headroom="0.1"
--hadoop_home="" --help="false" --hostname_lookup="true" --http_command_executor="false" --http_credentials="/tmp/Endpoint_SlaveEndpointTest_UnauthorizedRequest_2_dqvieP/http_credentials"
--http_heartbeat_interval="30secs" --initialize_driver_logging="true" --isolation="posix/cpu,posix/mem"
--launcher="posix" --launcher_dir="/mesos/build/src" --logbufsecs="0" --logging_level="INFO"
--max_completed_executors_per_framework="150" --oversubscribed_resources_interval="15secs"
--perf_duration="10secs" --perf_interval="1mins" --port="5051" --qos_correction_interval_min="0ns"
--quiet="false" --recover="reconnect" --recovery_timeout="15mins" --registration_backoff_factor="10ms"
--resources="cpus:2;gpus:0;mem:1024;disk:1024;ports:[31000-32000]" --revocable_cpu_low_priority="true"
--runtime_dir="/tmp/Endpoint_SlaveEndpointTest_UnauthorizedRequest_2_dqvieP" --sandbox_directory="/mnt/mesos/sandbox"
--strict="true" --switch_user="true" --systemd_enable_support="true" --systemd_runtime_directory="/run/systemd/system"
--version="false" --work_dir="/tmp/Endpoint_SlaveEndpointTest_UnauthorizedRequest_2_J5HBNV"
I0819 11:39:28.806840 10740 credentials.hpp:86] Loading credential for authentication from
'/tmp/Endpoint_SlaveEndpointTest_UnauthorizedRequest_2_dqvieP/credential'
I0819 11:39:28.807005 10740 slave.cpp:285] Agent using credential for: test-principal
I0819 11:39:28.807020 10740 credentials.hpp:37] Loading credentials for authentication from
'/tmp/Endpoint_SlaveEndpointTest_UnauthorizedRequest_2_dqvieP/http_credentials'
I0819 11:39:28.807270 10740 http.cpp:1026] Creating default 'basic' HTTP authenticator for
realm 'mesos-agent-executor'
I0819 11:39:28.807396 10740 http.cpp:1047] Creating default 'jwt' HTTP authenticator for realm
'mesos-agent-executor'
I0819 11:39:28.807574 10740 http.cpp:1026] Creating default 'basic' HTTP authenticator for
realm 'mesos-agent-readonly'
I0819 11:39:28.807674 10740 http.cpp:1047] Creating default 'jwt' HTTP authenticator for realm
'mesos-agent-readonly'
I0819 11:39:28.807858 10740 http.cpp:1026] Creating default 'basic' HTTP authenticator for
realm 'mesos-agent-readwrite'
I0819 11:39:28.807960 10740 http.cpp:1047] Creating default 'jwt' HTTP authenticator for realm
'mesos-agent-readwrite'
I0819 11:39:28.809152 10740 slave.cpp:581] Agent resources: [{"name":"cpus","scalar":{"value":2.0},"type":"SCALAR"},{"name":"mem","scalar":{"value":1024.0},"type":"SCALAR"},{"name":"disk","scalar":{"value":1024.0},"type":"SCALAR"},{"name":"ports","ranges":{"range":[{"begin":31000,"end":32000}]},"type":"RANGES"}]
I0819 11:39:28.809324 10740 slave.cpp:589] Agent attributes: [  ]
I0819 11:39:28.809335 10740 slave.cpp:598] Agent hostname: f797ac6c10f6
I0819 11:39:28.809499 10741 status_update_manager.cpp:177] Pausing sending status updates
I0819 11:39:28.810760 10727 state.cpp:64] Recovering state from '/tmp/Endpoint_SlaveEndpointTest_UnauthorizedRequest_2_J5HBNV/meta'
I0819 11:39:28.810998 10735 status_update_manager.cpp:203] Recovering status update manager
I0819 11:39:28.811190 10733 containerizer.cpp:609] Recovering containerizer
I0819 11:39:28.812511 10744 provisioner.cpp:416] Provisioner recovery complete
I0819 11:39:28.812825 10734 slave.cpp:6226] Finished recovery
I0819 11:39:28.813313 10734 slave.cpp:6408] Querying resource estimator for oversubscribable
resources
I0819 11:39:28.813560 10742 slave.cpp:6422] Received oversubscribable resources {} from the
resource estimator
I0819 11:39:28.816076 10730 process.cpp:3933] Handling HTTP event for process 'slave(807)'
with path: '/slave(807)/containers'
I0819 11:39:28.817631 10727 http.cpp:1166] HTTP GET for /slave(807)/containers from 172.17.0.7:48440
I0819 11:39:28.817692 10727 http.cpp:957] Authorizing principal 'test-principal' to GET the
'/containers' endpoint
I0819 11:39:28.819787  2764 slave.cpp:859] Agent terminating
[       OK ] Endpoint/SlaveEndpointTest.UnauthorizedRequest/2 (26 ms)
[ RUN      ] Endpoint/SlaveEndpointTest.NoAuthorizer/0
I0819 11:39:28.830200  2764 containerizer.cpp:246] Using isolation: posix/cpu,posix/mem,filesystem/posix,network/cni,environment_secret
W0819 11:39:28.830735  2764 backend.cpp:76] Failed to create 'aufs' backend: AufsBackend requires
root privileges
W0819 11:39:28.830855  2764 backend.cpp:76] Failed to create 'bind' backend: BindBackend requires
root privileges
I0819 11:39:28.830889  2764 provisioner.cpp:255] Using default backend 'copy'
I0819 11:39:28.832581  2764 cluster.cpp:448] Creating default 'local' authorizer
I0819 11:39:28.834246 10730 slave.cpp:252] Mesos agent started on (808)@172.17.0.7:40519
I0819 11:39:28.834262 10730 slave.cpp:253] Flags at startup: --acls="" --appc_simple_discovery_uri_prefix="http://"
--appc_store_dir="/tmp/Endpoint_SlaveEndpointTest_NoAuthorizer_0_jbwFap/store/appc" --authenticate_http_executors="true"
--authenticate_http_readonly="true" --authenticate_http_readwrite="true" --authenticatee="crammd5"
--authentication_backoff_factor="1secs" --authorizer="local" --cgroups_cpu_enable_pids_and_tids_count="false"
--cgroups_enable_cfs="false" --cgroups_hierarchy="/sys/fs/cgroup" --cgroups_limit_swap="false"
--cgroups_root="mesos" --container_disk_watch_interval="15secs" --containerizers="mesos" --credential="/tmp/Endpoint_SlaveEndpointTest_NoAuthorizer_0_jbwFap/credential"
--default_role="*" --disallow_sharing_agent_pid_namespace="false" --disk_watch_interval="1mins"
--docker="docker" --docker_kill_orphans="true" --docker_registry="https://registry-1.docker.io"
--docker_remove_delay="6hrs" --docker_socket="/var/run/docker.sock" --docker_stop_timeout="0ns"
--docker_store_dir="/tmp/Endpoint_SlaveEndpointTest_NoAuthorizer_0_jbwFap/store/docker" --docker_volume_checkpoint_dir="/var/run/mesos/isolators/docker/volume"
--enforce_container_disk_quota="false" --executor_registration_timeout="1mins" --executor_reregistration_timeout="2secs"
--executor_secret_key="/tmp/Endpoint_SlaveEndpointTest_NoAuthorizer_0_jbwFap/executor_secret_key"
--executor_shutdown_grace_period="5secs" --fetcher_cache_dir="/tmp/Endpoint_SlaveEndpointTest_NoAuthorizer_0_jbwFap/fetch"
--fetcher_cache_size="2GB" --frameworks_home="" --gc_delay="1weeks" --gc_disk_headroom="0.1"
--hadoop_home="" --help="false" --hostname_lookup="true" --http_command_executor="false" --http_credentials="/tmp/Endpoint_SlaveEndpointTest_NoAuthorizer_0_jbwFap/http_credentials"
--http_heartbeat_interval="30secs" --initialize_driver_logging="true" --isolation="posix/cpu,posix/mem"
--launcher="posix" --launcher_dir="/mesos/build/src" --logbufsecs="0" --logging_level="INFO"
--max_completed_executors_per_framework="150" --oversubscribed_resources_interval="15secs"
--perf_duration="10secs" --perf_interval="1mins" --port="5051" --qos_correction_interval_min="0ns"
--quiet="false" --recover="reconnect" --recovery_timeout="15mins" --registration_backoff_factor="10ms"
--resources="cpus:2;gpus:0;mem:1024;disk:1024;ports:[31000-32000]" --revocable_cpu_low_priority="true"
--runtime_dir="/tmp/Endpoint_SlaveEndpointTest_NoAuthorizer_0_jbwFap" --sandbox_directory="/mnt/mesos/sandbox"
--strict="true" --switch_user="true" --systemd_enable_support="true" --systemd_runtime_directory="/run/systemd/system"
--version="false" --work_dir="/tmp/Endpoint_SlaveEndpointTest_NoAuthorizer_0_yXvYFv"
I0819 11:39:28.834702 10730 credentials.hpp:86] Loading credential for authentication from
'/tmp/Endpoint_SlaveEndpointTest_NoAuthorizer_0_jbwFap/credential'
I0819 11:39:28.834854 10730 slave.cpp:285] Agent using credential for: test-principal
I0819 11:39:28.834869 10730 credentials.hpp:37] Loading credentials for authentication from
'/tmp/Endpoint_SlaveEndpointTest_NoAuthorizer_0_jbwFap/http_credentials'
I0819 11:39:28.835136 10730 http.cpp:1026] Creating default 'basic' HTTP authenticator for
realm 'mesos-agent-executor'
I0819 11:39:28.835263 10730 http.cpp:1047] Creating default 'jwt' HTTP authenticator for realm
'mesos-agent-executor'
I0819 11:39:28.835460 10730 http.cpp:1026] Creating default 'basic' HTTP authenticator for
realm 'mesos-agent-readonly'
I0819 11:39:28.835551 10730 http.cpp:1047] Creating default 'jwt' HTTP authenticator for realm
'mesos-agent-readonly'
I0819 11:39:28.835712 10730 http.cpp:1026] Creating default 'basic' HTTP authenticator for
realm 'mesos-agent-readwrite'
I0819 11:39:28.835813 10730 http.cpp:1047] Creating default 'jwt' HTTP authenticator for realm
'mesos-agent-readwrite'
I0819 11:39:28.837090 10730 slave.cpp:581] Agent resources: [{"name":"cpus","scalar":{"value":2.0},"type":"SCALAR"},{"name":"mem","scalar":{"value":1024.0},"type":"SCALAR"},{"name":"disk","scalar":{"value":1024.0},"type":"SCALAR"},{"name":"ports","ranges":{"range":[{"begin":31000,"end":32000}]},"type":"RANGES"}]
I0819 11:39:28.837277 10730 slave.cpp:589] Agent attributes: [  ]
I0819 11:39:28.837287 10730 slave.cpp:598] Agent hostname: f797ac6c10f6
I0819 11:39:28.837407 10734 status_update_manager.cpp:177] Pausing sending status updates
I0819 11:39:28.838809 10726 state.cpp:64] Recovering state from '/tmp/Endpoint_SlaveEndpointTest_NoAuthorizer_0_yXvYFv/meta'
I0819 11:39:28.839098 10749 status_update_manager.cpp:203] Recovering status update manager
I0819 11:39:28.839254 10733 containerizer.cpp:609] Recovering containerizer
I0819 11:39:28.840378 10735 provisioner.cpp:416] Provisioner recovery complete
I0819 11:39:28.840862 10737 slave.cpp:6226] Finished recovery
I0819 11:39:28.841634 10737 slave.cpp:6408] Querying resource estimator for oversubscribable
resources
I0819 11:39:28.841899 10739 slave.cpp:6422] Received oversubscribable resources {} from the
resource estimator
I0819 11:39:28.844200 10734 process.cpp:3933] Handling HTTP event for process 'slave(808)'
with path: '/slave(808)/monitor/statistics'
I0819 11:39:28.846124 10736 http.cpp:1166] HTTP GET for /slave(808)/monitor/statistics from
172.17.0.7:48446
I0819 11:39:28.846262 10736 http.cpp:957] Authorizing principal 'test-principal' to GET the
'/monitor/statistics' endpoint
I0819 11:39:28.849871  2764 slave.cpp:859] Agent terminating
[       OK ] Endpoint/SlaveEndpointTest.NoAuthorizer/0 (29 ms)
[ RUN      ] Endpoint/SlaveEndpointTest.NoAuthorizer/1
I0819 11:39:28.859246  2764 containerizer.cpp:246] Using isolation: posix/cpu,posix/mem,filesystem/posix,network/cni,environment_secret
W0819 11:39:28.859679  2764 backend.cpp:76] Failed to create 'aufs' backend: AufsBackend requires
root privileges
W0819 11:39:28.859766  2764 backend.cpp:76] Failed to create 'bind' backend: BindBackend requires
root privileges
I0819 11:39:28.859789  2764 provisioner.cpp:255] Using default backend 'copy'
I0819 11:39:28.861333  2764 cluster.cpp:448] Creating default 'local' authorizer
I0819 11:39:28.862907 10747 slave.cpp:252] Mesos agent started on (809)@172.17.0.7:40519
I0819 11:39:28.862932 10747 slave.cpp:253] Flags at startup: --acls="" --appc_simple_discovery_uri_prefix="http://"
--appc_store_dir="/tmp/Endpoint_SlaveEndpointTest_NoAuthorizer_1_373koZ/store/appc" --authenticate_http_executors="true"
--authenticate_http_readonly="true" --authenticate_http_readwrite="true" --authenticatee="crammd5"
--authentication_backoff_factor="1secs" --authorizer="local" --cgroups_cpu_enable_pids_and_tids_count="false"
--cgroups_enable_cfs="false" --cgroups_hierarchy="/sys/fs/cgroup" --cgroups_limit_swap="false"
--cgroups_root="mesos" --container_disk_watch_interval="15secs" --containerizers="mesos" --credential="/tmp/Endpoint_SlaveEndpointTest_NoAuthorizer_1_373koZ/credential"
--default_role="*" --disallow_sharing_agent_pid_namespace="false" --disk_watch_interval="1mins"
--docker="docker" --docker_kill_orphans="true" --docker_registry="https://registry-1.docker.io"
--docker_remove_delay="6hrs" --docker_socket="/var/run/docker.sock" --docker_stop_timeout="0ns"
--docker_store_dir="/tmp/Endpoint_SlaveEndpointTest_NoAuthorizer_1_373koZ/store/docker" --docker_volume_checkpoint_dir="/var/run/mesos/isolators/docker/volume"
--enforce_container_disk_quota="false" --executor_registration_timeout="1mins" --executor_reregistration_timeout="2secs"
--executor_secret_key="/tmp/Endpoint_SlaveEndpointTest_NoAuthorizer_1_373koZ/executor_secret_key"
--executor_shutdown_grace_period="5secs" --fetcher_cache_dir="/tmp/Endpoint_SlaveEndpointTest_NoAuthorizer_1_373koZ/fetch"
--fetcher_cache_size="2GB" --frameworks_home="" --gc_delay="1weeks" --gc_disk_headroom="0.1"
--hadoop_home="" --help="false" --hostname_lookup="true" --http_command_executor="false" --http_credentials="/tmp/Endpoint_SlaveEndpointTest_NoAuthorizer_1_373koZ/http_credentials"
--http_heartbeat_interval="30secs" --initialize_driver_logging="true" --isolation="posix/cpu,posix/mem"
--launcher="posix" --launcher_dir="/mesos/build/src" --logbufsecs="0" --logging_level="INFO"
--max_completed_executors_per_framework="150" --oversubscribed_resources_interval="15secs"
--perf_duration="10secs" --perf_interval="1mins" --port="5051" --qos_correction_interval_min="0ns"
--quiet="false" --recover="reconnect" --recovery_timeout="15mins" --registration_backoff_factor="10ms"
--resources="cpus:2;gpus:0;mem:1024;disk:1024;ports:[31000-32000]" --revocable_cpu_low_priority="true"
--runtime_dir="/tmp/Endpoint_SlaveEndpointTest_NoAuthorizer_1_373koZ" --sandbox_directory="/mnt/mesos/sandbox"
--strict="true" --switch_user="true" --systemd_enable_support="true" --systemd_runtime_directory="/run/systemd/system"
--version="false" --work_dir="/tmp/Endpoint_SlaveEndpointTest_NoAuthorizer_1_ehLhP5"
I0819 11:39:28.863395 10747 credentials.hpp:86] Loading credential for authentication from
'/tmp/Endpoint_SlaveEndpointTest_NoAuthorizer_1_373koZ/credential'
I0819 11:39:28.863549 10747 slave.cpp:285] Agent using credential for: test-principal
I0819 11:39:28.863569 10747 credentials.hpp:37] Loading credentials for authentication from
'/tmp/Endpoint_SlaveEndpointTest_NoAuthorizer_1_373koZ/http_credentials'
I0819 11:39:28.863829 10747 http.cpp:1026] Creating default 'basic' HTTP authenticator for
realm 'mesos-agent-executor'
I0819 11:39:28.863950 10747 http.cpp:1047] Creating default 'jwt' HTTP authenticator for realm
'mesos-agent-executor'
I0819 11:39:28.864145 10747 http.cpp:1026] Creating default 'basic' HTTP authenticator for
realm 'mesos-agent-readonly'
I0819 11:39:28.864245 10747 http.cpp:1047] Creating default 'jwt' HTTP authenticator for realm
'mesos-agent-readonly'
I0819 11:39:28.864425 10747 http.cpp:1026] Creating default 'basic' HTTP authenticator for
realm 'mesos-agent-readwrite'
I0819 11:39:28.864524 10747 http.cpp:1047] Creating default 'jwt' HTTP authenticator for realm
'mesos-agent-readwrite'
I0819 11:39:28.865949 10747 slave.cpp:581] Agent resources: [{"name":"cpus","scalar":{"value":2.0},"type":"SCALAR"},{"name":"mem","scalar":{"value":1024.0},"type":"SCALAR"},{"name":"disk","scalar":{"value":1024.0},"type":"SCALAR"},{"name":"ports","ranges":{"range":[{"begin":31000,"end":32000}]},"type":"RANGES"}]
I0819 11:39:28.866153 10747 slave.cpp:589] Agent attributes: [  ]
I0819 11:39:28.866165 10747 slave.cpp:598] Agent hostname: f797ac6c10f6
I0819 11:39:28.866320 10729 status_update_manager.cpp:177] Pausing sending status updates
I0819 11:39:28.867420 10732 state.cpp:64] Recovering state from '/tmp/Endpoint_SlaveEndpointTest_NoAuthorizer_1_ehLhP5/meta'
I0819 11:39:28.867800 10744 status_update_manager.cpp:203] Recovering status update manager
I0819 11:39:28.868022 10745 containerizer.cpp:609] Recovering containerizer
I0819 11:39:28.869144 10735 provisioner.cpp:416] Provisioner recovery complete
I0819 11:39:28.869391 10731 slave.cpp:6226] Finished recovery
I0819 11:39:28.869794 10731 slave.cpp:6408] Querying resource estimator for oversubscribable
resources
I0819 11:39:28.870004 10748 slave.cpp:6422] Received oversubscribable resources {} from the
resource estimator
I0819 11:39:28.872377 10740 process.cpp:3933] Handling HTTP event for process 'slave(809)'
with path: '/slave(809)/monitor/statistics.json'
I0819 11:39:28.874148 10739 http.cpp:1166] HTTP GET for /slave(809)/monitor/statistics.json
from 172.17.0.7:48450
I0819 11:39:28.874245 10739 http.cpp:957] Authorizing principal 'test-principal' to GET the
'/monitor/statistics.json' endpoint
I0819 11:39:28.877012 10731 slave.cpp:859] Agent terminating
[       OK ] Endpoint/SlaveEndpointTest.NoAuthorizer/1 (28 ms)
[ RUN      ] Endpoint/SlaveEndpointTest.NoAuthorizer/2
I0819 11:39:28.887076  2764 containerizer.cpp:246] Using isolation: posix/cpu,posix/mem,filesystem/posix,network/cni,environment_secret
W0819 11:39:28.887490  2764 backend.cpp:76] Failed to create 'aufs' backend: AufsBackend requires
root privileges
W0819 11:39:28.887576  2764 backend.cpp:76] Failed to create 'bind' backend: BindBackend requires
root privileges
I0819 11:39:28.887600  2764 provisioner.cpp:255] Using default backend 'copy'
I0819 11:39:28.889086  2764 cluster.cpp:448] Creating default 'local' authorizer
I0819 11:39:28.890692 10740 slave.cpp:252] Mesos agent started on (810)@172.17.0.7:40519
I0819 11:39:28.890707 10740 slave.cpp:253] Flags at startup: --acls="" --appc_simple_discovery_uri_prefix="http://"
--appc_store_dir="/tmp/Endpoint_SlaveEndpointTest_NoAuthorizer_2_bnEGSz/store/appc" --authenticate_http_executors="true"
--authenticate_http_readonly="true" --authenticate_http_readwrite="true" --authenticatee="crammd5"
--authentication_backoff_factor="1secs" --authorizer="local" --cgroups_cpu_enable_pids_and_tids_count="false"
--cgroups_enable_cfs="false" --cgroups_hierarchy="/sys/fs/cgroup" --cgroups_limit_swap="false"
--cgroups_root="mesos" --container_disk_watch_interval="15secs" --containerizers="mesos" --credential="/tmp/Endpoint_SlaveEndpointTest_NoAuthorizer_2_bnEGSz/credential"
--default_role="*" --disallow_sharing_agent_pid_namespace="false" --disk_watch_interval="1mins"
--docker="docker" --docker_kill_orphans="true" --docker_registry="https://registry-1.docker.io"
--docker_remove_delay="6hrs" --docker_socket="/var/run/docker.sock" --docker_stop_timeout="0ns"
--docker_store_dir="/tmp/Endpoint_SlaveEndpointTest_NoAuthorizer_2_bnEGSz/store/docker" --docker_volume_checkpoint_dir="/var/run/mesos/isolators/docker/volume"
--enforce_container_disk_quota="false" --executor_registration_timeout="1mins" --executor_reregistration_timeout="2secs"
--executor_secret_key="/tmp/Endpoint_SlaveEndpointTest_NoAuthorizer_2_bnEGSz/executor_secret_key"
--executor_shutdown_grace_period="5secs" --fetcher_cache_dir="/tmp/Endpoint_SlaveEndpointTest_NoAuthorizer_2_bnEGSz/fetch"
--fetcher_cache_size="2GB" --frameworks_home="" --gc_delay="1weeks" --gc_disk_headroom="0.1"
--hadoop_home="" --help="false" --hostname_lookup="true" --http_command_executor="false" --http_credentials="/tmp/Endpoint_SlaveEndpointTest_NoAuthorizer_2_bnEGSz/http_credentials"
--http_heartbeat_interval="30secs" --initialize_driver_logging="true" --isolation="posix/cpu,posix/mem"
--launcher="posix" --launcher_dir="/mesos/build/src" --logbufsecs="0" --logging_level="INFO"
--max_completed_executors_per_framework="150" --oversubscribed_resources_interval="15secs"
--perf_duration="10secs" --perf_interval="1mins" --port="5051" --qos_correction_interval_min="0ns"
--quiet="false" --recover="reconnect" --recovery_timeout="15mins" --registration_backoff_factor="10ms"
--resources="cpus:2;gpus:0;mem:1024;disk:1024;ports:[31000-32000]" --revocable_cpu_low_priority="true"
--runtime_dir="/tmp/Endpoint_SlaveEndpointTest_NoAuthorizer_2_bnEGSz" --sandbox_directory="/mnt/mesos/sandbox"
--strict="true" --switch_user="true" --systemd_enable_support="true" --systemd_runtime_directory="/run/systemd/system"
--version="false" --work_dir="/tmp/Endpoint_SlaveEndpointTest_NoAuthorizer_2_ObmufG"
I0819 11:39:28.891012 10740 credentials.hpp:86] Loading credential for authentication from
'/tmp/Endpoint_SlaveEndpointTest_NoAuthorizer_2_bnEGSz/credential'
I0819 11:39:28.891144 10740 slave.cpp:285] Agent using credential for: test-principal
I0819 11:39:28.891161 10740 credentials.hpp:37] Loading credentials for authentication from
'/tmp/Endpoint_SlaveEndpointTest_NoAuthorizer_2_bnEGSz/http_credentials'
I0819 11:39:28.891377 10740 http.cpp:1026] Creating default 'basic' HTTP authenticator for
realm 'mesos-agent-executor'
I0819 11:39:28.891489 10740 http.cpp:1047] Creating default 'jwt' HTTP authenticator for realm
'mesos-agent-executor'
I0819 11:39:28.891664 10740 http.cpp:1026] Creating default 'basic' HTTP authenticator for
realm 'mesos-agent-readonly'
I0819 11:39:28.891752 10740 http.cpp:1047] Creating default 'jwt' HTTP authenticator for realm
'mesos-agent-readonly'
I0819 11:39:28.891908 10740 http.cpp:1026] Creating default 'basic' HTTP authenticator for
realm 'mesos-agent-readwrite'
I0819 11:39:28.891997 10740 http.cpp:1047] Creating default 'jwt' HTTP authenticator for realm
'mesos-agent-readwrite'
I0819 11:39:28.893170 10740 slave.cpp:581] Agent resources: [{"name":"cpus","scalar":{"value":2.0},"type":"SCALAR"},{"name":"mem","scalar":{"value":1024.0},"type":"SCALAR"},{"name":"disk","scalar":{"value":1024.0},"type":"SCALAR"},{"name":"ports","ranges":{"range":[{"begin":31000,"end":32000}]},"type":"RANGES"}]
I0819 11:39:28.893338 10740 slave.cpp:589] Agent attributes: [  ]
I0819 11:39:28.893352 10740 slave.cpp:598] Agent hostname: f797ac6c10f6
I0819 11:39:28.893458 10737 status_update_manager.cpp:177] Pausing sending status updates
I0819 11:39:28.894703 10747 state.cpp:64] Recovering state from '/tmp/Endpoint_SlaveEndpointTest_NoAuthorizer_2_ObmufG/meta'
I0819 11:39:28.895105 10739 status_update_manager.cpp:203] Recovering status update manager
I0819 11:39:28.895313 10747 containerizer.cpp:609] Recovering containerizer
I0819 11:39:28.896983 10730 provisioner.cpp:416] Provisioner recovery complete
I0819 11:39:28.897408 10740 slave.cpp:6226] Finished recovery
I0819 11:39:28.897799 10740 slave.cpp:6408] Querying resource estimator for oversubscribable
resources
I0819 11:39:28.898003 10742 slave.cpp:6422] Received oversubscribable resources {} from the
resource estimator
I0819 11:39:28.899683 10729 process.cpp:3933] Handling HTTP event for process 'slave(810)'
with path: '/slave(810)/containers'
I0819 11:39:28.901566 10745 http.cpp:1166] HTTP GET for /slave(810)/containers from 172.17.0.7:48452
I0819 11:39:28.901630 10745 http.cpp:957] Authorizing principal 'test-principal' to GET the
'/containers' endpoint
I0819 11:39:28.904723 10747 slave.cpp:859] Agent terminating
[       OK ] Endpoint/SlaveEndpointTest.NoAuthorizer/2 (28 ms)
[----------] 9 tests from Endpoint/SlaveEndpointTest (268 ms total)

[----------] Global test environment tear-down
[==========] 1620 tests from 177 test cases ran. (299796 ms total)
[  PASSED  ] 1619 tests.
[  FAILED  ] 1 test, listed below:
[  FAILED  ] OversubscriptionTest.RescindRevocableOfferWithIncreasedRevocable

 1 FAILED TEST
  YOU HAVE 20 DISABLED TESTS

I0819 11:39:28.964155 10750 process.cpp:1072] Failed to accept socket: future discarded
make[3]: *** [CMakeFiles/check] Error 1
make[3]: Leaving directory `/mesos/build'
make[2]: *** [CMakeFiles/check.dir/all] Error 2
make[2]: Leaving directory `/mesos/build'
make[1]: *** [CMakeFiles/check.dir/rule] Error 2
make[1]: Leaving directory `/mesos/build'
make: *** [check] Error 2
+ docker rmi mesos-1503139827-31551
Untagged: mesos-1503139827-31551:latest
Deleted: sha256:df09b0181a1bbffa496274962c0dfd0e4e039b8ca34842e7e1deff656b67fc88
Deleted: sha256:e33ced89d61d832372f837f5adc8ad81021e6048cc7d5a6adab89f05a848a306
Deleted: sha256:eab81acb826422ff37d3c6c26b8305848a8e1501988bae5fc22c90cbfaac0669
Deleted: sha256:e5044dea32f23aeb910c417079a4d1a600d1032768178015c8f9fa90537a9e19
Deleted: sha256:8aaee1843ea8cebfe50b6025d30d4384bb518a2a8b4445b2a0965a2537dedb22
Deleted: sha256:9eb7eed6a42e235c5680b7f71413a32fbcb8b8c00ca3e8d874b9d429fe73a4fa
Deleted: sha256:d303cb69fbfe94f72be52149a3adbf78fa2efd22da15beb722575ee719b17656
Deleted: sha256:3b508d2aea6256091ab287ecfc402d5112af1e5a12548c0a1bb1398d0ab662f5
Deleted: sha256:ee6328a768675e828ec4d404483f5a18bf4350a5c2b1782f1c6203f61f9bba95
Deleted: sha256:450e5b45f6cbd6115c9ce3c05e8c3532f18a0f8d384209bd2b3ef703d9f80e31
Deleted: sha256:9ef2e36c078f46f36221babd81fd38f1bade82ac269cea1ef15beb73028969af
Deleted: sha256:9e3f5668d10cc6671adb201e4d8ab36d8b3324287b1668b3eedc658a525b2332
Deleted: sha256:c4465f400fe9579ca6358d9f342be485f5e8d53d35fdd159aef09dd83a053a9a
Deleted: sha256:53dd9eaa195057210ed108b394b3e56659eb7f6ccd2092a484a2e778b1f94edc
Deleted: sha256:4cfc90c54dffbd86c4533ccba041fbaefa3aa58ede70cbd1470addf565a8c644
Deleted: sha256:f96a66998245e021d3f7dc3a15d8ac6ac70b402a87e12c9201c3c4f4bc2fb272
Deleted: sha256:78425eef3c63b4f604dee47bf03e55d6a586363620523bd0146319cf2ceb6cf8
Deleted: sha256:f4cf50ab1a88549bd3f77733d8958bddf700544b97642aa860f0e968242af0e2
Deleted: sha256:c086b86825aadec6e34fdf0296ee17f65d20c642d44accafe36d0272f27cb0ac
Deleted: sha256:bd4c6b8424e92910f6ea377fc228f57b10437dad55d44c654720e792b875dfcf
Deleted: sha256:be56c33f283c49858f2349dbc6793d39c712f58f268812dc0c043860412b2701
Deleted: sha256:e2df7d3195ba0f239b36df4f8539e68d1bfd80c25050e6a46ca0a96a445d5fae
Deleted: sha256:42397af78c88613c9d6c801bbfe3111fd97b9cb41cd9e6caff13d6fe23834adb
Deleted: sha256:fcc8de09e1fbeecc139d675327be0234dfb6870862b1de8bc4eec8e8123a4a04
Build step 'Execute shell' marked build as failure
Not sending mail to unregistered user yujie.jay@gmail.com
Not sending mail to unregistered user gregorywmann@gmail.com

Mime
View raw message