mesos-builds mailing list archives

Site index · List index
Message view « Date » · « Thread »
Top « Date » · « Thread »
From Apache Jenkins Server <jenk...@builds.apache.org>
Subject Build failed in Jenkins: Mesos-Buildbot » autotools,gcc,--verbose,GLOG_v=1 MESOS_VERBOSE=1,centos:7,(ubuntu)&&(!ubuntu-us1)&&(!ubuntu-eu2) #4153
Date Fri, 25 Aug 2017 12:59:16 GMT
See <https://builds.apache.org/job/Mesos-Buildbot/BUILDTOOL=autotools,COMPILER=gcc,CONFIGURATION=--verbose,ENVIRONMENT=GLOG_v=1%20MESOS_VERBOSE=1,OS=centos%3A7,label_exp=(ubuntu)&&(!ubuntu-us1)&&(!ubuntu-eu2)/4153/display/redirect?page=changes>

Changes:

[alexr] Fixed the mention of default ports in 'configuration.md'.

------------------------------------------
[...truncated 31.25 MB...]
I0825 12:59:00.585700  6731 http.cpp:1026] Creating default 'basic' HTTP authenticator for
realm 'mesos-agent-readwrite'
I0825 12:59:00.587065  6731 slave.cpp:581] Agent resources: [{"name":"cpus","scalar":{"value":2.0},"type":"SCALAR"},{"name":"mem","scalar":{"value":1024.0},"type":"SCALAR"},{"name":"disk","scalar":{"value":1024.0},"type":"SCALAR"},{"name":"ports","ranges":{"range":[{"begin":31000,"end":32000}]},"type":"RANGES"}]
I0825 12:59:00.587287  6731 slave.cpp:589] Agent attributes: [  ]
I0825 12:59:00.587302  6731 slave.cpp:598] Agent hostname: 055edb0c8c9e
I0825 12:59:00.587455  6728 status_update_manager.cpp:177] Pausing sending status updates
I0825 12:59:00.589206  6734 state.cpp:64] Recovering state from '/tmp/Endpoint_SlaveEndpointTest_AuthorizedRequest_2_FI8nBE/meta'
I0825 12:59:00.589522  6724 status_update_manager.cpp:203] Recovering status update manager
I0825 12:59:00.589743  6736 containerizer.cpp:643] Recovering containerizer
I0825 12:59:00.591183  6717 provisioner.cpp:416] Provisioner recovery complete
I0825 12:59:00.591514  6726 slave.cpp:6264] Finished recovery
I0825 12:59:00.592001  6726 slave.cpp:6446] Querying resource estimator for oversubscribable
resources
I0825 12:59:00.592284  6725 slave.cpp:6460] Received oversubscribable resources {} from the
resource estimator
I0825 12:59:00.595075  6720 process.cpp:3933] Handling HTTP event for process 'slave(799)'
with path: '/slave(799)/containers'
I0825 12:59:00.596285  6735 http.cpp:1166] HTTP GET for /slave(799)/containers from 172.17.0.12:38838
I0825 12:59:00.596354  6735 http.cpp:957] Authorizing principal 'test-principal' to GET the
'/containers' endpoint
I0825 12:59:00.599225  6727 slave.cpp:859] Agent terminating
[       OK ] Endpoint/SlaveEndpointTest.AuthorizedRequest/2 (30 ms)
[ RUN      ] Endpoint/SlaveEndpointTest.UnauthorizedRequest/0
I0825 12:59:00.609135  6694 containerizer.cpp:288] Using isolation { environment_secret, posix/cpu,
posix/mem, filesystem/posix, network/cni }
W0825 12:59:00.609606  6694 backend.cpp:76] Failed to create 'aufs' backend: AufsBackend requires
root privileges
W0825 12:59:00.609704  6694 backend.cpp:76] Failed to create 'bind' backend: BindBackend requires
root privileges
I0825 12:59:00.609735  6694 provisioner.cpp:255] Using default backend 'copy'
I0825 12:59:00.612778  6730 slave.cpp:252] Mesos agent started on (800)@172.17.0.12:44456
I0825 12:59:00.612798  6730 slave.cpp:253] Flags at startup: --acls="" --appc_simple_discovery_uri_prefix="http://"
--appc_store_dir="/tmp/Endpoint_SlaveEndpointTest_UnauthorizedRequest_0_VuZWuV/store/appc"
--authenticate_http_readonly="true" --authenticate_http_readwrite="true" --authenticatee="crammd5"
--authentication_backoff_factor="1secs" --authorizer="local" --cgroups_cpu_enable_pids_and_tids_count="false"
--cgroups_enable_cfs="false" --cgroups_hierarchy="/sys/fs/cgroup" --cgroups_limit_swap="false"
--cgroups_root="mesos" --container_disk_watch_interval="15secs" --containerizers="mesos" --credential="/tmp/Endpoint_SlaveEndpointTest_UnauthorizedRequest_0_VuZWuV/credential"
--default_role="*" --disallow_sharing_agent_pid_namespace="false" --disk_watch_interval="1mins"
--docker="docker" --docker_kill_orphans="true" --docker_registry="https://registry-1.docker.io"
--docker_remove_delay="6hrs" --docker_socket="/var/run/docker.sock" --docker_stop_timeout="0ns"
--docker_store_dir="/tmp/Endpoint_SlaveEndpointTest_UnauthorizedRequest_0_VuZWuV/store/docker"
--docker_volume_checkpoint_dir="/var/run/mesos/isolators/docker/volume" --enforce_container_disk_quota="false"
--executor_registration_timeout="1mins" --executor_reregistration_timeout="2secs" --executor_shutdown_grace_period="5secs"
--fetcher_cache_dir="/tmp/Endpoint_SlaveEndpointTest_UnauthorizedRequest_0_VuZWuV/fetch" --fetcher_cache_size="2GB"
--frameworks_home="" --gc_delay="1weeks" --gc_disk_headroom="0.1" --hadoop_home="" --help="false"
--hostname_lookup="true" --http_command_executor="false" --http_credentials="/tmp/Endpoint_SlaveEndpointTest_UnauthorizedRequest_0_VuZWuV/http_credentials"
--http_heartbeat_interval="30secs" --initialize_driver_logging="true" --isolation="posix/cpu,posix/mem"
--launcher="posix" --launcher_dir="/mesos/mesos-1.5.0/_build/src" --logbufsecs="0" --logging_level="INFO"
--max_completed_executors_per_framework="150" --oversubscribed_resources_interval="15secs"
--perf_duration="10secs" --perf_interval="1mins" --port="5051" --qos_correction_interval_min="0ns"
--quiet="false" --recover="reconnect" --recovery_timeout="15mins" --registration_backoff_factor="10ms"
--resources="cpus:2;gpus:0;mem:1024;disk:1024;ports:[31000-32000]" --revocable_cpu_low_priority="true"
--runtime_dir="/tmp/Endpoint_SlaveEndpointTest_UnauthorizedRequest_0_VuZWuV" --sandbox_directory="/mnt/mesos/sandbox"
--strict="true" --switch_user="true" --systemd_enable_support="true" --systemd_runtime_directory="/run/systemd/system"
--version="false" --work_dir="/tmp/Endpoint_SlaveEndpointTest_UnauthorizedRequest_0_BUeeHF"
I0825 12:59:00.613179  6730 credentials.hpp:86] Loading credential for authentication from
'/tmp/Endpoint_SlaveEndpointTest_UnauthorizedRequest_0_VuZWuV/credential'
I0825 12:59:00.613335  6730 slave.cpp:285] Agent using credential for: test-principal
I0825 12:59:00.613356  6730 credentials.hpp:37] Loading credentials for authentication from
'/tmp/Endpoint_SlaveEndpointTest_UnauthorizedRequest_0_VuZWuV/http_credentials'
I0825 12:59:00.613585  6730 http.cpp:1026] Creating default 'basic' HTTP authenticator for
realm 'mesos-agent-readonly'
I0825 12:59:00.613734  6730 http.cpp:1026] Creating default 'basic' HTTP authenticator for
realm 'mesos-agent-readwrite'
I0825 12:59:00.614962  6730 slave.cpp:581] Agent resources: [{"name":"cpus","scalar":{"value":2.0},"type":"SCALAR"},{"name":"mem","scalar":{"value":1024.0},"type":"SCALAR"},{"name":"disk","scalar":{"value":1024.0},"type":"SCALAR"},{"name":"ports","ranges":{"range":[{"begin":31000,"end":32000}]},"type":"RANGES"}]
I0825 12:59:00.615165  6730 slave.cpp:589] Agent attributes: [  ]
I0825 12:59:00.615180  6730 slave.cpp:598] Agent hostname: 055edb0c8c9e
I0825 12:59:00.615289  6728 status_update_manager.cpp:177] Pausing sending status updates
I0825 12:59:00.616636  6732 state.cpp:64] Recovering state from '/tmp/Endpoint_SlaveEndpointTest_UnauthorizedRequest_0_BUeeHF/meta'
I0825 12:59:00.616891  6718 status_update_manager.cpp:203] Recovering status update manager
I0825 12:59:00.617126  6721 containerizer.cpp:643] Recovering containerizer
I0825 12:59:00.618510  6719 provisioner.cpp:416] Provisioner recovery complete
I0825 12:59:00.618830  6714 slave.cpp:6264] Finished recovery
I0825 12:59:00.619220  6714 slave.cpp:6446] Querying resource estimator for oversubscribable
resources
I0825 12:59:00.619431  6725 slave.cpp:6460] Received oversubscribable resources {} from the
resource estimator
I0825 12:59:00.621610  6715 process.cpp:3933] Handling HTTP event for process 'slave(800)'
with path: '/slave(800)/monitor/statistics'
I0825 12:59:00.622676  6735 http.cpp:1166] HTTP GET for /slave(800)/monitor/statistics from
172.17.0.12:38840
I0825 12:59:00.622735  6735 http.cpp:957] Authorizing principal 'test-principal' to GET the
'/monitor/statistics' endpoint
I0825 12:59:00.624233  6730 slave.cpp:859] Agent terminating
[       OK ] Endpoint/SlaveEndpointTest.UnauthorizedRequest/0 (24 ms)
[ RUN      ] Endpoint/SlaveEndpointTest.UnauthorizedRequest/1
I0825 12:59:00.633606  6694 containerizer.cpp:288] Using isolation { environment_secret, posix/cpu,
posix/mem, filesystem/posix, network/cni }
W0825 12:59:00.634064  6694 backend.cpp:76] Failed to create 'aufs' backend: AufsBackend requires
root privileges
W0825 12:59:00.634174  6694 backend.cpp:76] Failed to create 'bind' backend: BindBackend requires
root privileges
I0825 12:59:00.634212  6694 provisioner.cpp:255] Using default backend 'copy'
I0825 12:59:00.637271  6715 slave.cpp:252] Mesos agent started on (801)@172.17.0.12:44456
I0825 12:59:00.637290  6715 slave.cpp:253] Flags at startup: --acls="" --appc_simple_discovery_uri_prefix="http://"
--appc_store_dir="/tmp/Endpoint_SlaveEndpointTest_UnauthorizedRequest_1_t0PjUW/store/appc"
--authenticate_http_readonly="true" --authenticate_http_readwrite="true" --authenticatee="crammd5"
--authentication_backoff_factor="1secs" --authorizer="local" --cgroups_cpu_enable_pids_and_tids_count="false"
--cgroups_enable_cfs="false" --cgroups_hierarchy="/sys/fs/cgroup" --cgroups_limit_swap="false"
--cgroups_root="mesos" --container_disk_watch_interval="15secs" --containerizers="mesos" --credential="/tmp/Endpoint_SlaveEndpointTest_UnauthorizedRequest_1_t0PjUW/credential"
--default_role="*" --disallow_sharing_agent_pid_namespace="false" --disk_watch_interval="1mins"
--docker="docker" --docker_kill_orphans="true" --docker_registry="https://registry-1.docker.io"
--docker_remove_delay="6hrs" --docker_socket="/var/run/docker.sock" --docker_stop_timeout="0ns"
--docker_store_dir="/tmp/Endpoint_SlaveEndpointTest_UnauthorizedRequest_1_t0PjUW/store/docker"
--docker_volume_checkpoint_dir="/var/run/mesos/isolators/docker/volume" --enforce_container_disk_quota="false"
--executor_registration_timeout="1mins" --executor_reregistration_timeout="2secs" --executor_shutdown_grace_period="5secs"
--fetcher_cache_dir="/tmp/Endpoint_SlaveEndpointTest_UnauthorizedRequest_1_t0PjUW/fetch" --fetcher_cache_size="2GB"
--frameworks_home="" --gc_delay="1weeks" --gc_disk_headroom="0.1" --hadoop_home="" --help="false"
--hostname_lookup="true" --http_command_executor="false" --http_credentials="/tmp/Endpoint_SlaveEndpointTest_UnauthorizedRequest_1_t0PjUW/http_credentials"
--http_heartbeat_interval="30secs" --initialize_driver_logging="true" --isolation="posix/cpu,posix/mem"
--launcher="posix" --launcher_dir="/mesos/mesos-1.5.0/_build/src" --logbufsecs="0" --logging_level="INFO"
--max_completed_executors_per_framework="150" --oversubscribed_resources_interval="15secs"
--perf_duration="10secs" --perf_interval="1mins" --port="5051" --qos_correction_interval_min="0ns"
--quiet="false" --recover="reconnect" --recovery_timeout="15mins" --registration_backoff_factor="10ms"
--resources="cpus:2;gpus:0;mem:1024;disk:1024;ports:[31000-32000]" --revocable_cpu_low_priority="true"
--runtime_dir="/tmp/Endpoint_SlaveEndpointTest_UnauthorizedRequest_1_t0PjUW" --sandbox_directory="/mnt/mesos/sandbox"
--strict="true" --switch_user="true" --systemd_enable_support="true" --systemd_runtime_directory="/run/systemd/system"
--version="false" --work_dir="/tmp/Endpoint_SlaveEndpointTest_UnauthorizedRequest_1_FH0W2G"
I0825 12:59:00.637632  6715 credentials.hpp:86] Loading credential for authentication from
'/tmp/Endpoint_SlaveEndpointTest_UnauthorizedRequest_1_t0PjUW/credential'
I0825 12:59:00.637768  6715 slave.cpp:285] Agent using credential for: test-principal
I0825 12:59:00.637796  6715 credentials.hpp:37] Loading credentials for authentication from
'/tmp/Endpoint_SlaveEndpointTest_UnauthorizedRequest_1_t0PjUW/http_credentials'
I0825 12:59:00.638029  6715 http.cpp:1026] Creating default 'basic' HTTP authenticator for
realm 'mesos-agent-readonly'
I0825 12:59:00.638175  6715 http.cpp:1026] Creating default 'basic' HTTP authenticator for
realm 'mesos-agent-readwrite'
I0825 12:59:00.639364  6715 slave.cpp:581] Agent resources: [{"name":"cpus","scalar":{"value":2.0},"type":"SCALAR"},{"name":"mem","scalar":{"value":1024.0},"type":"SCALAR"},{"name":"disk","scalar":{"value":1024.0},"type":"SCALAR"},{"name":"ports","ranges":{"range":[{"begin":31000,"end":32000}]},"type":"RANGES"}]
I0825 12:59:00.639564  6715 slave.cpp:589] Agent attributes: [  ]
I0825 12:59:00.639577  6715 slave.cpp:598] Agent hostname: 055edb0c8c9e
I0825 12:59:00.639695  6735 status_update_manager.cpp:177] Pausing sending status updates
I0825 12:59:00.640986  6729 state.cpp:64] Recovering state from '/tmp/Endpoint_SlaveEndpointTest_UnauthorizedRequest_1_FH0W2G/meta'
I0825 12:59:00.641235  6727 status_update_manager.cpp:203] Recovering status update manager
I0825 12:59:00.641382  6724 containerizer.cpp:643] Recovering containerizer
I0825 12:59:00.642475  6714 provisioner.cpp:416] Provisioner recovery complete
I0825 12:59:00.642755  6722 slave.cpp:6264] Finished recovery
I0825 12:59:00.643121  6722 slave.cpp:6446] Querying resource estimator for oversubscribable
resources
I0825 12:59:00.643332  6721 slave.cpp:6460] Received oversubscribable resources {} from the
resource estimator
I0825 12:59:00.645272  6735 process.cpp:3933] Handling HTTP event for process 'slave(801)'
with path: '/slave(801)/monitor/statistics.json'
I0825 12:59:00.646251  6726 http.cpp:1166] HTTP GET for /slave(801)/monitor/statistics.json
from 172.17.0.12:38844
I0825 12:59:00.646320  6726 http.cpp:957] Authorizing principal 'test-principal' to GET the
'/monitor/statistics.json' endpoint
I0825 12:59:00.647799  6725 slave.cpp:859] Agent terminating
[       OK ] Endpoint/SlaveEndpointTest.UnauthorizedRequest/1 (23 ms)
[ RUN      ] Endpoint/SlaveEndpointTest.UnauthorizedRequest/2
I0825 12:59:00.657423  6694 containerizer.cpp:288] Using isolation { environment_secret, posix/cpu,
posix/mem, filesystem/posix, network/cni }
W0825 12:59:00.657884  6694 backend.cpp:76] Failed to create 'aufs' backend: AufsBackend requires
root privileges
W0825 12:59:00.657994  6694 backend.cpp:76] Failed to create 'bind' backend: BindBackend requires
root privileges
I0825 12:59:00.658033  6694 provisioner.cpp:255] Using default backend 'copy'
I0825 12:59:00.661069  6730 slave.cpp:252] Mesos agent started on (802)@172.17.0.12:44456
I0825 12:59:00.661092  6730 slave.cpp:253] Flags at startup: --acls="" --appc_simple_discovery_uri_prefix="http://"
--appc_store_dir="/tmp/Endpoint_SlaveEndpointTest_UnauthorizedRequest_2_OZ1OxY/store/appc"
--authenticate_http_readonly="true" --authenticate_http_readwrite="true" --authenticatee="crammd5"
--authentication_backoff_factor="1secs" --authorizer="local" --cgroups_cpu_enable_pids_and_tids_count="false"
--cgroups_enable_cfs="false" --cgroups_hierarchy="/sys/fs/cgroup" --cgroups_limit_swap="false"
--cgroups_root="mesos" --container_disk_watch_interval="15secs" --containerizers="mesos" --credential="/tmp/Endpoint_SlaveEndpointTest_UnauthorizedRequest_2_OZ1OxY/credential"
--default_role="*" --disallow_sharing_agent_pid_namespace="false" --disk_watch_interval="1mins"
--docker="docker" --docker_kill_orphans="true" --docker_registry="https://registry-1.docker.io"
--docker_remove_delay="6hrs" --docker_socket="/var/run/docker.sock" --docker_stop_timeout="0ns"
--docker_store_dir="/tmp/Endpoint_SlaveEndpointTest_UnauthorizedRequest_2_OZ1OxY/store/docker"
--docker_volume_checkpoint_dir="/var/run/mesos/isolators/docker/volume" --enforce_container_disk_quota="false"
--executor_registration_timeout="1mins" --executor_reregistration_timeout="2secs" --executor_shutdown_grace_period="5secs"
--fetcher_cache_dir="/tmp/Endpoint_SlaveEndpointTest_UnauthorizedRequest_2_OZ1OxY/fetch" --fetcher_cache_size="2GB"
--frameworks_home="" --gc_delay="1weeks" --gc_disk_headroom="0.1" --hadoop_home="" --help="false"
--hostname_lookup="true" --http_command_executor="false" --http_credentials="/tmp/Endpoint_SlaveEndpointTest_UnauthorizedRequest_2_OZ1OxY/http_credentials"
--http_heartbeat_interval="30secs" --initialize_driver_logging="true" --isolation="posix/cpu,posix/mem"
--launcher="posix" --launcher_dir="/mesos/mesos-1.5.0/_build/src" --logbufsecs="0" --logging_level="INFO"
--max_completed_executors_per_framework="150" --oversubscribed_resources_interval="15secs"
--perf_duration="10secs" --perf_interval="1mins" --port="5051" --qos_correction_interval_min="0ns"
--quiet="false" --recover="reconnect" --recovery_timeout="15mins" --registration_backoff_factor="10ms"
--resources="cpus:2;gpus:0;mem:1024;disk:1024;ports:[31000-32000]" --revocable_cpu_low_priority="true"
--runtime_dir="/tmp/Endpoint_SlaveEndpointTest_UnauthorizedRequest_2_OZ1OxY" --sandbox_directory="/mnt/mesos/sandbox"
--strict="true" --switch_user="true" --systemd_enable_support="true" --systemd_runtime_directory="/run/systemd/system"
--version="false" --work_dir="/tmp/Endpoint_SlaveEndpointTest_UnauthorizedRequest_2_CYMVCI"
I0825 12:59:00.661557  6730 credentials.hpp:86] Loading credential for authentication from
'/tmp/Endpoint_SlaveEndpointTest_UnauthorizedRequest_2_OZ1OxY/credential'
I0825 12:59:00.661712  6730 slave.cpp:285] Agent using credential for: test-principal
I0825 12:59:00.661736  6730 credentials.hpp:37] Loading credentials for authentication from
'/tmp/Endpoint_SlaveEndpointTest_UnauthorizedRequest_2_OZ1OxY/http_credentials'
I0825 12:59:00.662015  6730 http.cpp:1026] Creating default 'basic' HTTP authenticator for
realm 'mesos-agent-readonly'
I0825 12:59:00.662165  6730 http.cpp:1026] Creating default 'basic' HTTP authenticator for
realm 'mesos-agent-readwrite'
I0825 12:59:00.663612  6730 slave.cpp:581] Agent resources: [{"name":"cpus","scalar":{"value":2.0},"type":"SCALAR"},{"name":"mem","scalar":{"value":1024.0},"type":"SCALAR"},{"name":"disk","scalar":{"value":1024.0},"type":"SCALAR"},{"name":"ports","ranges":{"range":[{"begin":31000,"end":32000}]},"type":"RANGES"}]
I0825 12:59:00.663825  6730 slave.cpp:589] Agent attributes: [  ]
I0825 12:59:00.663838  6730 slave.cpp:598] Agent hostname: 055edb0c8c9e
I0825 12:59:00.663991  6713 status_update_manager.cpp:177] Pausing sending status updates
I0825 12:59:00.665361  6728 state.cpp:64] Recovering state from '/tmp/Endpoint_SlaveEndpointTest_UnauthorizedRequest_2_CYMVCI/meta'
I0825 12:59:00.665596  6733 status_update_manager.cpp:203] Recovering status update manager
I0825 12:59:00.665762  6714 containerizer.cpp:643] Recovering containerizer
I0825 12:59:00.666860  6721 provisioner.cpp:416] Provisioner recovery complete
I0825 12:59:00.667146  6730 slave.cpp:6264] Finished recovery
I0825 12:59:00.667529  6730 slave.cpp:6446] Querying resource estimator for oversubscribable
resources
I0825 12:59:00.667726  6735 slave.cpp:6460] Received oversubscribable resources {} from the
resource estimator
I0825 12:59:00.669929  6725 process.cpp:3933] Handling HTTP event for process 'slave(802)'
with path: '/slave(802)/containers'
I0825 12:59:00.670975  6719 http.cpp:1166] HTTP GET for /slave(802)/containers from 172.17.0.12:38846
I0825 12:59:00.671038  6719 http.cpp:957] Authorizing principal 'test-principal' to GET the
'/containers' endpoint
I0825 12:59:00.672564  6732 slave.cpp:859] Agent terminating
[       OK ] Endpoint/SlaveEndpointTest.UnauthorizedRequest/2 (24 ms)
[ RUN      ] Endpoint/SlaveEndpointTest.NoAuthorizer/0
I0825 12:59:00.682673  6694 containerizer.cpp:288] Using isolation { environment_secret, posix/cpu,
posix/mem, filesystem/posix, network/cni }
W0825 12:59:00.683143  6694 backend.cpp:76] Failed to create 'aufs' backend: AufsBackend requires
root privileges
W0825 12:59:00.683241  6694 backend.cpp:76] Failed to create 'bind' backend: BindBackend requires
root privileges
I0825 12:59:00.683270  6694 provisioner.cpp:255] Using default backend 'copy'
I0825 12:59:00.684734  6694 cluster.cpp:448] Creating default 'local' authorizer
I0825 12:59:00.686539  6713 slave.cpp:252] Mesos agent started on (803)@172.17.0.12:44456
I0825 12:59:00.686565  6713 slave.cpp:253] Flags at startup: --acls="" --appc_simple_discovery_uri_prefix="http://"
--appc_store_dir="/tmp/Endpoint_SlaveEndpointTest_NoAuthorizer_0_SLY3p0/store/appc" --authenticate_http_readonly="true"
--authenticate_http_readwrite="true" --authenticatee="crammd5" --authentication_backoff_factor="1secs"
--authorizer="local" --cgroups_cpu_enable_pids_and_tids_count="false" --cgroups_enable_cfs="false"
--cgroups_hierarchy="/sys/fs/cgroup" --cgroups_limit_swap="false" --cgroups_root="mesos" --container_disk_watch_interval="15secs"
--containerizers="mesos" --credential="/tmp/Endpoint_SlaveEndpointTest_NoAuthorizer_0_SLY3p0/credential"
--default_role="*" --disallow_sharing_agent_pid_namespace="false" --disk_watch_interval="1mins"
--docker="docker" --docker_kill_orphans="true" --docker_registry="https://registry-1.docker.io"
--docker_remove_delay="6hrs" --docker_socket="/var/run/docker.sock" --docker_stop_timeout="0ns"
--docker_store_dir="/tmp/Endpoint_SlaveEndpointTest_NoAuthorizer_0_SLY3p0/store/docker" --docker_volume_checkpoint_dir="/var/run/mesos/isolators/docker/volume"
--enforce_container_disk_quota="false" --executor_registration_timeout="1mins" --executor_reregistration_timeout="2secs"
--executor_shutdown_grace_period="5secs" --fetcher_cache_dir="/tmp/Endpoint_SlaveEndpointTest_NoAuthorizer_0_SLY3p0/fetch"
--fetcher_cache_size="2GB" --frameworks_home="" --gc_delay="1weeks" --gc_disk_headroom="0.1"
--hadoop_home="" --help="false" --hostname_lookup="true" --http_command_executor="false" --http_credentials="/tmp/Endpoint_SlaveEndpointTest_NoAuthorizer_0_SLY3p0/http_credentials"
--http_heartbeat_interval="30secs" --initialize_driver_logging="true" --isolation="posix/cpu,posix/mem"
--launcher="posix" --launcher_dir="/mesos/mesos-1.5.0/_build/src" --logbufsecs="0" --logging_level="INFO"
--max_completed_executors_per_framework="150" --oversubscribed_resources_interval="15secs"
--perf_duration="10secs" --perf_interval="1mins" --port="5051" --qos_correction_interval_min="0ns"
--quiet="false" --recover="reconnect" --recovery_timeout="15mins" --registration_backoff_factor="10ms"
--resources="cpus:2;gpus:0;mem:1024;disk:1024;ports:[31000-32000]" --revocable_cpu_low_priority="true"
--runtime_dir="/tmp/Endpoint_SlaveEndpointTest_NoAuthorizer_0_SLY3p0" --sandbox_directory="/mnt/mesos/sandbox"
--strict="true" --switch_user="true" --systemd_enable_support="true" --systemd_runtime_directory="/run/systemd/system"
--version="false" --work_dir="/tmp/Endpoint_SlaveEndpointTest_NoAuthorizer_0_mfbtrK"
I0825 12:59:00.687052  6713 credentials.hpp:86] Loading credential for authentication from
'/tmp/Endpoint_SlaveEndpointTest_NoAuthorizer_0_SLY3p0/credential'
I0825 12:59:00.687237  6713 slave.cpp:285] Agent using credential for: test-principal
I0825 12:59:00.687263  6713 credentials.hpp:37] Loading credentials for authentication from
'/tmp/Endpoint_SlaveEndpointTest_NoAuthorizer_0_SLY3p0/http_credentials'
I0825 12:59:00.687603  6713 http.cpp:1026] Creating default 'basic' HTTP authenticator for
realm 'mesos-agent-readonly'
I0825 12:59:00.687774  6713 http.cpp:1026] Creating default 'basic' HTTP authenticator for
realm 'mesos-agent-readwrite'
I0825 12:59:00.689544  6713 slave.cpp:581] Agent resources: [{"name":"cpus","scalar":{"value":2.0},"type":"SCALAR"},{"name":"mem","scalar":{"value":1024.0},"type":"SCALAR"},{"name":"disk","scalar":{"value":1024.0},"type":"SCALAR"},{"name":"ports","ranges":{"range":[{"begin":31000,"end":32000}]},"type":"RANGES"}]
I0825 12:59:00.689851  6713 slave.cpp:589] Agent attributes: [  ]
I0825 12:59:00.689867  6713 slave.cpp:598] Agent hostname: 055edb0c8c9e
I0825 12:59:00.690006  6732 status_update_manager.cpp:177] Pausing sending status updates
I0825 12:59:00.691854  6729 state.cpp:64] Recovering state from '/tmp/Endpoint_SlaveEndpointTest_NoAuthorizer_0_mfbtrK/meta'
I0825 12:59:00.692195  6715 status_update_manager.cpp:203] Recovering status update manager
I0825 12:59:00.692391  6722 containerizer.cpp:643] Recovering containerizer
I0825 12:59:00.693704  6728 provisioner.cpp:416] Provisioner recovery complete
I0825 12:59:00.694026  6726 slave.cpp:6264] Finished recovery
I0825 12:59:00.694592  6726 slave.cpp:6446] Querying resource estimator for oversubscribable
resources
I0825 12:59:00.694847  6727 slave.cpp:6460] Received oversubscribable resources {} from the
resource estimator
I0825 12:59:00.697645  6733 process.cpp:3933] Handling HTTP event for process 'slave(803)'
with path: '/slave(803)/monitor/statistics'
I0825 12:59:00.698920  6715 http.cpp:1166] HTTP GET for /slave(803)/monitor/statistics from
172.17.0.12:38848
I0825 12:59:00.698999  6715 http.cpp:957] Authorizing principal 'test-principal' to GET the
'/monitor/statistics' endpoint
I0825 12:59:00.702072  6723 slave.cpp:859] Agent terminating
[       OK ] Endpoint/SlaveEndpointTest.NoAuthorizer/0 (30 ms)
[ RUN      ] Endpoint/SlaveEndpointTest.NoAuthorizer/1
I0825 12:59:00.713423  6694 containerizer.cpp:288] Using isolation { environment_secret, posix/cpu,
posix/mem, filesystem/posix, network/cni }
W0825 12:59:00.713925  6694 backend.cpp:76] Failed to create 'aufs' backend: AufsBackend requires
root privileges
W0825 12:59:00.714045  6694 backend.cpp:76] Failed to create 'bind' backend: BindBackend requires
root privileges
I0825 12:59:00.714076  6694 provisioner.cpp:255] Using default backend 'copy'
I0825 12:59:00.715654  6694 cluster.cpp:448] Creating default 'local' authorizer
I0825 12:59:00.717383  6729 slave.cpp:252] Mesos agent started on (804)@172.17.0.12:44456
I0825 12:59:00.717403  6729 slave.cpp:253] Flags at startup: --acls="" --appc_simple_discovery_uri_prefix="http://"
--appc_store_dir="/tmp/Endpoint_SlaveEndpointTest_NoAuthorizer_1_YXi0z2/store/appc" --authenticate_http_readonly="true"
--authenticate_http_readwrite="true" --authenticatee="crammd5" --authentication_backoff_factor="1secs"
--authorizer="local" --cgroups_cpu_enable_pids_and_tids_count="false" --cgroups_enable_cfs="false"
--cgroups_hierarchy="/sys/fs/cgroup" --cgroups_limit_swap="false" --cgroups_root="mesos" --container_disk_watch_interval="15secs"
--containerizers="mesos" --credential="/tmp/Endpoint_SlaveEndpointTest_NoAuthorizer_1_YXi0z2/credential"
--default_role="*" --disallow_sharing_agent_pid_namespace="false" --disk_watch_interval="1mins"
--docker="docker" --docker_kill_orphans="true" --docker_registry="https://registry-1.docker.io"
--docker_remove_delay="6hrs" --docker_socket="/var/run/docker.sock" --docker_stop_timeout="0ns"
--docker_store_dir="/tmp/Endpoint_SlaveEndpointTest_NoAuthorizer_1_YXi0z2/store/docker" --docker_volume_checkpoint_dir="/var/run/mesos/isolators/docker/volume"
--enforce_container_disk_quota="false" --executor_registration_timeout="1mins" --executor_reregistration_timeout="2secs"
--executor_shutdown_grace_period="5secs" --fetcher_cache_dir="/tmp/Endpoint_SlaveEndpointTest_NoAuthorizer_1_YXi0z2/fetch"
--fetcher_cache_size="2GB" --frameworks_home="" --gc_delay="1weeks" --gc_disk_headroom="0.1"
--hadoop_home="" --help="false" --hostname_lookup="true" --http_command_executor="false" --http_credentials="/tmp/Endpoint_SlaveEndpointTest_NoAuthorizer_1_YXi0z2/http_credentials"
--http_heartbeat_interval="30secs" --initialize_driver_logging="true" --isolation="posix/cpu,posix/mem"
--launcher="posix" --launcher_dir="/mesos/mesos-1.5.0/_build/src" --logbufsecs="0" --logging_level="INFO"
--max_completed_executors_per_framework="150" --oversubscribed_resources_interval="15secs"
--perf_duration="10secs" --perf_interval="1mins" --port="5051" --qos_correction_interval_min="0ns"
--quiet="false" --recover="reconnect" --recovery_timeout="15mins" --registration_backoff_factor="10ms"
--resources="cpus:2;gpus:0;mem:1024;disk:1024;ports:[31000-32000]" --revocable_cpu_low_priority="true"
--runtime_dir="/tmp/Endpoint_SlaveEndpointTest_NoAuthorizer_1_YXi0z2" --sandbox_directory="/mnt/mesos/sandbox"
--strict="true" --switch_user="true" --systemd_enable_support="true" --systemd_runtime_directory="/run/systemd/system"
--version="false" --work_dir="/tmp/Endpoint_SlaveEndpointTest_NoAuthorizer_1_rmXPwM"
I0825 12:59:00.717788  6729 credentials.hpp:86] Loading credential for authentication from
'/tmp/Endpoint_SlaveEndpointTest_NoAuthorizer_1_YXi0z2/credential'
I0825 12:59:00.717952  6729 slave.cpp:285] Agent using credential for: test-principal
I0825 12:59:00.717984  6729 credentials.hpp:37] Loading credentials for authentication from
'/tmp/Endpoint_SlaveEndpointTest_NoAuthorizer_1_YXi0z2/http_credentials'
I0825 12:59:00.718227  6729 http.cpp:1026] Creating default 'basic' HTTP authenticator for
realm 'mesos-agent-readonly'
I0825 12:59:00.718380  6729 http.cpp:1026] Creating default 'basic' HTTP authenticator for
realm 'mesos-agent-readwrite'
I0825 12:59:00.719638  6729 slave.cpp:581] Agent resources: [{"name":"cpus","scalar":{"value":2.0},"type":"SCALAR"},{"name":"mem","scalar":{"value":1024.0},"type":"SCALAR"},{"name":"disk","scalar":{"value":1024.0},"type":"SCALAR"},{"name":"ports","ranges":{"range":[{"begin":31000,"end":32000}]},"type":"RANGES"}]
I0825 12:59:00.719851  6729 slave.cpp:589] Agent attributes: [  ]
I0825 12:59:00.719866  6729 slave.cpp:598] Agent hostname: 055edb0c8c9e
I0825 12:59:00.719988  6734 status_update_manager.cpp:177] Pausing sending status updates
I0825 12:59:00.721482  6714 state.cpp:64] Recovering state from '/tmp/Endpoint_SlaveEndpointTest_NoAuthorizer_1_rmXPwM/meta'
I0825 12:59:00.721761  6714 status_update_manager.cpp:203] Recovering status update manager
I0825 12:59:00.721941  6713 containerizer.cpp:643] Recovering containerizer
I0825 12:59:00.723170  6722 provisioner.cpp:416] Provisioner recovery complete
I0825 12:59:00.723450  6729 slave.cpp:6264] Finished recovery
I0825 12:59:00.723877  6729 slave.cpp:6446] Querying resource estimator for oversubscribable
resources
I0825 12:59:00.724094  6730 slave.cpp:6460] Received oversubscribable resources {} from the
resource estimator
I0825 12:59:00.726373  6736 process.cpp:3933] Handling HTTP event for process 'slave(804)'
with path: '/slave(804)/monitor/statistics.json'
I0825 12:59:00.727489  6733 http.cpp:1166] HTTP GET for /slave(804)/monitor/statistics.json
from 172.17.0.12:38850
I0825 12:59:00.727552  6733 http.cpp:957] Authorizing principal 'test-principal' to GET the
'/monitor/statistics.json' endpoint
I0825 12:59:00.729964  6717 slave.cpp:859] Agent terminating
[       OK ] Endpoint/SlaveEndpointTest.NoAuthorizer/1 (26 ms)
[ RUN      ] Endpoint/SlaveEndpointTest.NoAuthorizer/2
I0825 12:59:00.739847  6694 containerizer.cpp:288] Using isolation { environment_secret, posix/cpu,
posix/mem, filesystem/posix, network/cni }
W0825 12:59:00.740298  6694 backend.cpp:76] Failed to create 'aufs' backend: AufsBackend requires
root privileges
W0825 12:59:00.740403  6694 backend.cpp:76] Failed to create 'bind' backend: BindBackend requires
root privileges
I0825 12:59:00.740432  6694 provisioner.cpp:255] Using default backend 'copy'
I0825 12:59:00.741891  6694 cluster.cpp:448] Creating default 'local' authorizer
I0825 12:59:00.743597  6727 slave.cpp:252] Mesos agent started on (805)@172.17.0.12:44456
I0825 12:59:00.743618  6727 slave.cpp:253] Flags at startup: --acls="" --appc_simple_discovery_uri_prefix="http://"
--appc_store_dir="/tmp/Endpoint_SlaveEndpointTest_NoAuthorizer_2_EAMg04/store/appc" --authenticate_http_readonly="true"
--authenticate_http_readwrite="true" --authenticatee="crammd5" --authentication_backoff_factor="1secs"
--authorizer="local" --cgroups_cpu_enable_pids_and_tids_count="false" --cgroups_enable_cfs="false"
--cgroups_hierarchy="/sys/fs/cgroup" --cgroups_limit_swap="false" --cgroups_root="mesos" --container_disk_watch_interval="15secs"
--containerizers="mesos" --credential="/tmp/Endpoint_SlaveEndpointTest_NoAuthorizer_2_EAMg04/credential"
--default_role="*" --disallow_sharing_agent_pid_namespace="false" --disk_watch_interval="1mins"
--docker="docker" --docker_kill_orphans="true" --docker_registry="https://registry-1.docker.io"
--docker_remove_delay="6hrs" --docker_socket="/var/run/docker.sock" --docker_stop_timeout="0ns"
--docker_store_dir="/tmp/Endpoint_SlaveEndpointTest_NoAuthorizer_2_EAMg04/store/docker" --docker_volume_checkpoint_dir="/var/run/mesos/isolators/docker/volume"
--enforce_container_disk_quota="false" --executor_registration_timeout="1mins" --executor_reregistration_timeout="2secs"
--executor_shutdown_grace_period="5secs" --fetcher_cache_dir="/tmp/Endpoint_SlaveEndpointTest_NoAuthorizer_2_EAMg04/fetch"
--fetcher_cache_size="2GB" --frameworks_home="" --gc_delay="1weeks" --gc_disk_headroom="0.1"
--hadoop_home="" --help="false" --hostname_lookup="true" --http_command_executor="false" --http_credentials="/tmp/Endpoint_SlaveEndpointTest_NoAuthorizer_2_EAMg04/http_credentials"
--http_heartbeat_interval="30secs" --initialize_driver_logging="true" --isolation="posix/cpu,posix/mem"
--launcher="posix" --launcher_dir="/mesos/mesos-1.5.0/_build/src" --logbufsecs="0" --logging_level="INFO"
--max_completed_executors_per_framework="150" --oversubscribed_resources_interval="15secs"
--perf_duration="10secs" --perf_interval="1mins" --port="5051" --qos_correction_interval_min="0ns"
--quiet="false" --recover="reconnect" --recovery_timeout="15mins" --registration_backoff_factor="10ms"
--resources="cpus:2;gpus:0;mem:1024;disk:1024;ports:[31000-32000]" --revocable_cpu_low_priority="true"
--runtime_dir="/tmp/Endpoint_SlaveEndpointTest_NoAuthorizer_2_EAMg04" --sandbox_directory="/mnt/mesos/sandbox"
--strict="true" --switch_user="true" --systemd_enable_support="true" --systemd_runtime_directory="/run/systemd/system"
--version="false" --work_dir="/tmp/Endpoint_SlaveEndpointTest_NoAuthorizer_2_Nv37SO"
I0825 12:59:00.743978  6727 credentials.hpp:86] Loading credential for authentication from
'/tmp/Endpoint_SlaveEndpointTest_NoAuthorizer_2_EAMg04/credential'
I0825 12:59:00.744150  6727 slave.cpp:285] Agent using credential for: test-principal
I0825 12:59:00.744174  6727 credentials.hpp:37] Loading credentials for authentication from
'/tmp/Endpoint_SlaveEndpointTest_NoAuthorizer_2_EAMg04/http_credentials'
I0825 12:59:00.744417  6727 http.cpp:1026] Creating default 'basic' HTTP authenticator for
realm 'mesos-agent-readonly'
I0825 12:59:00.744582  6727 http.cpp:1026] Creating default 'basic' HTTP authenticator for
realm 'mesos-agent-readwrite'
I0825 12:59:00.745837  6727 slave.cpp:581] Agent resources: [{"name":"cpus","scalar":{"value":2.0},"type":"SCALAR"},{"name":"mem","scalar":{"value":1024.0},"type":"SCALAR"},{"name":"disk","scalar":{"value":1024.0},"type":"SCALAR"},{"name":"ports","ranges":{"range":[{"begin":31000,"end":32000}]},"type":"RANGES"}]
I0825 12:59:00.746040  6727 slave.cpp:589] Agent attributes: [  ]
I0825 12:59:00.746062  6727 slave.cpp:598] Agent hostname: 055edb0c8c9e
I0825 12:59:00.746198  6721 status_update_manager.cpp:177] Pausing sending status updates
I0825 12:59:00.747506  6718 state.cpp:64] Recovering state from '/tmp/Endpoint_SlaveEndpointTest_NoAuthorizer_2_Nv37SO/meta'
I0825 12:59:00.747763  6736 status_update_manager.cpp:203] Recovering status update manager
I0825 12:59:00.747972  6719 containerizer.cpp:643] Recovering containerizer
I0825 12:59:00.749311  6724 provisioner.cpp:416] Provisioner recovery complete
I0825 12:59:00.749600  6727 slave.cpp:6264] Finished recovery
I0825 12:59:00.749997  6727 slave.cpp:6446] Querying resource estimator for oversubscribable
resources
I0825 12:59:00.750216  6714 slave.cpp:6460] Received oversubscribable resources {} from the
resource estimator
I0825 12:59:00.752480  6716 process.cpp:3933] Handling HTTP event for process 'slave(805)'
with path: '/slave(805)/containers'
I0825 12:59:00.753659  6734 http.cpp:1166] HTTP GET for /slave(805)/containers from 172.17.0.12:38854
I0825 12:59:00.753732  6734 http.cpp:957] Authorizing principal 'test-principal' to GET the
'/containers' endpoint
I0825 12:59:00.756816  6721 slave.cpp:859] Agent terminating
[       OK ] Endpoint/SlaveEndpointTest.NoAuthorizer/2 (27 ms)
[----------] 9 tests from Endpoint/SlaveEndpointTest (246 ms total)

[----------] 2 tests from ContainerizerType/DefaultContainerDNSFlagTest
[ RUN      ] ContainerizerType/DefaultContainerDNSFlagTest.ValidateFlag/0
[       OK ] ContainerizerType/DefaultContainerDNSFlagTest.ValidateFlag/0 (10 ms)
[ RUN      ] ContainerizerType/DefaultContainerDNSFlagTest.ValidateFlag/1
[       OK ] ContainerizerType/DefaultContainerDNSFlagTest.ValidateFlag/1 (9 ms)
[----------] 2 tests from ContainerizerType/DefaultContainerDNSFlagTest (19 ms total)

[----------] Global test environment tear-down
[==========] 1657 tests from 182 test cases ran. (634028 ms total)
[  PASSED  ] 1653 tests.
[  FAILED  ] 4 tests, listed below:
[  FAILED  ] CommandExecutorCheckTest.CommandCheckDeliveredAndReconciled
[  FAILED  ] DefaultExecutorCheckTest.CommandCheckDeliveredAndReconciled
[  FAILED  ] DefaultExecutorCheckTest.CommandCheckStatusChange
[  FAILED  ] DefaultExecutorCheckTest.CommandCheckSeesParentsEnv

 4 FAILED TESTS
  YOU HAVE 20 DISABLED TESTS

I0825 12:59:00.837630  6737 process.cpp:1072] Failed to accept socket: future discarded
make[4]: *** [check-local] Error 1
make[4]: Leaving directory `/mesos/mesos-1.5.0/_build/src'
make[3]: *** [check-am] Error 2
make[3]: Leaving directory `/mesos/mesos-1.5.0/_build/src'
make[2]: *** [check] Error 2
make[2]: Leaving directory `/mesos/mesos-1.5.0/_build/src'
make[1]: *** [check-recursive] Error 1
make[1]: Leaving directory `/mesos/mesos-1.5.0/_build'
make: *** [distcheck] Error 1
+ docker rmi mesos-1503663077-18198
Untagged: mesos-1503663077-18198:latest
Deleted: sha256:2386d4a610bec3a9750c1d8f49a53c0ab0706c141742418789495990a690e713
Deleted: sha256:e26af968094e9906d5e1ddf0832b0554e453f05896e71b5fd16f6ac868bd619f
Deleted: sha256:b0500b369c2280fe4d1823ffbf83861a4dbcd1de605262fd4d91faa17c042d40
Deleted: sha256:e0c2c51f0acaa9f16396028845c8a0725a26f988d8cd65232b1bae211e82875b
Deleted: sha256:031b42d8a644bcc029f499c36e3bab7998af56b4fdb52535c73b92875c08c5b5
Deleted: sha256:fc52a002feeb0793dd06ebfd63badf9aa2993c2924ecf9154402c33eb2e9cee1
Deleted: sha256:aadf56eb5a1af6f7d9a31ab58fb6ba45469b21c7fd44e23f5e2244084c9dbf03
Deleted: sha256:2eea36cba73fa6708fd08a5c633ed56aca9438ab475849f07838d2637e8c2614
Deleted: sha256:bb7e6ff81dcd6b7d494b5005804b39182722df5075a450365a3516505024ec40
Deleted: sha256:4b5c34ae91b6d26d9e595c64219cb2886569c42e115cf730a34511c4d06664f2
Deleted: sha256:72825154553ee0836e24a4e83de8ebe8126090870ba084e04918d2bde0ed4e71
Deleted: sha256:273740f56381e19f7abd97d8b3d51f1bcd068e022c182a562ca103a55833fbb6
Deleted: sha256:799cb24ae1d77c0e5e77654aedccbd030ebede6ede0a256ab3ebb885cff20ff3
Deleted: sha256:1c413053d60137a300e656391a015d9949b7966ba3fbae4905828fbc5184e3c3
Deleted: sha256:354dae568924c0d1d05310ba093ec17de10c0ec2fc1253d3776504b570af421d
Deleted: sha256:a55d5498be4721e4320bfe16d59ef38b613f63a84953ebddbc8e0ff546933fee
Deleted: sha256:b4ae43a99b17d31dd77e1f7bde243789c7a78cf7f6ebe7d2bde310ba562ec640
Deleted: sha256:562fc80f720b1fa50b93e7897ce9517f4c8586c6bf73e53ab5c5858767e3ad1a
Deleted: sha256:d49259105dfaf88bb4bc55ca05b9371627a2683cb40e47b5ad6310b91bbab595
Deleted: sha256:1463301e5cc32dc63d095dcf20f87e223b4c3e06f27731600ac52e1daa17d52c
Deleted: sha256:5cbf9c7c974c0854d79b4fcb9d61ea501ea083d0b46fefe87df57c739483cc2c
Deleted: sha256:9832e8467251e18cb0f5a973cdd6d7621fe435fecc291b8bea46d6500cf0f93e
Deleted: sha256:a779b4630cda8ba030146155aa490d43838b0875ecb86a6bfe063727cdcf2119
Deleted: sha256:99292c46028ef3d9878100b7aa72b9047372fa68ba7069aea4b0ed1896de476a
Deleted: sha256:3a8fa0328a2536b73b5fc749664f9eaf309349b15c696968974a17f28f505a6c
Build step 'Execute shell' marked build as failure
Not sending mail to unregistered user yujie.jay@gmail.com
Not sending mail to unregistered user xujyan@apple.com

Mime
View raw message