mesos-builds mailing list archives

Site index · List index
Message view « Date » · « Thread »
Top « Date » · « Thread »
From Apache Jenkins Server <jenk...@builds.apache.org>
Subject Build failed in Jenkins: Mesos-Reviewbot #18853
Date Mon, 14 Aug 2017 07:14:36 GMT
See <https://builds.apache.org/job/Mesos-Reviewbot/18853/display/redirect>

------------------------------------------
[...truncated 2.56 MB...]
as: BFD (GNU Binutils for Ubuntu) 2.24 assertion fail ../../bfd/elf.c:2636
as: BFD (GNU Binutils for Ubuntu) 2.24 assertion fail ../../bfd/elf.c:2636
as: BFD (GNU Binutils for Ubuntu) 2.24 assertion fail ../../bfd/elf.c:2636
as: BFD (GNU Binutils for Ubuntu) 2.24 assertion fail ../../bfd/elf.c:2636
as: BFD (GNU Binutils for Ubuntu) 2.24 assertion fail ../../bfd/elf.c:2636
as: BFD (GNU Binutils for Ubuntu) 2.24 assertion fail ../../bfd/elf.c:2636
as: BFD (GNU Binutils for Ubuntu) 2.24 assertion fail ../../bfd/elf.c:2636
as: BFD (GNU Binutils for Ubuntu) 2.24 assertion fail ../../bfd/elf.c:2636
as: BFD (GNU Binutils for Ubuntu) 2.24 assertion fail ../../bfd/elf.c:2636
as: BFD (GNU Binutils for Ubuntu) 2.24 assertion fail ../../bfd/elf.c:2636
as: BFD (GNU Binutils for Ubuntu) 2.24 assertion fail ../../bfd/elf.c:2636
as: BFD (GNU Binutils for Ubuntu) 2.24 assertion fail ../../bfd/elf.c:2636
as: BFD (GNU Binutils for Ubuntu) 2.24 assertion fail ../../bfd/elf.c:2636
as: BFD (GNU Binutils for Ubuntu) 2.24 assertion fail ../../bfd/elf.c:2636
as: BFD (GNU Binutils for Ubuntu) 2.24 assertion fail ../../bfd/elf.c:2636
as: BFD (GNU Binutils for Ubuntu) 2.24 assertion fail ../../bfd/elf.c:2636
as: BFD (GNU Binutils for Ubuntu) 2.24 assertion fail ../../bfd/elf.c:2636
as: BFD (GNU Binutils for Ubuntu) 2.24 assertion fail ../../bfd/elf.c:2636
as: BFD (GNU Binutils for Ubuntu) 2.24 assertion fail ../../bfd/elf.c:2636
as: BFD (GNU Binutils for Ubuntu) 2.24 assertion fail ../../bfd/elf.c:2636
as: BFD (GNU Binutils for Ubuntu) 2.24 assertion fail ../../bfd/elf.c:2636
as: BFD (GNU Binutils for Ubuntu) 2.24 assertion fail ../../bfd/elf.c:2636
as: BFD (GNU Binutils for Ubuntu) 2.24 assertion fail ../../bfd/elf.c:2636
as: BFD (GNU Binutils for Ubuntu) 2.24 assertion fail ../../bfd/elf.c:2636
as: BFD (GNU Binutils for Ubuntu) 2.24 assertion fail ../../bfd/elf.c:2636
as: BFD (GNU Binutils for Ubuntu) 2.24 assertion fail ../../bfd/elf.c:2636
as: BFD (GNU Binutils for Ubuntu) 2.24 assertion fail ../../bfd/elf.c:2636
as: BFD (GNU Binutils for Ubuntu) 2.24 assertion fail ../../bfd/elf.c:2636
as: BFD (GNU Binutils for Ubuntu) 2.24 assertion fail ../../bfd/elf.c:2636
as: BFD (GNU Binutils for Ubuntu) 2.24 assertion fail ../../bfd/elf.c:2636
as: BFD (GNU Binutils for Ubuntu) 2.24 assertion fail ../../bfd/elf.c:2636
as: BFD (GNU Binutils for Ubuntu) 2.24 assertion fail ../../bfd/elf.c:2636
as: BFD (GNU Binutils for Ubuntu) 2.24 assertion fail ../../bfd/elf.c:2636
as: BFD (GNU Binutils for Ubuntu) 2.24 assertion fail ../../bfd/elf.c:2636
as: BFD (GNU Binutils for Ubuntu) 2.24 assertion fail ../../bfd/elf.c:2636
as: BFD (GNU Binutils for Ubuntu) 2.24 assertion fail ../../bfd/elf.c:2636
as: BFD (GNU Binutils for Ubuntu) 2.24 assertion fail ../../bfd/elf.c:2636
as: BFD (GNU Binutils for Ubuntu) 2.24 assertion fail ../../bfd/elf.c:2636
as: BFD (GNU Binutils for Ubuntu) 2.24 assertion fail ../../bfd/elf.c:2636
as: BFD (GNU Binutils for Ubuntu) 2.24 assertion fail ../../bfd/elf.c:2636
as: BFD (GNU Binutils for Ubuntu) 2.24 assertion fail ../../bfd/elf.c:2636
as: BFD (GNU Binutils for Ubuntu) 2.24 assertion fail ../../bfd/elf.c:2636
as: BFD (GNU Binutils for Ubuntu) 2.24 assertion fail ../../bfd/elf.c:2636
as: BFD (GNU Binutils for Ubuntu) 2.24 assertion fail ../../bfd/elf.c:2636
as: BFD (GNU Binutils for Ubuntu) 2.24 assertion fail ../../bfd/elf.c:2636
as: BFD (GNU Binutils for Ubuntu) 2.24 assertion fail ../../bfd/elf.c:2636
as: BFD (GNU Binutils for Ubuntu) 2.24 assertion fail ../../bfd/elf.c:2636
as: BFD (GNU Binutils for Ubuntu) 2.24 assertion fail ../../bfd/elf.c:2636
as: BFD (GNU Binutils for Ubuntu) 2.24 assertion fail ../../bfd/elf.c:2636
as: BFD (GNU Binutils for Ubuntu) 2.24 assertion fail ../../bfd/elf.c:2636
as: BFD (GNU Binutils for Ubuntu) 2.24 assertion fail ../../bfd/elf.c:2636
as: BFD (GNU Binutils for Ubuntu) 2.24 assertion fail ../../bfd/elf.c:2636
as: BFD (GNU Binutils for Ubuntu) 2.24 assertion fail ../../bfd/elf.c:2636
as: BFD (GNU Binutils for Ubuntu) 2.24 assertion fail ../../bfd/elf.c:2636
as: BFD (GNU Binutils for Ubuntu) 2.24 assertion fail ../../bfd/elf.c:2636
as: BFD (GNU Binutils for Ubuntu) 2.24 assertion fail ../../bfd/elf.c:2636
as: BFD (GNU Binutils for Ubuntu) 2.24 assertion fail ../../bfd/elf.c:2636
as: BFD (GNU Binutils for Ubuntu) 2.24 assertion fail ../../bfd/elf.c:2636
as: BFD (GNU Binutils for Ubuntu) 2.24 assertion fail ../../bfd/elf.c:2636
as: BFD (GNU Binutils for Ubuntu) 2.24 assertion fail ../../bfd/elf.c:2636
as: BFD (GNU Binutils for Ubuntu) 2.24 assertion fail ../../bfd/elf.c:2636
as: BFD (GNU Binutils for Ubuntu) 2.24 assertion fail ../../bfd/elf.c:2636
as: BFD (GNU Binutils for Ubuntu) 2.24 assertion fail ../../bfd/elf.c:2636
as: BFD (GNU Binutils for Ubuntu) 2.24 assertion fail ../../bfd/elf.c:2636
as: BFD (GNU Binutils for Ubuntu) 2.24 assertion fail ../../bfd/elf.c:2636
as: BFD (GNU Binutils for Ubuntu) 2.24 assertion fail ../../bfd/elf.c:2636
as: BFD (GNU Binutils for Ubuntu) 2.24 assertion fail ../../bfd/elf.c:2636
as: BFD (GNU Binutils for Ubuntu) 2.24 assertion fail ../../bfd/elf.c:2636
as: BFD (GNU Binutils for Ubuntu) 2.24 assertion fail ../../bfd/elf.c:2636
as: BFD (GNU Binutils for Ubuntu) 2.24 assertion fail ../../bfd/elf.c:2636
as: BFD (GNU Binutils for Ubuntu) 2.24 assertion fail ../../bfd/elf.c:2636
as: BFD (GNU Binutils for Ubuntu) 2.24 assertion fail ../../bfd/elf.c:2636
as: BFD (GNU Binutils for Ubuntu) 2.24 assertion fail ../../bfd/elf.c:2636
as: BFD (GNU Binutils for Ubuntu) 2.24 assertion fail ../../bfd/elf.c:2636
as: BFD (GNU Binutils for Ubuntu) 2.24 assertion fail ../../bfd/elf.c:2636
as: BFD (GNU Binutils for Ubuntu) 2.24 assertion fail ../../bfd/elf.c:2636
as: BFD (GNU Binutils for Ubuntu) 2.24 assertion fail ../../bfd/elf.c:2636
as: BFD (GNU Binutils for Ubuntu) 2.24 assertion fail ../../bfd/elf.c:2636
as: BFD (GNU Binutils for Ubuntu) 2.24 assertion fail ../../bfd/elf.c:2636
as: BFD (GNU Binutils for Ubuntu) 2.24 assertion fail ../../bfd/elf.c:2636
as: BFD (GNU Binutils for Ubuntu) 2.24 assertion fail ../../bfd/elf.c:2636
as: BFD (GNU Binutils for Ubuntu) 2.24 assertion fail ../../bfd/elf.c:2636
as: BFD (GNU Binutils for Ubuntu) 2.24 assertion fail ../../bfd/elf.c:2636
as: BFD (GNU Binutils for Ubuntu) 2.24 assertion fail ../../bfd/elf.c:2636
as: BFD (GNU Binutils for Ubuntu) 2.24 assertion fail ../../bfd/elf.c:2636
as: BFD (GNU Binutils for Ubuntu) 2.24 assertion fail ../../bfd/elf.c:2636
as: BFD (GNU Binutils for Ubuntu) 2.24 assertion fail ../../bfd/elf.c:2636
as: BFD (GNU Binutils for Ubuntu) 2.24 assertion fail ../../bfd/elf.c:2636
as: BFD (GNU Binutils for Ubuntu) 2.24 assertion fail ../../bfd/elf.c:2636
as: BFD (GNU Binutils for Ubuntu) 2.24 assertion fail ../../bfd/elf.c:2636
as: BFD (GNU Binutils for Ubuntu) 2.24 assertion fail ../../bfd/elf.c:2636
as: BFD (GNU Binutils for Ubuntu) 2.24 assertion fail ../../bfd/elf.c:2636
as: BFD (GNU Binutils for Ubuntu) 2.24 assertion fail ../../bfd/elf.c:2636
as: BFD (GNU Binutils for Ubuntu) 2.24 assertion fail ../../bfd/elf.c:2636
as: BFD (GNU Binutils for Ubuntu) 2.24 assertion fail ../../bfd/elf.c:2636
as: BFD (GNU Binutils for Ubuntu) 2.24 assertion fail ../../bfd/elf.c:2636
as: BFD (GNU Binutils for Ubuntu) 2.24 assertion fail ../../bfd/elf.c:2636
as: BFD (GNU Binutils for Ubuntu) 2.24 assertion fail ../../bfd/elf.c:2636
as: BFD (GNU Binutils for Ubuntu) 2.24 assertion fail ../../bfd/elf.c:2636
as: BFD (GNU Binutils for Ubuntu) 2.24 assertion fail ../../bfd/elf.c:2636
as: BFD (GNU Binutils for Ubuntu) 2.24 assertion fail ../../bfd/elf.c:2636
as: BFD (GNU Binutils for Ubuntu) 2.24 assertion fail ../../bfd/elf.c:2636
as: BFD (GNU Binutils for Ubuntu) 2.24 assertion fail ../../bfd/elf.c:2636
as: BFD (GNU Binutils for Ubuntu) 2.24 assertion fail ../../bfd/elf.c:2636
as: BFD (GNU Binutils for Ubuntu) 2.24 assertion fail ../../bfd/elf.c:2636
as: BFD (GNU Binutils for Ubuntu) 2.24 assertion fail ../../bfd/elf.c:2636
as: BFD (GNU Binutils for Ubuntu) 2.24 assertion fail ../../bfd/elf.c:2636
as: BFD (GNU Binutils for Ubuntu) 2.24 assertion fail ../../bfd/elf.c:2636
as: BFD (GNU Binutils for Ubuntu) 2.24 assertion fail ../../bfd/elf.c:2636
as: BFD (GNU Binutils for Ubuntu) 2.24 assertion fail ../../bfd/elf.c:2636
as: BFD (GNU Binutils for Ubuntu) 2.24 assertion fail ../../bfd/elf.c:2636
as: BFD (GNU Binutils for Ubuntu) 2.24 assertion fail ../../bfd/elf.c:2636
as: BFD (GNU Binutils for Ubuntu) 2.24 assertion fail ../../bfd/elf.c:2636
as: BFD (GNU Binutils for Ubuntu) 2.24 assertion fail ../../bfd/elf.c:2636
as: BFD (GNU Binutils for Ubuntu) 2.24 assertion fail ../../bfd/elf.c:2636
as: BFD (GNU Binutils for Ubuntu) 2.24 assertion fail ../../bfd/elf.c:2636
as: BFD (GNU Binutils for Ubuntu) 2.24 assertion fail ../../bfd/elf.c:2636
as: BFD (GNU Binutils for Ubuntu) 2.24 assertion fail ../../bfd/elf.c:2636
as: BFD (GNU Binutils for Ubuntu) 2.24 assertion fail ../../bfd/elf.c:2636
as: BFD (GNU Binutils for Ubuntu) 2.24 assertion fail ../../bfd/elf.c:2636
as: BFD (GNU Binutils for Ubuntu) 2.24 assertion fail ../../bfd/elf.c:2636
as: BFD (GNU Binutils for Ubuntu) 2.24 assertion fail ../../bfd/elf.c:2636
as: BFD (GNU Binutils for Ubuntu) 2.24 assertion fail ../../bfd/elf.c:2636
as: BFD (GNU Binutils for Ubuntu) 2.24 assertion fail ../../bfd/elf.c:2636
as: BFD (GNU Binutils for Ubuntu) 2.24 assertion fail ../../bfd/elf.c:2636
as: BFD (GNU Binutils for Ubuntu) 2.24 assertion fail ../../bfd/elf.c:2636
as: BFD (GNU Binutils for Ubuntu) 2.24 assertion fail ../../bfd/elf.c:2636
as: BFD (GNU Binutils for Ubuntu) 2.24 assertion fail ../../bfd/elf.c:2636
as: BFD (GNU Binutils for Ubuntu) 2.24 assertion fail ../../bfd/elf.c:2636
as: BFD (GNU Binutils for Ubuntu) 2.24 assertion fail ../../bfd/elf.c:2636
as: BFD (GNU Binutils for Ubuntu) 2.24 assertion fail ../../bfd/elf.c:2636
as: BFD (GNU Binutils for Ubuntu) 2.24 assertion fail ../../bfd/elf.c:2636
as: BFD (GNU Binutils for Ubuntu) 2.24 assertion fail ../../bfd/elf.c:2636
as: BFD (GNU Binutils for Ubuntu) 2.24 assertion fail ../../bfd/elf.c:2636
as: BFD (GNU Binutils for Ubuntu) 2.24 assertion fail ../../bfd/elf.c:2636
as: BFD (GNU Binutils for Ubuntu) 2.24 assertion fail ../../bfd/elf.c:2636
as: BFD (GNU Binutils for Ubuntu) 2.24 assertion fail ../../bfd/elf.c:2636
as: BFD (GNU Binutils for Ubuntu) 2.24 assertion fail ../../bfd/elf.c:2636
as: BFD (GNU Binutils for Ubuntu) 2.24 assertion fail ../../bfd/elf.c:2636
as: BFD (GNU Binutils for Ubuntu) 2.24 assertion fail ../../bfd/elf.c:2636
as: BFD (GNU Binutils for Ubuntu) 2.24 assertion fail ../../bfd/elf.c:2636
as: BFD (GNU Binutils for Ubuntu) 2.24 assertion fail ../../bfd/elf.c:2636
as: BFD (GNU Binutils for Ubuntu) 2.24 assertion fail ../../bfd/elf.c:2636
as: BFD (GNU Binutils for Ubuntu) 2.24 assertion fail ../../bfd/elf.c:2636
as: BFD (GNU Binutils for Ubuntu) 2.24 assertion fail ../../bfd/elf.c:2636
as: BFD (GNU Binutils for Ubuntu) 2.24 assertion fail ../../bfd/elf.c:2636
as: BFD (GNU Binutils for Ubuntu) 2.24 assertion fail ../../bfd/elf.c:2636
as: BFD (GNU Binutils for Ubuntu) 2.24 assertion fail ../../bfd/elf.c:2636
as: BFD (GNU Binutils for Ubuntu) 2.24 assertion fail ../../bfd/elf.c:2636
as: BFD (GNU Binutils for Ubuntu) 2.24 assertion fail ../../bfd/elf.c:2636
as: BFD (GNU Binutils for Ubuntu) 2.24 assertion fail ../../bfd/elf.c:2636
as: BFD (GNU Binutils for Ubuntu) 2.24 assertion fail ../../bfd/elf.c:2636
as: BFD (GNU Binutils for Ubuntu) 2.24 assertion fail ../../bfd/elf.c:2636
as: BFD (GNU Binutils for Ubuntu) 2.24 assertion fail ../../bfd/elf.c:2636
as: BFD (GNU Binutils for Ubuntu) 2.24 assertion fail ../../bfd/elf.c:2636
as: BFD (GNU Binutils for Ubuntu) 2.24 assertion fail ../../bfd/elf.c:2636
as: BFD (GNU Binutils for Ubuntu) 2.24 assertion fail ../../bfd/elf.c:2636
as: BFD (GNU Binutils for Ubuntu) 2.24 assertion fail ../../bfd/elf.c:2636
as: BFD (GNU Binutils for Ubuntu) 2.24 assertion fail ../../bfd/elf.c:2636
as: BFD (GNU Binutils for Ubuntu) 2.24 assertion fail ../../bfd/elf.c:2636
as: BFD (GNU Binutils for Ubuntu) 2.24 assertion fail ../../bfd/elf.c:2636
as: BFD (GNU Binutils for Ubuntu) 2.24 assertion fail ../../bfd/elf.c:2636
as: BFD (GNU Binutils for Ubuntu) 2.24 assertion fail ../../bfd/elf.c:2636
as: BFD (GNU Binutils for Ubuntu) 2.24 assertion fail ../../bfd/elf.c:2636
as: BFD (GNU Binutils for Ubuntu) 2.24 assertion fail ../../bfd/elf.c:2636
as: BFD (GNU Binutils for Ubuntu) 2.24 assertion fail ../../bfd/elf.c:2636
as: BFD (GNU Binutils for Ubuntu) 2.24 assertion fail ../../bfd/elf.c:2636
as: BFD (GNU Binutils for Ubuntu) 2.24 assertion fail ../../bfd/elf.c:2636
as: BFD (GNU Binutils for Ubuntu) 2.24 assertion fail ../../bfd/elf.c:2636
as: BFD (GNU Binutils for Ubuntu) 2.24 assertion fail ../../bfd/elf.c:2636
as: BFD (GNU Binutils for Ubuntu) 2.24 assertion fail ../../bfd/elf.c:2636
as: BFD (GNU Binutils for Ubuntu) 2.24 assertion fail ../../bfd/elf.c:2636
as: BFD (GNU Binutils for Ubuntu) 2.24 assertion fail ../../bfd/elf.c:2636
as: BFD (GNU Binutils for Ubuntu) 2.24 assertion fail ../../bfd/elf.c:2636
as: BFD (GNU Binutils for Ubuntu) 2.24 assertion fail ../../bfd/elf.c:2636
as: BFD (GNU Binutils for Ubuntu) 2.24 assertion fail ../../bfd/elf.c:2636
as: BFD (GNU Binutils for Ubuntu) 2.24 assertion fail ../../bfd/elf.c:2636
as: BFD (GNU Binutils for Ubuntu) 2.24 assertion fail ../../bfd/elf.c:2636
as: BFD (GNU Binutils for Ubuntu) 2.24 assertion fail ../../bfd/elf.c:2636
as: BFD (GNU Binutils for Ubuntu) 2.24 assertion fail ../../bfd/elf.c:2636
as: BFD (GNU Binutils for Ubuntu) 2.24 assertion fail ../../bfd/elf.c:2636
as: BFD (GNU Binutils for Ubuntu) 2.24 assertion fail ../../bfd/elf.c:2636
as: BFD (GNU Binutils for Ubuntu) 2.24 assertion fail ../../bfd/elf.c:2636
as: BFD (GNU Binutils for Ubuntu) 2.24 assertion fail ../../bfd/elf.c:2636
as: BFD (GNU Binutils for Ubuntu) 2.24 assertion fail ../../bfd/elf.c:2636
as: BFD (GNU Binutils for Ubuntu) 2.24 assertion fail ../../bfd/elf.c:2636
as: BFD (GNU Binutils for Ubuntu) 2.24 assertion fail ../../bfd/elf.c:2636
as: BFD (GNU Binutils for Ubuntu) 2.24 assertion fail ../../bfd/elf.c:2636
as: BFD (GNU Binutils for Ubuntu) 2.24 assertion fail ../../bfd/elf.c:2636
as: BFD (GNU Binutils for Ubuntu) 2.24 assertion fail ../../bfd/elf.c:2636
as: BFD (GNU Binutils for Ubuntu) 2.24 assertion fail ../../bfd/elf.c:2636
as: BFD (GNU Binutils for Ubuntu) 2.24 assertion fail ../../bfd/elf.c:2636
as: BFD (GNU Binutils for Ubuntu) 2.24 assertion fail ../../bfd/elf.c:2636
as: BFD (GNU Binutils for Ubuntu) 2.24 assertion fail ../../bfd/elf.c:2636
as: BFD (GNU Binutils for Ubuntu) 2.24 assertion fail ../../bfd/elf.c:2636
as: BFD (GNU Binutils for Ubuntu) 2.24 assertion fail ../../bfd/elf.c:2636
as: BFD (GNU Binutils for Ubuntu) 2.24 assertion fail ../../bfd/elf.c:2636
as: BFD (GNU Binutils for Ubuntu) 2.24 assertion fail ../../bfd/elf.c:2636
as: BFD (GNU Binutils for Ubuntu) 2.24 assertion fail ../../bfd/elf.c:2636
as: BFD (GNU Binutils for Ubuntu) 2.24 assertion fail ../../bfd/elf.c:2636
as: BFD (GNU Binutils for Ubuntu) 2.24 assertion fail ../../bfd/elf.c:2636
as: BFD (GNU Binutils for Ubuntu) 2.24 assertion fail ../../bfd/elf.c:2636
as: BFD (GNU Binutils for Ubuntu) 2.24 assertion fail ../../bfd/elf.c:2636
as: BFD (GNU Binutils for Ubuntu) 2.24 assertion fail ../../bfd/elf.c:2636
as: BFD (GNU Binutils for Ubuntu) 2.24 assertion fail ../../bfd/elf.c:2636
as: BFD (GNU Binutils for Ubuntu) 2.24 assertion fail ../../bfd/elf.c:2636
as: BFD (GNU Binutils for Ubuntu) 2.24 assertion fail ../../bfd/elf.c:2636
as: BFD (GNU Binutils for Ubuntu) 2.24 assertion fail ../../bfd/elf.c:2636
/tmp/ccy1Inlz.s: Fatal error: can't close launcher/mesos_executor-executor.o: No space left
on device
make[3]: *** [launcher/mesos_executor-executor.o] Error 1
../../src/launcher/default_executor.cpp:1481:1: fatal error: error writing to /tmp/ccZLxzqF.s:
No space left on device
 }
 ^
compilation terminated.
The bug is not reproducible, so it is likely a hardware or OS problem.
make[3]: *** [launcher/mesos_default_executor-default_executor.o] Error 1
make[3]: Leaving directory `/mesos/mesos-1.4.0/_build/src'
make[2]: *** [all] Error 2
make[2]: Leaving directory `/mesos/mesos-1.4.0/_build/src'
make[1]: *** [all-recursive] Error 1
make[1]: Leaving directory `/mesos/mesos-1.4.0/_build'
make: *** [distcheck] Error 1
+ docker rmi mesos-1502690678-31436
Untagged: mesos-1502690678-31436:latest
Deleted: sha256:0713e6abccadfa5505894353737e84c21272fec663d723d073a036d1d7ef6b74
Deleted: sha256:64d2f93797771c903b1b150e35bed8e425b0b77289821788bdb7fb5ae033e08c
Deleted: sha256:75c2d7f681701c8915f910dc23f3d719993c13046d59d5b66f689628781eae2f
Deleted: sha256:7bbb5b5a481eb4aa033894e9eb57c2e78ff695a319bac490d40665145c8998d7
Deleted: sha256:ad4e688dd9f5f4319864377223c3bbbd42c50e9da7180d88951ada38ca13ddd2
Deleted: sha256:c1691187cae550724564d89596b0639f7181ae870788246f6043521748939c46
Deleted: sha256:b4e37a2a30e79ce929875e0decb133252f19168a59e7d5c801e8a158b0ad443c
Deleted: sha256:b58647ce8d1653017530b57b5ff6e3ea034abe9f5512eb829f26c9dfe31b4a87
Deleted: sha256:dff4f14ffc1165c27b254059efc80103230c444b36a5316b3cb6fbed86b2f9a6
Deleted: sha256:98497510c66319a9acee8a57c41857cb577a34f913e65fa034adca039c781e20
Deleted: sha256:d42e3872048f4a30c8cafb3f78b294bf0df642e858439f7b1bd9db691a8f817e
Deleted: sha256:37d47c3b6ec9f01eaaf2ea265e733548f93ea4577dcf5af1e66cbeca717f40db
Deleted: sha256:d99fe73ef88fe1b4047edd713dcaeb5c7ee14654e331662eceabcc5aaf21d7ce
Deleted: sha256:797c7c0f694a3581aa6f4806db393f8dcec066c9025ccb761beca0b0cc8b4f37
Deleted: sha256:2e489179eeaa4282fddc9d6eb5f8ad062e85567406b586c9e88a610887a56d02
Deleted: sha256:8c4f4791f9512cc9eb24d725cb90fb52e372499466dc35f084bf36f047a72a31
Deleted: sha256:f2d314ae4e8bb9d8fdc4a1b6a17ececa2c4000bfdd91a3371abad4982fb42dc4
Deleted: sha256:31db673bd01fc96f0e715a190d00c80c154f489f3efbdd41749420922c029e13
Deleted: sha256:58c0f50a436ad4732e1d5921ae67b84725a870c36d7c2267e017751d418fe7e9
Deleted: sha256:81d0c41b6e326cd1261fe601370ad349926a410916cd466d9963da7af40d656b
Deleted: sha256:8e6fb79e7b5472a2e718faf3a0dfb955034e1c727397eb657e5bee2135c0f7ae
Deleted: sha256:35751f45eab19a9a183bb54c070c3cc71242ea8f84224a7a254fbfe36002d7b1
Deleted: sha256:5a829c8dc3dff15c3464449c464fd1fd1dfaecd6d3418a45d133e0a110714b1f
Deleted: sha256:6a82c5131ff955366e7769928d886fa62c5b67903851286c8b741ce0f1b221ad
Build step 'Execute shell' marked build as failure

Mime
View raw message