mesos-builds mailing list archives

Site index · List index
Message view « Date » · « Thread »
Top « Date » · « Thread »
From Apache Jenkins Server <jenk...@builds.apache.org>
Subject Build failed in Jenkins: Mesos-Reviewbot #19082
Date Sat, 26 Aug 2017 06:22:33 GMT
See <https://builds.apache.org/job/Mesos-Reviewbot/19082/display/redirect>

------------------------------------------
[...truncated 30.94 MB...]
I0826 06:22:28.461485  5705 slave.cpp:252] Mesos agent started on (803)@172.17.0.7:35043
I0826 06:22:28.461515  5705 slave.cpp:253] Flags at startup: --acls="" --appc_simple_discovery_uri_prefix="http://"
--appc_store_dir="/tmp/Endpoint_SlaveEndpointTest_AuthorizedRequest_2_mFiwrq/store/appc" --authenticate_http_readonly="true"
--authenticate_http_readwrite="true" --authenticatee="crammd5" --authentication_backoff_factor="1secs"
--authorizer="local" --cgroups_cpu_enable_pids_and_tids_count="false" --cgroups_enable_cfs="false"
--cgroups_hierarchy="/sys/fs/cgroup" --cgroups_limit_swap="false" --cgroups_root="mesos" --container_disk_watch_interval="15secs"
--containerizers="mesos" --credential="/tmp/Endpoint_SlaveEndpointTest_AuthorizedRequest_2_mFiwrq/credential"
--default_role="*" --disallow_sharing_agent_pid_namespace="false" --disk_watch_interval="1mins"
--docker="docker" --docker_kill_orphans="true" --docker_registry="https://registry-1.docker.io"
--docker_remove_delay="6hrs" --docker_socket="/var/run/docker.sock" --docker_stop_timeout="0ns"
--docker_store_dir="/tmp/Endpoint_SlaveEndpointTest_AuthorizedRequest_2_mFiwrq/store/docker"
--docker_volume_checkpoint_dir="/var/run/mesos/isolators/docker/volume" --enforce_container_disk_quota="false"
--executor_registration_timeout="1mins" --executor_reregistration_timeout="2secs" --executor_shutdown_grace_period="5secs"
--fetcher_cache_dir="/tmp/Endpoint_SlaveEndpointTest_AuthorizedRequest_2_mFiwrq/fetch" --fetcher_cache_size="2GB"
--frameworks_home="" --gc_delay="1weeks" --gc_disk_headroom="0.1" --hadoop_home="" --help="false"
--hostname_lookup="true" --http_command_executor="false" --http_credentials="/tmp/Endpoint_SlaveEndpointTest_AuthorizedRequest_2_mFiwrq/http_credentials"
--http_heartbeat_interval="30secs" --initialize_driver_logging="true" --isolation="posix/cpu,posix/mem"
--launcher="posix" --launcher_dir="/mesos/mesos-1.5.0/_build/src" --logbufsecs="0" --logging_level="INFO"
--max_completed_executors_per_framework="150" --oversubscribed_resources_interval="15secs"
--perf_duration="10secs" --perf_interval="1mins" --port="5051" --qos_correction_interval_min="0ns"
--quiet="false" --recover="reconnect" --recovery_timeout="15mins" --registration_backoff_factor="10ms"
--resources="cpus:2;gpus:0;mem:1024;disk:1024;ports:[31000-32000]" --revocable_cpu_low_priority="true"
--runtime_dir="/tmp/Endpoint_SlaveEndpointTest_AuthorizedRequest_2_mFiwrq" --sandbox_directory="/mnt/mesos/sandbox"
--strict="true" --switch_user="true" --systemd_enable_support="true" --systemd_runtime_directory="/run/systemd/system"
--version="false" --work_dir="/tmp/Endpoint_SlaveEndpointTest_AuthorizedRequest_2_a8O01K"
I0826 06:22:28.461972  5705 credentials.hpp:86] Loading credential for authentication from
'/tmp/Endpoint_SlaveEndpointTest_AuthorizedRequest_2_mFiwrq/credential'
I0826 06:22:28.462152  5705 slave.cpp:285] Agent using credential for: test-principal
I0826 06:22:28.462185  5705 credentials.hpp:37] Loading credentials for authentication from
'/tmp/Endpoint_SlaveEndpointTest_AuthorizedRequest_2_mFiwrq/http_credentials'
I0826 06:22:28.462455  5705 http.cpp:1045] Creating default 'basic' HTTP authenticator for
realm 'mesos-agent-readonly'
I0826 06:22:28.462638  5705 http.cpp:1045] Creating default 'basic' HTTP authenticator for
realm 'mesos-agent-readwrite'
I0826 06:22:28.463938  5705 slave.cpp:581] Agent resources: [{"name":"cpus","scalar":{"value":2.0},"type":"SCALAR"},{"name":"mem","scalar":{"value":1024.0},"type":"SCALAR"},{"name":"disk","scalar":{"value":1024.0},"type":"SCALAR"},{"name":"ports","ranges":{"range":[{"begin":31000,"end":32000}]},"type":"RANGES"}]
I0826 06:22:28.464160  5705 slave.cpp:589] Agent attributes: [  ]
I0826 06:22:28.464174  5705 slave.cpp:598] Agent hostname: dfe419752c0b
I0826 06:22:28.464318  5725 status_update_manager.cpp:177] Pausing sending status updates
I0826 06:22:28.465739  5724 state.cpp:64] Recovering state from '/tmp/Endpoint_SlaveEndpointTest_AuthorizedRequest_2_a8O01K/meta'
I0826 06:22:28.466011  5720 status_update_manager.cpp:203] Recovering status update manager
I0826 06:22:28.466210  5715 containerizer.cpp:643] Recovering containerizer
I0826 06:22:28.467804  5719 provisioner.cpp:416] Provisioner recovery complete
I0826 06:22:28.468147  5703 slave.cpp:6264] Finished recovery
I0826 06:22:28.468585  5703 slave.cpp:6446] Querying resource estimator for oversubscribable
resources
I0826 06:22:28.468822  5711 slave.cpp:6460] Received oversubscribable resources {} from the
resource estimator
I0826 06:22:28.471302  5717 process.cpp:3933] Handling HTTP event for process 'slave(803)'
with path: '/slave(803)/containers'
I0826 06:22:28.472420  5716 http.cpp:1185] HTTP GET for /slave(803)/containers from 172.17.0.7:37216
I0826 06:22:28.472496  5716 http.cpp:976] Authorizing principal 'test-principal' to GET the
'/containers' endpoint
I0826 06:22:28.476032  5717 slave.cpp:859] Agent terminating
[       OK ] Endpoint/SlaveEndpointTest.AuthorizedRequest/2 (29 ms)
[ RUN      ] Endpoint/SlaveEndpointTest.UnauthorizedRequest/0
I0826 06:22:28.486567  5684 containerizer.cpp:288] Using isolation { environment_secret, posix/cpu,
posix/mem, filesystem/posix, network/cni }
W0826 06:22:28.487043  5684 backend.cpp:76] Failed to create 'aufs' backend: AufsBackend requires
root privileges
W0826 06:22:28.487144  5684 backend.cpp:76] Failed to create 'bind' backend: BindBackend requires
root privileges
I0826 06:22:28.487181  5684 provisioner.cpp:255] Using default backend 'copy'
I0826 06:22:28.490749  5711 slave.cpp:252] Mesos agent started on (804)@172.17.0.7:35043
I0826 06:22:28.490774  5711 slave.cpp:253] Flags at startup: --acls="" --appc_simple_discovery_uri_prefix="http://"
--appc_store_dir="/tmp/Endpoint_SlaveEndpointTest_UnauthorizedRequest_0_SW1ok6/store/appc"
--authenticate_http_readonly="true" --authenticate_http_readwrite="true" --authenticatee="crammd5"
--authentication_backoff_factor="1secs" --authorizer="local" --cgroups_cpu_enable_pids_and_tids_count="false"
--cgroups_enable_cfs="false" --cgroups_hierarchy="/sys/fs/cgroup" --cgroups_limit_swap="false"
--cgroups_root="mesos" --container_disk_watch_interval="15secs" --containerizers="mesos" --credential="/tmp/Endpoint_SlaveEndpointTest_UnauthorizedRequest_0_SW1ok6/credential"
--default_role="*" --disallow_sharing_agent_pid_namespace="false" --disk_watch_interval="1mins"
--docker="docker" --docker_kill_orphans="true" --docker_registry="https://registry-1.docker.io"
--docker_remove_delay="6hrs" --docker_socket="/var/run/docker.sock" --docker_stop_timeout="0ns"
--docker_store_dir="/tmp/Endpoint_SlaveEndpointTest_UnauthorizedRequest_0_SW1ok6/store/docker"
--docker_volume_checkpoint_dir="/var/run/mesos/isolators/docker/volume" --enforce_container_disk_quota="false"
--executor_registration_timeout="1mins" --executor_reregistration_timeout="2secs" --executor_shutdown_grace_period="5secs"
--fetcher_cache_dir="/tmp/Endpoint_SlaveEndpointTest_UnauthorizedRequest_0_SW1ok6/fetch" --fetcher_cache_size="2GB"
--frameworks_home="" --gc_delay="1weeks" --gc_disk_headroom="0.1" --hadoop_home="" --help="false"
--hostname_lookup="true" --http_command_executor="false" --http_credentials="/tmp/Endpoint_SlaveEndpointTest_UnauthorizedRequest_0_SW1ok6/http_credentials"
--http_heartbeat_interval="30secs" --initialize_driver_logging="true" --isolation="posix/cpu,posix/mem"
--launcher="posix" --launcher_dir="/mesos/mesos-1.5.0/_build/src" --logbufsecs="0" --logging_level="INFO"
--max_completed_executors_per_framework="150" --oversubscribed_resources_interval="15secs"
--perf_duration="10secs" --perf_interval="1mins" --port="5051" --qos_correction_interval_min="0ns"
--quiet="false" --recover="reconnect" --recovery_timeout="15mins" --registration_backoff_factor="10ms"
--resources="cpus:2;gpus:0;mem:1024;disk:1024;ports:[31000-32000]" --revocable_cpu_low_priority="true"
--runtime_dir="/tmp/Endpoint_SlaveEndpointTest_UnauthorizedRequest_0_SW1ok6" --sandbox_directory="/mnt/mesos/sandbox"
--strict="true" --switch_user="true" --systemd_enable_support="true" --systemd_runtime_directory="/run/systemd/system"
--version="false" --work_dir="/tmp/Endpoint_SlaveEndpointTest_UnauthorizedRequest_0_E6EwQq"
I0826 06:22:28.491150  5711 credentials.hpp:86] Loading credential for authentication from
'/tmp/Endpoint_SlaveEndpointTest_UnauthorizedRequest_0_SW1ok6/credential'
I0826 06:22:28.491320  5711 slave.cpp:285] Agent using credential for: test-principal
I0826 06:22:28.491343  5711 credentials.hpp:37] Loading credentials for authentication from
'/tmp/Endpoint_SlaveEndpointTest_UnauthorizedRequest_0_SW1ok6/http_credentials'
I0826 06:22:28.491581  5711 http.cpp:1045] Creating default 'basic' HTTP authenticator for
realm 'mesos-agent-readonly'
I0826 06:22:28.491740  5711 http.cpp:1045] Creating default 'basic' HTTP authenticator for
realm 'mesos-agent-readwrite'
I0826 06:22:28.493125  5711 slave.cpp:581] Agent resources: [{"name":"cpus","scalar":{"value":2.0},"type":"SCALAR"},{"name":"mem","scalar":{"value":1024.0},"type":"SCALAR"},{"name":"disk","scalar":{"value":1024.0},"type":"SCALAR"},{"name":"ports","ranges":{"range":[{"begin":31000,"end":32000}]},"type":"RANGES"}]
I0826 06:22:28.493362  5711 slave.cpp:589] Agent attributes: [  ]
I0826 06:22:28.493376  5711 slave.cpp:598] Agent hostname: dfe419752c0b
I0826 06:22:28.493525  5717 status_update_manager.cpp:177] Pausing sending status updates
I0826 06:22:28.495182  5705 state.cpp:64] Recovering state from '/tmp/Endpoint_SlaveEndpointTest_UnauthorizedRequest_0_E6EwQq/meta'
I0826 06:22:28.495468  5715 status_update_manager.cpp:203] Recovering status update manager
I0826 06:22:28.495695  5720 containerizer.cpp:643] Recovering containerizer
I0826 06:22:28.497503  5714 provisioner.cpp:416] Provisioner recovery complete
I0826 06:22:28.497921  5725 slave.cpp:6264] Finished recovery
I0826 06:22:28.498428  5725 slave.cpp:6446] Querying resource estimator for oversubscribable
resources
I0826 06:22:28.498668  5716 slave.cpp:6460] Received oversubscribable resources {} from the
resource estimator
I0826 06:22:28.501106  5709 process.cpp:3933] Handling HTTP event for process 'slave(804)'
with path: '/slave(804)/monitor/statistics'
I0826 06:22:28.502318  5724 http.cpp:1185] HTTP GET for /slave(804)/monitor/statistics from
172.17.0.7:37218
I0826 06:22:28.502388  5724 http.cpp:976] Authorizing principal 'test-principal' to GET the
'/monitor/statistics' endpoint
I0826 06:22:28.504462  5706 slave.cpp:859] Agent terminating
[       OK ] Endpoint/SlaveEndpointTest.UnauthorizedRequest/0 (30 ms)
[ RUN      ] Endpoint/SlaveEndpointTest.UnauthorizedRequest/1
I0826 06:22:28.518836  5684 containerizer.cpp:288] Using isolation { environment_secret, posix/cpu,
posix/mem, filesystem/posix, network/cni }
W0826 06:22:28.519423  5684 backend.cpp:76] Failed to create 'aufs' backend: AufsBackend requires
root privileges
W0826 06:22:28.519534  5684 backend.cpp:76] Failed to create 'bind' backend: BindBackend requires
root privileges
I0826 06:22:28.519565  5684 provisioner.cpp:255] Using default backend 'copy'
I0826 06:22:28.524108  5721 slave.cpp:252] Mesos agent started on (805)@172.17.0.7:35043
I0826 06:22:28.524137  5721 slave.cpp:253] Flags at startup: --acls="" --appc_simple_discovery_uri_prefix="http://"
--appc_store_dir="/tmp/Endpoint_SlaveEndpointTest_UnauthorizedRequest_1_GXnBpL/store/appc"
--authenticate_http_readonly="true" --authenticate_http_readwrite="true" --authenticatee="crammd5"
--authentication_backoff_factor="1secs" --authorizer="local" --cgroups_cpu_enable_pids_and_tids_count="false"
--cgroups_enable_cfs="false" --cgroups_hierarchy="/sys/fs/cgroup" --cgroups_limit_swap="false"
--cgroups_root="mesos" --container_disk_watch_interval="15secs" --containerizers="mesos" --credential="/tmp/Endpoint_SlaveEndpointTest_UnauthorizedRequest_1_GXnBpL/credential"
--default_role="*" --disallow_sharing_agent_pid_namespace="false" --disk_watch_interval="1mins"
--docker="docker" --docker_kill_orphans="true" --docker_registry="https://registry-1.docker.io"
--docker_remove_delay="6hrs" --docker_socket="/var/run/docker.sock" --docker_stop_timeout="0ns"
--docker_store_dir="/tmp/Endpoint_SlaveEndpointTest_UnauthorizedRequest_1_GXnBpL/store/docker"
--docker_volume_checkpoint_dir="/var/run/mesos/isolators/docker/volume" --enforce_container_disk_quota="false"
--executor_registration_timeout="1mins" --executor_reregistration_timeout="2secs" --executor_shutdown_grace_period="5secs"
--fetcher_cache_dir="/tmp/Endpoint_SlaveEndpointTest_UnauthorizedRequest_1_GXnBpL/fetch" --fetcher_cache_size="2GB"
--frameworks_home="" --gc_delay="1weeks" --gc_disk_headroom="0.1" --hadoop_home="" --help="false"
--hostname_lookup="true" --http_command_executor="false" --http_credentials="/tmp/Endpoint_SlaveEndpointTest_UnauthorizedRequest_1_GXnBpL/http_credentials"
--http_heartbeat_interval="30secs" --initialize_driver_logging="true" --isolation="posix/cpu,posix/mem"
--launcher="posix" --launcher_dir="/mesos/mesos-1.5.0/_build/src" --logbufsecs="0" --logging_level="INFO"
--max_completed_executors_per_framework="150" --oversubscribed_resources_interval="15secs"
--perf_duration="10secs" --perf_interval="1mins" --port="5051" --qos_correction_interval_min="0ns"
--quiet="false" --recover="reconnect" --recovery_timeout="15mins" --registration_backoff_factor="10ms"
--resources="cpus:2;gpus:0;mem:1024;disk:1024;ports:[31000-32000]" --revocable_cpu_low_priority="true"
--runtime_dir="/tmp/Endpoint_SlaveEndpointTest_UnauthorizedRequest_1_GXnBpL" --sandbox_directory="/mnt/mesos/sandbox"
--strict="true" --switch_user="true" --systemd_enable_support="true" --systemd_runtime_directory="/run/systemd/system"
--version="false" --work_dir="/tmp/Endpoint_SlaveEndpointTest_UnauthorizedRequest_1_aT51Q5"
I0826 06:22:28.524605  5721 credentials.hpp:86] Loading credential for authentication from
'/tmp/Endpoint_SlaveEndpointTest_UnauthorizedRequest_1_GXnBpL/credential'
I0826 06:22:28.524814  5721 slave.cpp:285] Agent using credential for: test-principal
I0826 06:22:28.524844  5721 credentials.hpp:37] Loading credentials for authentication from
'/tmp/Endpoint_SlaveEndpointTest_UnauthorizedRequest_1_GXnBpL/http_credentials'
I0826 06:22:28.525096  5721 http.cpp:1045] Creating default 'basic' HTTP authenticator for
realm 'mesos-agent-readonly'
I0826 06:22:28.525312  5721 http.cpp:1045] Creating default 'basic' HTTP authenticator for
realm 'mesos-agent-readwrite'
I0826 06:22:28.526782  5721 slave.cpp:581] Agent resources: [{"name":"cpus","scalar":{"value":2.0},"type":"SCALAR"},{"name":"mem","scalar":{"value":1024.0},"type":"SCALAR"},{"name":"disk","scalar":{"value":1024.0},"type":"SCALAR"},{"name":"ports","ranges":{"range":[{"begin":31000,"end":32000}]},"type":"RANGES"}]
I0826 06:22:28.527027  5721 slave.cpp:589] Agent attributes: [  ]
I0826 06:22:28.527040  5721 slave.cpp:598] Agent hostname: dfe419752c0b
I0826 06:22:28.527204  5724 status_update_manager.cpp:177] Pausing sending status updates
I0826 06:22:28.528632  5705 state.cpp:64] Recovering state from '/tmp/Endpoint_SlaveEndpointTest_UnauthorizedRequest_1_aT51Q5/meta'
I0826 06:22:28.528923  5715 status_update_manager.cpp:203] Recovering status update manager
I0826 06:22:28.529105  5725 containerizer.cpp:643] Recovering containerizer
I0826 06:22:28.530577  5716 provisioner.cpp:416] Provisioner recovery complete
I0826 06:22:28.531018  5718 slave.cpp:6264] Finished recovery
I0826 06:22:28.531438  5718 slave.cpp:6446] Querying resource estimator for oversubscribable
resources
I0826 06:22:28.531668  5722 slave.cpp:6460] Received oversubscribable resources {} from the
resource estimator
I0826 06:22:28.534374  5709 process.cpp:3933] Handling HTTP event for process 'slave(805)'
with path: '/slave(805)/monitor/statistics.json'
I0826 06:22:28.535639  5712 http.cpp:1185] HTTP GET for /slave(805)/monitor/statistics.json
from 172.17.0.7:37220
I0826 06:22:28.535715  5712 http.cpp:976] Authorizing principal 'test-principal' to GET the
'/monitor/statistics.json' endpoint
I0826 06:22:28.538236  5703 slave.cpp:859] Agent terminating
[       OK ] Endpoint/SlaveEndpointTest.UnauthorizedRequest/1 (32 ms)
[ RUN      ] Endpoint/SlaveEndpointTest.UnauthorizedRequest/2
I0826 06:22:28.551060  5684 containerizer.cpp:288] Using isolation { environment_secret, posix/cpu,
posix/mem, filesystem/posix, network/cni }
W0826 06:22:28.551538  5684 backend.cpp:76] Failed to create 'aufs' backend: AufsBackend requires
root privileges
W0826 06:22:28.551672  5684 backend.cpp:76] Failed to create 'bind' backend: BindBackend requires
root privileges
I0826 06:22:28.551709  5684 provisioner.cpp:255] Using default backend 'copy'
I0826 06:22:28.555766  5713 slave.cpp:252] Mesos agent started on (806)@172.17.0.7:35043
I0826 06:22:28.555799  5713 slave.cpp:253] Flags at startup: --acls="" --appc_simple_discovery_uri_prefix="http://"
--appc_store_dir="/tmp/Endpoint_SlaveEndpointTest_UnauthorizedRequest_2_q3YsUr/store/appc"
--authenticate_http_readonly="true" --authenticate_http_readwrite="true" --authenticatee="crammd5"
--authentication_backoff_factor="1secs" --authorizer="local" --cgroups_cpu_enable_pids_and_tids_count="false"
--cgroups_enable_cfs="false" --cgroups_hierarchy="/sys/fs/cgroup" --cgroups_limit_swap="false"
--cgroups_root="mesos" --container_disk_watch_interval="15secs" --containerizers="mesos" --credential="/tmp/Endpoint_SlaveEndpointTest_UnauthorizedRequest_2_q3YsUr/credential"
--default_role="*" --disallow_sharing_agent_pid_namespace="false" --disk_watch_interval="1mins"
--docker="docker" --docker_kill_orphans="true" --docker_registry="https://registry-1.docker.io"
--docker_remove_delay="6hrs" --docker_socket="/var/run/docker.sock" --docker_stop_timeout="0ns"
--docker_store_dir="/tmp/Endpoint_SlaveEndpointTest_UnauthorizedRequest_2_q3YsUr/store/docker"
--docker_volume_checkpoint_dir="/var/run/mesos/isolators/docker/volume" --enforce_container_disk_quota="false"
--executor_registration_timeout="1mins" --executor_reregistration_timeout="2secs" --executor_shutdown_grace_period="5secs"
--fetcher_cache_dir="/tmp/Endpoint_SlaveEndpointTest_UnauthorizedRequest_2_q3YsUr/fetch" --fetcher_cache_size="2GB"
--frameworks_home="" --gc_delay="1weeks" --gc_disk_headroom="0.1" --hadoop_home="" --help="false"
--hostname_lookup="true" --http_command_executor="false" --http_credentials="/tmp/Endpoint_SlaveEndpointTest_UnauthorizedRequest_2_q3YsUr/http_credentials"
--http_heartbeat_interval="30secs" --initialize_driver_logging="true" --isolation="posix/cpu,posix/mem"
--launcher="posix" --launcher_dir="/mesos/mesos-1.5.0/_build/src" --logbufsecs="0" --logging_level="INFO"
--max_completed_executors_per_framework="150" --oversubscribed_resources_interval="15secs"
--perf_duration="10secs" --perf_interval="1mins" --port="5051" --qos_correction_interval_min="0ns"
--quiet="false" --recover="reconnect" --recovery_timeout="15mins" --registration_backoff_factor="10ms"
--resources="cpus:2;gpus:0;mem:1024;disk:1024;ports:[31000-32000]" --revocable_cpu_low_priority="true"
--runtime_dir="/tmp/Endpoint_SlaveEndpointTest_UnauthorizedRequest_2_q3YsUr" --sandbox_directory="/mnt/mesos/sandbox"
--strict="true" --switch_user="true" --systemd_enable_support="true" --systemd_runtime_directory="/run/systemd/system"
--version="false" --work_dir="/tmp/Endpoint_SlaveEndpointTest_UnauthorizedRequest_2_KOc2gM"
I0826 06:22:28.556247  5713 credentials.hpp:86] Loading credential for authentication from
'/tmp/Endpoint_SlaveEndpointTest_UnauthorizedRequest_2_q3YsUr/credential'
I0826 06:22:28.556404  5713 slave.cpp:285] Agent using credential for: test-principal
I0826 06:22:28.556440  5713 credentials.hpp:37] Loading credentials for authentication from
'/tmp/Endpoint_SlaveEndpointTest_UnauthorizedRequest_2_q3YsUr/http_credentials'
I0826 06:22:28.556723  5713 http.cpp:1045] Creating default 'basic' HTTP authenticator for
realm 'mesos-agent-readonly'
I0826 06:22:28.556926  5713 http.cpp:1045] Creating default 'basic' HTTP authenticator for
realm 'mesos-agent-readwrite'
I0826 06:22:28.558432  5713 slave.cpp:581] Agent resources: [{"name":"cpus","scalar":{"value":2.0},"type":"SCALAR"},{"name":"mem","scalar":{"value":1024.0},"type":"SCALAR"},{"name":"disk","scalar":{"value":1024.0},"type":"SCALAR"},{"name":"ports","ranges":{"range":[{"begin":31000,"end":32000}]},"type":"RANGES"}]
I0826 06:22:28.558676  5713 slave.cpp:589] Agent attributes: [  ]
I0826 06:22:28.558691  5713 slave.cpp:598] Agent hostname: dfe419752c0b
I0826 06:22:28.558809  5722 status_update_manager.cpp:177] Pausing sending status updates
I0826 06:22:28.560173  5714 state.cpp:64] Recovering state from '/tmp/Endpoint_SlaveEndpointTest_UnauthorizedRequest_2_KOc2gM/meta'
I0826 06:22:28.560514  5725 status_update_manager.cpp:203] Recovering status update manager
I0826 06:22:28.560825  5711 containerizer.cpp:643] Recovering containerizer
I0826 06:22:28.562490  5718 provisioner.cpp:416] Provisioner recovery complete
I0826 06:22:28.563029  5723 slave.cpp:6264] Finished recovery
I0826 06:22:28.563490  5723 slave.cpp:6446] Querying resource estimator for oversubscribable
resources
I0826 06:22:28.563778  5716 slave.cpp:6460] Received oversubscribable resources {} from the
resource estimator
I0826 06:22:28.566067  5715 process.cpp:3933] Handling HTTP event for process 'slave(806)'
with path: '/slave(806)/containers'
I0826 06:22:28.567678  5704 http.cpp:1185] HTTP GET for /slave(806)/containers from 172.17.0.7:37222
I0826 06:22:28.567749  5704 http.cpp:976] Authorizing principal 'test-principal' to GET the
'/containers' endpoint
I0826 06:22:28.570797  5684 slave.cpp:859] Agent terminating
[       OK ] Endpoint/SlaveEndpointTest.UnauthorizedRequest/2 (34 ms)
[ RUN      ] Endpoint/SlaveEndpointTest.NoAuthorizer/0
I0826 06:22:28.587153  5684 containerizer.cpp:288] Using isolation { environment_secret, posix/cpu,
posix/mem, filesystem/posix, network/cni }
W0826 06:22:28.587831  5684 backend.cpp:76] Failed to create 'aufs' backend: AufsBackend requires
root privileges
W0826 06:22:28.587954  5684 backend.cpp:76] Failed to create 'bind' backend: BindBackend requires
root privileges
I0826 06:22:28.588004  5684 provisioner.cpp:255] Using default backend 'copy'
I0826 06:22:28.590430  5684 cluster.cpp:448] Creating default 'local' authorizer
I0826 06:22:28.592900  5719 slave.cpp:252] Mesos agent started on (807)@172.17.0.7:35043
I0826 06:22:28.592927  5719 slave.cpp:253] Flags at startup: --acls="" --appc_simple_discovery_uri_prefix="http://"
--appc_store_dir="/tmp/Endpoint_SlaveEndpointTest_NoAuthorizer_0_lCNCJ8/store/appc" --authenticate_http_readonly="true"
--authenticate_http_readwrite="true" --authenticatee="crammd5" --authentication_backoff_factor="1secs"
--authorizer="local" --cgroups_cpu_enable_pids_and_tids_count="false" --cgroups_enable_cfs="false"
--cgroups_hierarchy="/sys/fs/cgroup" --cgroups_limit_swap="false" --cgroups_root="mesos" --container_disk_watch_interval="15secs"
--containerizers="mesos" --credential="/tmp/Endpoint_SlaveEndpointTest_NoAuthorizer_0_lCNCJ8/credential"
--default_role="*" --disallow_sharing_agent_pid_namespace="false" --disk_watch_interval="1mins"
--docker="docker" --docker_kill_orphans="true" --docker_registry="https://registry-1.docker.io"
--docker_remove_delay="6hrs" --docker_socket="/var/run/docker.sock" --docker_stop_timeout="0ns"
--docker_store_dir="/tmp/Endpoint_SlaveEndpointTest_NoAuthorizer_0_lCNCJ8/store/docker" --docker_volume_checkpoint_dir="/var/run/mesos/isolators/docker/volume"
--enforce_container_disk_quota="false" --executor_registration_timeout="1mins" --executor_reregistration_timeout="2secs"
--executor_shutdown_grace_period="5secs" --fetcher_cache_dir="/tmp/Endpoint_SlaveEndpointTest_NoAuthorizer_0_lCNCJ8/fetch"
--fetcher_cache_size="2GB" --frameworks_home="" --gc_delay="1weeks" --gc_disk_headroom="0.1"
--hadoop_home="" --help="false" --hostname_lookup="true" --http_command_executor="false" --http_credentials="/tmp/Endpoint_SlaveEndpointTest_NoAuthorizer_0_lCNCJ8/http_credentials"
--http_heartbeat_interval="30secs" --initialize_driver_logging="true" --isolation="posix/cpu,posix/mem"
--launcher="posix" --launcher_dir="/mesos/mesos-1.5.0/_build/src" --logbufsecs="0" --logging_level="INFO"
--max_completed_executors_per_framework="150" --oversubscribed_resources_interval="15secs"
--perf_duration="10secs" --perf_interval="1mins" --port="5051" --qos_correction_interval_min="0ns"
--quiet="false" --recover="reconnect" --recovery_timeout="15mins" --registration_backoff_factor="10ms"
--resources="cpus:2;gpus:0;mem:1024;disk:1024;ports:[31000-32000]" --revocable_cpu_low_priority="true"
--runtime_dir="/tmp/Endpoint_SlaveEndpointTest_NoAuthorizer_0_lCNCJ8" --sandbox_directory="/mnt/mesos/sandbox"
--strict="true" --switch_user="true" --systemd_enable_support="true" --systemd_runtime_directory="/run/systemd/system"
--version="false" --work_dir="/tmp/Endpoint_SlaveEndpointTest_NoAuthorizer_0_PUIY0s"
I0826 06:22:28.593353  5719 credentials.hpp:86] Loading credential for authentication from
'/tmp/Endpoint_SlaveEndpointTest_NoAuthorizer_0_lCNCJ8/credential'
I0826 06:22:28.593541  5719 slave.cpp:285] Agent using credential for: test-principal
I0826 06:22:28.593571  5719 credentials.hpp:37] Loading credentials for authentication from
'/tmp/Endpoint_SlaveEndpointTest_NoAuthorizer_0_lCNCJ8/http_credentials'
I0826 06:22:28.593873  5719 http.cpp:1045] Creating default 'basic' HTTP authenticator for
realm 'mesos-agent-readonly'
I0826 06:22:28.594063  5719 http.cpp:1045] Creating default 'basic' HTTP authenticator for
realm 'mesos-agent-readwrite'
I0826 06:22:28.595625  5719 slave.cpp:581] Agent resources: [{"name":"cpus","scalar":{"value":2.0},"type":"SCALAR"},{"name":"mem","scalar":{"value":1024.0},"type":"SCALAR"},{"name":"disk","scalar":{"value":1024.0},"type":"SCALAR"},{"name":"ports","ranges":{"range":[{"begin":31000,"end":32000}]},"type":"RANGES"}]
I0826 06:22:28.595906  5719 slave.cpp:589] Agent attributes: [  ]
I0826 06:22:28.595923  5719 slave.cpp:598] Agent hostname: dfe419752c0b
I0826 06:22:28.596102  5704 status_update_manager.cpp:177] Pausing sending status updates
I0826 06:22:28.597759  5712 state.cpp:64] Recovering state from '/tmp/Endpoint_SlaveEndpointTest_NoAuthorizer_0_PUIY0s/meta'
I0826 06:22:28.598127  5705 status_update_manager.cpp:203] Recovering status update manager
I0826 06:22:28.598409  5706 containerizer.cpp:643] Recovering containerizer
I0826 06:22:28.600090  5723 provisioner.cpp:416] Provisioner recovery complete
I0826 06:22:28.600473  5719 slave.cpp:6264] Finished recovery
I0826 06:22:28.600986  5719 slave.cpp:6446] Querying resource estimator for oversubscribable
resources
I0826 06:22:28.601248  5711 slave.cpp:6460] Received oversubscribable resources {} from the
resource estimator
I0826 06:22:28.603493  5710 process.cpp:3933] Handling HTTP event for process 'slave(807)'
with path: '/slave(807)/monitor/statistics'
I0826 06:22:28.604717  5721 http.cpp:1185] HTTP GET for /slave(807)/monitor/statistics from
172.17.0.7:37224
I0826 06:22:28.604811  5721 http.cpp:976] Authorizing principal 'test-principal' to GET the
'/monitor/statistics' endpoint
I0826 06:22:28.608424  5712 slave.cpp:859] Agent terminating
[       OK ] Endpoint/SlaveEndpointTest.NoAuthorizer/0 (35 ms)
[ RUN      ] Endpoint/SlaveEndpointTest.NoAuthorizer/1
I0826 06:22:28.622474  5684 containerizer.cpp:288] Using isolation { environment_secret, posix/cpu,
posix/mem, filesystem/posix, network/cni }
W0826 06:22:28.623052  5684 backend.cpp:76] Failed to create 'aufs' backend: AufsBackend requires
root privileges
W0826 06:22:28.623178  5684 backend.cpp:76] Failed to create 'bind' backend: BindBackend requires
root privileges
I0826 06:22:28.623214  5684 provisioner.cpp:255] Using default backend 'copy'
I0826 06:22:28.625447  5684 cluster.cpp:448] Creating default 'local' authorizer
I0826 06:22:28.627797  5719 slave.cpp:252] Mesos agent started on (808)@172.17.0.7:35043
I0826 06:22:28.627828  5719 slave.cpp:253] Flags at startup: --acls="" --appc_simple_discovery_uri_prefix="http://"
--appc_store_dir="/tmp/Endpoint_SlaveEndpointTest_NoAuthorizer_1_tWmdUP/store/appc" --authenticate_http_readonly="true"
--authenticate_http_readwrite="true" --authenticatee="crammd5" --authentication_backoff_factor="1secs"
--authorizer="local" --cgroups_cpu_enable_pids_and_tids_count="false" --cgroups_enable_cfs="false"
--cgroups_hierarchy="/sys/fs/cgroup" --cgroups_limit_swap="false" --cgroups_root="mesos" --container_disk_watch_interval="15secs"
--containerizers="mesos" --credential="/tmp/Endpoint_SlaveEndpointTest_NoAuthorizer_1_tWmdUP/credential"
--default_role="*" --disallow_sharing_agent_pid_namespace="false" --disk_watch_interval="1mins"
--docker="docker" --docker_kill_orphans="true" --docker_registry="https://registry-1.docker.io"
--docker_remove_delay="6hrs" --docker_socket="/var/run/docker.sock" --docker_stop_timeout="0ns"
--docker_store_dir="/tmp/Endpoint_SlaveEndpointTest_NoAuthorizer_1_tWmdUP/store/docker" --docker_volume_checkpoint_dir="/var/run/mesos/isolators/docker/volume"
--enforce_container_disk_quota="false" --executor_registration_timeout="1mins" --executor_reregistration_timeout="2secs"
--executor_shutdown_grace_period="5secs" --fetcher_cache_dir="/tmp/Endpoint_SlaveEndpointTest_NoAuthorizer_1_tWmdUP/fetch"
--fetcher_cache_size="2GB" --frameworks_home="" --gc_delay="1weeks" --gc_disk_headroom="0.1"
--hadoop_home="" --help="false" --hostname_lookup="true" --http_command_executor="false" --http_credentials="/tmp/Endpoint_SlaveEndpointTest_NoAuthorizer_1_tWmdUP/http_credentials"
--http_heartbeat_interval="30secs" --initialize_driver_logging="true" --isolation="posix/cpu,posix/mem"
--launcher="posix" --launcher_dir="/mesos/mesos-1.5.0/_build/src" --logbufsecs="0" --logging_level="INFO"
--max_completed_executors_per_framework="150" --oversubscribed_resources_interval="15secs"
--perf_duration="10secs" --perf_interval="1mins" --port="5051" --qos_correction_interval_min="0ns"
--quiet="false" --recover="reconnect" --recovery_timeout="15mins" --registration_backoff_factor="10ms"
--resources="cpus:2;gpus:0;mem:1024;disk:1024;ports:[31000-32000]" --revocable_cpu_low_priority="true"
--runtime_dir="/tmp/Endpoint_SlaveEndpointTest_NoAuthorizer_1_tWmdUP" --sandbox_directory="/mnt/mesos/sandbox"
--strict="true" --switch_user="true" --systemd_enable_support="true" --systemd_runtime_directory="/run/systemd/system"
--version="false" --work_dir="/tmp/Endpoint_SlaveEndpointTest_NoAuthorizer_1_J9ci69"
I0826 06:22:28.628367  5719 credentials.hpp:86] Loading credential for authentication from
'/tmp/Endpoint_SlaveEndpointTest_NoAuthorizer_1_tWmdUP/credential'
I0826 06:22:28.628553  5719 slave.cpp:285] Agent using credential for: test-principal
I0826 06:22:28.628577  5719 credentials.hpp:37] Loading credentials for authentication from
'/tmp/Endpoint_SlaveEndpointTest_NoAuthorizer_1_tWmdUP/http_credentials'
I0826 06:22:28.628897  5719 http.cpp:1045] Creating default 'basic' HTTP authenticator for
realm 'mesos-agent-readonly'
I0826 06:22:28.629231  5719 http.cpp:1045] Creating default 'basic' HTTP authenticator for
realm 'mesos-agent-readwrite'
I0826 06:22:28.630616  5719 slave.cpp:581] Agent resources: [{"name":"cpus","scalar":{"value":2.0},"type":"SCALAR"},{"name":"mem","scalar":{"value":1024.0},"type":"SCALAR"},{"name":"disk","scalar":{"value":1024.0},"type":"SCALAR"},{"name":"ports","ranges":{"range":[{"begin":31000,"end":32000}]},"type":"RANGES"}]
I0826 06:22:28.630861  5719 slave.cpp:589] Agent attributes: [  ]
I0826 06:22:28.630877  5719 slave.cpp:598] Agent hostname: dfe419752c0b
I0826 06:22:28.631055  5715 status_update_manager.cpp:177] Pausing sending status updates
I0826 06:22:28.632444  5711 state.cpp:64] Recovering state from '/tmp/Endpoint_SlaveEndpointTest_NoAuthorizer_1_J9ci69/meta'
I0826 06:22:28.632815  5720 status_update_manager.cpp:203] Recovering status update manager
I0826 06:22:28.633038  5717 containerizer.cpp:643] Recovering containerizer
I0826 06:22:28.634376  5715 provisioner.cpp:416] Provisioner recovery complete
I0826 06:22:28.635037  5725 slave.cpp:6264] Finished recovery
I0826 06:22:28.635578  5725 slave.cpp:6446] Querying resource estimator for oversubscribable
resources
I0826 06:22:28.635877  5713 slave.cpp:6460] Received oversubscribable resources {} from the
resource estimator
I0826 06:22:28.638330  5709 process.cpp:3933] Handling HTTP event for process 'slave(808)'
with path: '/slave(808)/monitor/statistics.json'
I0826 06:22:28.639961  5715 http.cpp:1185] HTTP GET for /slave(808)/monitor/statistics.json
from 172.17.0.7:37226
I0826 06:22:28.640029  5715 http.cpp:976] Authorizing principal 'test-principal' to GET the
'/monitor/statistics.json' endpoint
I0826 06:22:28.644596  5684 slave.cpp:859] Agent terminating
[       OK ] Endpoint/SlaveEndpointTest.NoAuthorizer/1 (36 ms)
[ RUN      ] Endpoint/SlaveEndpointTest.NoAuthorizer/2
I0826 06:22:28.656502  5684 containerizer.cpp:288] Using isolation { environment_secret, posix/cpu,
posix/mem, filesystem/posix, network/cni }
W0826 06:22:28.657006  5684 backend.cpp:76] Failed to create 'aufs' backend: AufsBackend requires
root privileges
W0826 06:22:28.657109  5684 backend.cpp:76] Failed to create 'bind' backend: BindBackend requires
root privileges
I0826 06:22:28.657138  5684 provisioner.cpp:255] Using default backend 'copy'
I0826 06:22:28.658771  5684 cluster.cpp:448] Creating default 'local' authorizer
I0826 06:22:28.660625  5712 slave.cpp:252] Mesos agent started on (809)@172.17.0.7:35043
I0826 06:22:28.660660  5712 slave.cpp:253] Flags at startup: --acls="" --appc_simple_discovery_uri_prefix="http://"
--appc_store_dir="/tmp/Endpoint_SlaveEndpointTest_NoAuthorizer_2_VMYGpx/store/appc" --authenticate_http_readonly="true"
--authenticate_http_readwrite="true" --authenticatee="crammd5" --authentication_backoff_factor="1secs"
--authorizer="local" --cgroups_cpu_enable_pids_and_tids_count="false" --cgroups_enable_cfs="false"
--cgroups_hierarchy="/sys/fs/cgroup" --cgroups_limit_swap="false" --cgroups_root="mesos" --container_disk_watch_interval="15secs"
--containerizers="mesos" --credential="/tmp/Endpoint_SlaveEndpointTest_NoAuthorizer_2_VMYGpx/credential"
--default_role="*" --disallow_sharing_agent_pid_namespace="false" --disk_watch_interval="1mins"
--docker="docker" --docker_kill_orphans="true" --docker_registry="https://registry-1.docker.io"
--docker_remove_delay="6hrs" --docker_socket="/var/run/docker.sock" --docker_stop_timeout="0ns"
--docker_store_dir="/tmp/Endpoint_SlaveEndpointTest_NoAuthorizer_2_VMYGpx/store/docker" --docker_volume_checkpoint_dir="/var/run/mesos/isolators/docker/volume"
--enforce_container_disk_quota="false" --executor_registration_timeout="1mins" --executor_reregistration_timeout="2secs"
--executor_shutdown_grace_period="5secs" --fetcher_cache_dir="/tmp/Endpoint_SlaveEndpointTest_NoAuthorizer_2_VMYGpx/fetch"
--fetcher_cache_size="2GB" --frameworks_home="" --gc_delay="1weeks" --gc_disk_headroom="0.1"
--hadoop_home="" --help="false" --hostname_lookup="true" --http_command_executor="false" --http_credentials="/tmp/Endpoint_SlaveEndpointTest_NoAuthorizer_2_VMYGpx/http_credentials"
--http_heartbeat_interval="30secs" --initialize_driver_logging="true" --isolation="posix/cpu,posix/mem"
--launcher="posix" --launcher_dir="/mesos/mesos-1.5.0/_build/src" --logbufsecs="0" --logging_level="INFO"
--max_completed_executors_per_framework="150" --oversubscribed_resources_interval="15secs"
--perf_duration="10secs" --perf_interval="1mins" --port="5051" --qos_correction_interval_min="0ns"
--quiet="false" --recover="reconnect" --recovery_timeout="15mins" --registration_backoff_factor="10ms"
--resources="cpus:2;gpus:0;mem:1024;disk:1024;ports:[31000-32000]" --revocable_cpu_low_priority="true"
--runtime_dir="/tmp/Endpoint_SlaveEndpointTest_NoAuthorizer_2_VMYGpx" --sandbox_directory="/mnt/mesos/sandbox"
--strict="true" --switch_user="true" --systemd_enable_support="true" --systemd_runtime_directory="/run/systemd/system"
--version="false" --work_dir="/tmp/Endpoint_SlaveEndpointTest_NoAuthorizer_2_XG2ywR"
I0826 06:22:28.661052  5712 credentials.hpp:86] Loading credential for authentication from
'/tmp/Endpoint_SlaveEndpointTest_NoAuthorizer_2_VMYGpx/credential'
I0826 06:22:28.661198  5712 slave.cpp:285] Agent using credential for: test-principal
I0826 06:22:28.661221  5712 credentials.hpp:37] Loading credentials for authentication from
'/tmp/Endpoint_SlaveEndpointTest_NoAuthorizer_2_VMYGpx/http_credentials'
I0826 06:22:28.661456  5712 http.cpp:1045] Creating default 'basic' HTTP authenticator for
realm 'mesos-agent-readonly'
I0826 06:22:28.661605  5712 http.cpp:1045] Creating default 'basic' HTTP authenticator for
realm 'mesos-agent-readwrite'
I0826 06:22:28.663523  5712 slave.cpp:581] Agent resources: [{"name":"cpus","scalar":{"value":2.0},"type":"SCALAR"},{"name":"mem","scalar":{"value":1024.0},"type":"SCALAR"},{"name":"disk","scalar":{"value":1024.0},"type":"SCALAR"},{"name":"ports","ranges":{"range":[{"begin":31000,"end":32000}]},"type":"RANGES"}]
I0826 06:22:28.663769  5712 slave.cpp:589] Agent attributes: [  ]
I0826 06:22:28.663781  5712 slave.cpp:598] Agent hostname: dfe419752c0b
I0826 06:22:28.663962  5714 status_update_manager.cpp:177] Pausing sending status updates
I0826 06:22:28.666236  5726 state.cpp:64] Recovering state from '/tmp/Endpoint_SlaveEndpointTest_NoAuthorizer_2_XG2ywR/meta'
I0826 06:22:28.666708  5709 status_update_manager.cpp:203] Recovering status update manager
I0826 06:22:28.666937  5707 containerizer.cpp:643] Recovering containerizer
I0826 06:22:28.668442  5717 provisioner.cpp:416] Provisioner recovery complete
I0826 06:22:28.668859  5722 slave.cpp:6264] Finished recovery
I0826 06:22:28.669419  5722 slave.cpp:6446] Querying resource estimator for oversubscribable
resources
I0826 06:22:28.669704  5708 slave.cpp:6460] Received oversubscribable resources {} from the
resource estimator
I0826 06:22:28.672700  5713 process.cpp:3933] Handling HTTP event for process 'slave(809)'
with path: '/slave(809)/containers'
I0826 06:22:28.674167  5717 http.cpp:1185] HTTP GET for /slave(809)/containers from 172.17.0.7:37228
I0826 06:22:28.674247  5717 http.cpp:976] Authorizing principal 'test-principal' to GET the
'/containers' endpoint
I0826 06:22:28.677990  5708 slave.cpp:859] Agent terminating
[       OK ] Endpoint/SlaveEndpointTest.NoAuthorizer/2 (33 ms)
[----------] 9 tests from Endpoint/SlaveEndpointTest (301 ms total)

[----------] 2 tests from ContainerizerType/DefaultContainerDNSFlagTest
[ RUN      ] ContainerizerType/DefaultContainerDNSFlagTest.ValidateFlag/0
[       OK ] ContainerizerType/DefaultContainerDNSFlagTest.ValidateFlag/0 (10 ms)
[ RUN      ] ContainerizerType/DefaultContainerDNSFlagTest.ValidateFlag/1
[       OK ] ContainerizerType/DefaultContainerDNSFlagTest.ValidateFlag/1 (10 ms)
[----------] 2 tests from ContainerizerType/DefaultContainerDNSFlagTest (20 ms total)

[----------] Global test environment tear-down
[==========] 1661 tests from 182 test cases ran. (500841 ms total)
[  PASSED  ] 1660 tests.
[  FAILED  ] 1 test, listed below:
[  FAILED  ] ExamplesTest.TestFramework

 1 FAILED TEST
  YOU HAVE 20 DISABLED TESTS

I0826 06:22:28.762562  5727 process.cpp:1072] Failed to accept socket: future discarded
make[4]: *** [check-local] Error 1
make[4]: Leaving directory `/mesos/mesos-1.5.0/_build/src'
make[3]: *** [check-am] Error 2
make[3]: Leaving directory `/mesos/mesos-1.5.0/_build/src'
make[2]: *** [check] Error 2
make[2]: Leaving directory `/mesos/mesos-1.5.0/_build/src'
make[1]: *** [check-recursive] Error 1
make[1]: Leaving directory `/mesos/mesos-1.5.0/_build'
make: *** [distcheck] Error 1
+ docker rmi mesos-1503725489-1648
Untagged: mesos-1503725489-1648:latest
Deleted: sha256:984de184e99c509b43b50a41823ce0c6086ff5d0c3ee70071a13a30af99050ce
Deleted: sha256:932743f915558a561cbd11be6a498b3e3e9236727c2838ca91022408b3fbee59
Deleted: sha256:cfb9838a48469583452c9fa8265da281c3fb0282699a8819f5c8681a6131a444
Deleted: sha256:a9cbf86d83f2b7770cc749ddc3c57601eb43fdc635b9ae5bd24a03b2677f6926
Deleted: sha256:9e7fd8b01e4ff42a2aa8e98397799bacdd33edb9e3f389558029319c0b44b18d
Deleted: sha256:e80f465c3be59badf3095b4cf2726cad4af72f75765be646500967c4a8c6da16
Deleted: sha256:058b0fd234d5af1685cdbb196c829a82f6e341522fbb2f787a440333ba1d105f
Deleted: sha256:2ea030b03761429c57f027375f0dd4b97be1bc8aa898c9e8751cfa19391171eb
Deleted: sha256:f26c1fbe6df09a4a29c64f61c4894201b14ab22bd6a86477d27c6ec1a7a1990c
Deleted: sha256:e40f38a734ecca4afb9632e607f67d59cf640736ae9ae077b9ed3ff20702f800
Deleted: sha256:097d261681f6e47ecd97ebdf4a5f333ff0124a920fe5f8000c689a041aab6ce7
Deleted: sha256:27711f8b9541c497d36f769f3803d9d3bc91b8e2500b9a1ba99c4c901bc2487a
Deleted: sha256:8bd5bcb3bbe0fe88b65ebbfe93848ed66be22dec219116043ae709d79b6c6b55
Deleted: sha256:b126641bdb4ece835fd7daaad12a9af01437de42871e2aa0d710776122072ccc
Deleted: sha256:207f4eca59b61d6d6face0896fee57082eab2146176dea41ab01fa408af9d5d7
Deleted: sha256:51b9bfd877687f8851f0cbea9642672119fb0fded1367f96e005e1173a0b4caf
Deleted: sha256:110a4bb74b646cc145f9ae97df057fc79db69c1fdc227e2ddc3f7fdbcb88c095
Deleted: sha256:f32cd8b58800fa45234a5891062a80345321b66cd902fd4fd758d578bb75340f
Deleted: sha256:451e0269e7eff029b13932d4f58fd236d0a40f9317c79cdb4c77a159605d0efa
Deleted: sha256:b62fdb574e096845d9fb2e7c6ecfba87765f4723e0eeefa48315b4fa6e794dee
Deleted: sha256:d68d3c4c4347abe6da0b8b7e9d7078f7e7c6f74c158ac29ef2b8204bf9d27fc2
Deleted: sha256:aaf3f1f4953c5812f8d1f6f3fa6db61f8b3318e4713c898c19a25cac591eed11
Deleted: sha256:3a54063d8d6c237c800f1821e4ba101b8fd0a530e9b524690f788e4205e3befb
Deleted: sha256:680c658703db9c4173a04a7980aa4b977964baec7a40ac8c98065828ca658fd6
Build step 'Execute shell' marked build as failure

Mime
View raw message