mesos-builds mailing list archives

Site index · List index
Message view « Date » · « Thread »
Top « Date » · « Thread »
From Apache Jenkins Server <jenk...@builds.apache.org>
Subject Build failed in Jenkins: Mesos-Buildbot » autotools,gcc,--verbose --enable-libevent --enable-ssl,GLOG_v=1 MESOS_VERBOSE=1,centos:7,(ubuntu)&&(!ubuntu-us1)&&(!ubuntu-eu2) #4075
Date Mon, 07 Aug 2017 19:47:14 GMT
See <https://builds.apache.org/job/Mesos-Buildbot/BUILDTOOL=autotools,COMPILER=gcc,CONFIGURATION=--verbose%20--enable-libevent%20--enable-ssl,ENVIRONMENT=GLOG_v=1%20MESOS_VERBOSE=1,OS=centos%3A7,label_exp=(ubuntu)&&(!ubuntu-us1)&&(!ubuntu-eu2)/4075/display/redirect?page=changes>

Changes:

[alexr] Tweaked checker logs to avoid repeated information.

------------------------------------------
[...truncated 32.06 MB...]
W0807 19:47:04.406296  9354 backend.cpp:76] Failed to create 'aufs' backend: AufsBackend requires
root privileges
W0807 19:47:04.406427  9354 backend.cpp:76] Failed to create 'bind' backend: BindBackend requires
root privileges
I0807 19:47:04.406472  9354 provisioner.cpp:255] Using default backend 'copy'
I0807 19:47:04.410367 30155 slave.cpp:250] Mesos agent started on (802)@172.17.0.2:40130
I0807 19:47:04.410389 30155 slave.cpp:251] Flags at startup: --acls="" --appc_simple_discovery_uri_prefix="http://"
--appc_store_dir="/tmp/Endpoint_SlaveEndpointTest_UnauthorizedRequest_0_TKpV6s/store/appc"
--authenticate_http_executors="true" --authenticate_http_readonly="true" --authenticate_http_readwrite="true"
--authenticatee="crammd5" --authentication_backoff_factor="1secs" --authorizer="local" --cgroups_cpu_enable_pids_and_tids_count="false"
--cgroups_enable_cfs="false" --cgroups_hierarchy="/sys/fs/cgroup" --cgroups_limit_swap="false"
--cgroups_root="mesos" --container_disk_watch_interval="15secs" --containerizers="mesos" --credential="/tmp/Endpoint_SlaveEndpointTest_UnauthorizedRequest_0_TKpV6s/credential"
--default_role="*" --disk_watch_interval="1mins" --docker="docker" --docker_kill_orphans="true"
--docker_registry="https://registry-1.docker.io" --docker_remove_delay="6hrs" --docker_socket="/var/run/docker.sock"
--docker_stop_timeout="0ns" --docker_store_dir="/tmp/Endpoint_SlaveEndpointTest_UnauthorizedRequest_0_TKpV6s/store/docker"
--docker_volume_checkpoint_dir="/var/run/mesos/isolators/docker/volume" --enforce_container_disk_quota="false"
--executor_registration_timeout="1mins" --executor_reregistration_timeout="2secs" --executor_secret_key="/tmp/Endpoint_SlaveEndpointTest_UnauthorizedRequest_0_TKpV6s/executor_secret_key"
--executor_shutdown_grace_period="5secs" --fetcher_cache_dir="/tmp/Endpoint_SlaveEndpointTest_UnauthorizedRequest_0_TKpV6s/fetch"
--fetcher_cache_size="2GB" --frameworks_home="" --gc_delay="1weeks" --gc_disk_headroom="0.1"
--hadoop_home="" --help="false" --hostname_lookup="true" --http_command_executor="false" --http_credentials="/tmp/Endpoint_SlaveEndpointTest_UnauthorizedRequest_0_TKpV6s/http_credentials"
--http_heartbeat_interval="30secs" --initialize_driver_logging="true" --isolation="posix/cpu,posix/mem"
--launcher="posix" --launcher_dir="/mesos/mesos-1.4.0/_build/src" --logbufsecs="0" --logging_level="INFO"
--max_completed_executors_per_framework="150" --oversubscribed_resources_interval="15secs"
--perf_duration="10secs" --perf_interval="1mins" --port="5051" --qos_correction_interval_min="0ns"
--quiet="false" --recover="reconnect" --recovery_timeout="15mins" --registration_backoff_factor="10ms"
--resources="cpus:2;gpus:0;mem:1024;disk:1024;ports:[31000-32000]" --revocable_cpu_low_priority="true"
--runtime_dir="/tmp/Endpoint_SlaveEndpointTest_UnauthorizedRequest_0_TKpV6s" --sandbox_directory="/mnt/mesos/sandbox"
--strict="true" --switch_user="true" --systemd_enable_support="true" --systemd_runtime_directory="/run/systemd/system"
--version="false" --work_dir="/tmp/Endpoint_SlaveEndpointTest_UnauthorizedRequest_0_ZHgWRk"
I0807 19:47:04.410871 30155 credentials.hpp:86] Loading credential for authentication from
'/tmp/Endpoint_SlaveEndpointTest_UnauthorizedRequest_0_TKpV6s/credential'
I0807 19:47:04.411063 30155 slave.cpp:283] Agent using credential for: test-principal
I0807 19:47:04.411103 30155 credentials.hpp:37] Loading credentials for authentication from
'/tmp/Endpoint_SlaveEndpointTest_UnauthorizedRequest_0_TKpV6s/http_credentials'
I0807 19:47:04.411450 30155 http.cpp:1026] Creating default 'basic' HTTP authenticator for
realm 'mesos-agent-executor'
I0807 19:47:04.411588 30155 http.cpp:1047] Creating default 'jwt' HTTP authenticator for realm
'mesos-agent-executor'
I0807 19:47:04.411836 30155 http.cpp:1026] Creating default 'basic' HTTP authenticator for
realm 'mesos-agent-readonly'
I0807 19:47:04.411934 30155 http.cpp:1047] Creating default 'jwt' HTTP authenticator for realm
'mesos-agent-readonly'
I0807 19:47:04.412107 30155 http.cpp:1026] Creating default 'basic' HTTP authenticator for
realm 'mesos-agent-readwrite'
I0807 19:47:04.412206 30155 http.cpp:1047] Creating default 'jwt' HTTP authenticator for realm
'mesos-agent-readwrite'
I0807 19:47:04.413776 30155 slave.cpp:565] Agent resources: [{"name":"cpus","scalar":{"value":2.0},"type":"SCALAR"},{"name":"mem","scalar":{"value":1024.0},"type":"SCALAR"},{"name":"disk","scalar":{"value":1024.0},"type":"SCALAR"},{"name":"ports","ranges":{"range":[{"begin":31000,"end":32000}]},"type":"RANGES"}]
I0807 19:47:04.414013 30155 slave.cpp:573] Agent attributes: [  ]
I0807 19:47:04.414026 30155 slave.cpp:582] Agent hostname: 13a1d6e006cf
I0807 19:47:04.414175 30154 status_update_manager.cpp:177] Pausing sending status updates
I0807 19:47:04.415700 30162 state.cpp:64] Recovering state from '/tmp/Endpoint_SlaveEndpointTest_UnauthorizedRequest_0_ZHgWRk/meta'
I0807 19:47:04.416074 30160 status_update_manager.cpp:203] Recovering status update manager
I0807 19:47:04.416280 30161 containerizer.cpp:598] Recovering containerizer
I0807 19:47:04.417611 30174 provisioner.cpp:416] Provisioner recovery complete
I0807 19:47:04.417945 30155 slave.cpp:6207] Finished recovery
I0807 19:47:04.418330 30155 slave.cpp:6389] Querying resource estimator for oversubscribable
resources
I0807 19:47:04.418609 30164 slave.cpp:6403] Received oversubscribable resources {} from the
resource estimator
I0807 19:47:04.420534 30154 process.cpp:3933] Handling HTTP event for process 'slave(802)'
with path: '/slave(802)/monitor/statistics'
I0807 19:47:04.422401 30172 http.cpp:1166] HTTP GET for /slave(802)/monitor/statistics from
172.17.0.2:49998
I0807 19:47:04.422533 30172 http.cpp:957] Authorizing principal 'test-principal' to GET the
'/monitor/statistics' endpoint
I0807 19:47:04.424754 30170 slave.cpp:843] Agent terminating
[       OK ] Endpoint/SlaveEndpointTest.UnauthorizedRequest/0 (31 ms)
[ RUN      ] Endpoint/SlaveEndpointTest.UnauthorizedRequest/1
I0807 19:47:04.435950  9354 containerizer.cpp:246] Using isolation: posix/cpu,posix/mem,filesystem/posix,network/cni,environment_secret
W0807 19:47:04.436409  9354 backend.cpp:76] Failed to create 'aufs' backend: AufsBackend requires
root privileges
W0807 19:47:04.436514  9354 backend.cpp:76] Failed to create 'bind' backend: BindBackend requires
root privileges
I0807 19:47:04.436549  9354 provisioner.cpp:255] Using default backend 'copy'
I0807 19:47:04.439810 30172 slave.cpp:250] Mesos agent started on (803)@172.17.0.2:40130
I0807 19:47:04.439832 30172 slave.cpp:251] Flags at startup: --acls="" --appc_simple_discovery_uri_prefix="http://"
--appc_store_dir="/tmp/Endpoint_SlaveEndpointTest_UnauthorizedRequest_1_V6QGk0/store/appc"
--authenticate_http_executors="true" --authenticate_http_readonly="true" --authenticate_http_readwrite="true"
--authenticatee="crammd5" --authentication_backoff_factor="1secs" --authorizer="local" --cgroups_cpu_enable_pids_and_tids_count="false"
--cgroups_enable_cfs="false" --cgroups_hierarchy="/sys/fs/cgroup" --cgroups_limit_swap="false"
--cgroups_root="mesos" --container_disk_watch_interval="15secs" --containerizers="mesos" --credential="/tmp/Endpoint_SlaveEndpointTest_UnauthorizedRequest_1_V6QGk0/credential"
--default_role="*" --disk_watch_interval="1mins" --docker="docker" --docker_kill_orphans="true"
--docker_registry="https://registry-1.docker.io" --docker_remove_delay="6hrs" --docker_socket="/var/run/docker.sock"
--docker_stop_timeout="0ns" --docker_store_dir="/tmp/Endpoint_SlaveEndpointTest_UnauthorizedRequest_1_V6QGk0/store/docker"
--docker_volume_checkpoint_dir="/var/run/mesos/isolators/docker/volume" --enforce_container_disk_quota="false"
--executor_registration_timeout="1mins" --executor_reregistration_timeout="2secs" --executor_secret_key="/tmp/Endpoint_SlaveEndpointTest_UnauthorizedRequest_1_V6QGk0/executor_secret_key"
--executor_shutdown_grace_period="5secs" --fetcher_cache_dir="/tmp/Endpoint_SlaveEndpointTest_UnauthorizedRequest_1_V6QGk0/fetch"
--fetcher_cache_size="2GB" --frameworks_home="" --gc_delay="1weeks" --gc_disk_headroom="0.1"
--hadoop_home="" --help="false" --hostname_lookup="true" --http_command_executor="false" --http_credentials="/tmp/Endpoint_SlaveEndpointTest_UnauthorizedRequest_1_V6QGk0/http_credentials"
--http_heartbeat_interval="30secs" --initialize_driver_logging="true" --isolation="posix/cpu,posix/mem"
--launcher="posix" --launcher_dir="/mesos/mesos-1.4.0/_build/src" --logbufsecs="0" --logging_level="INFO"
--max_completed_executors_per_framework="150" --oversubscribed_resources_interval="15secs"
--perf_duration="10secs" --perf_interval="1mins" --port="5051" --qos_correction_interval_min="0ns"
--quiet="false" --recover="reconnect" --recovery_timeout="15mins" --registration_backoff_factor="10ms"
--resources="cpus:2;gpus:0;mem:1024;disk:1024;ports:[31000-32000]" --revocable_cpu_low_priority="true"
--runtime_dir="/tmp/Endpoint_SlaveEndpointTest_UnauthorizedRequest_1_V6QGk0" --sandbox_directory="/mnt/mesos/sandbox"
--strict="true" --switch_user="true" --systemd_enable_support="true" --systemd_runtime_directory="/run/systemd/system"
--version="false" --work_dir="/tmp/Endpoint_SlaveEndpointTest_UnauthorizedRequest_1_Vj760R"
I0807 19:47:04.440222 30172 credentials.hpp:86] Loading credential for authentication from
'/tmp/Endpoint_SlaveEndpointTest_UnauthorizedRequest_1_V6QGk0/credential'
I0807 19:47:04.440371 30172 slave.cpp:283] Agent using credential for: test-principal
I0807 19:47:04.440392 30172 credentials.hpp:37] Loading credentials for authentication from
'/tmp/Endpoint_SlaveEndpointTest_UnauthorizedRequest_1_V6QGk0/http_credentials'
I0807 19:47:04.440707 30172 http.cpp:1026] Creating default 'basic' HTTP authenticator for
realm 'mesos-agent-executor'
I0807 19:47:04.440883 30172 http.cpp:1047] Creating default 'jwt' HTTP authenticator for realm
'mesos-agent-executor'
I0807 19:47:04.441131 30172 http.cpp:1026] Creating default 'basic' HTTP authenticator for
realm 'mesos-agent-readonly'
I0807 19:47:04.441298 30172 http.cpp:1047] Creating default 'jwt' HTTP authenticator for realm
'mesos-agent-readonly'
I0807 19:47:04.441521 30172 http.cpp:1026] Creating default 'basic' HTTP authenticator for
realm 'mesos-agent-readwrite'
I0807 19:47:04.441654 30172 http.cpp:1047] Creating default 'jwt' HTTP authenticator for realm
'mesos-agent-readwrite'
I0807 19:47:04.443949 30172 slave.cpp:565] Agent resources: [{"name":"cpus","scalar":{"value":2.0},"type":"SCALAR"},{"name":"mem","scalar":{"value":1024.0},"type":"SCALAR"},{"name":"disk","scalar":{"value":1024.0},"type":"SCALAR"},{"name":"ports","ranges":{"range":[{"begin":31000,"end":32000}]},"type":"RANGES"}]
I0807 19:47:04.444352 30172 slave.cpp:573] Agent attributes: [  ]
I0807 19:47:04.444396 30172 slave.cpp:582] Agent hostname: 13a1d6e006cf
I0807 19:47:04.444548 30165 status_update_manager.cpp:177] Pausing sending status updates
I0807 19:47:04.446657 30155 state.cpp:64] Recovering state from '/tmp/Endpoint_SlaveEndpointTest_UnauthorizedRequest_1_Vj760R/meta'
I0807 19:47:04.446945 30175 status_update_manager.cpp:203] Recovering status update manager
I0807 19:47:04.447116 30167 containerizer.cpp:598] Recovering containerizer
I0807 19:47:04.448462 30159 provisioner.cpp:416] Provisioner recovery complete
I0807 19:47:04.448781 30157 slave.cpp:6207] Finished recovery
I0807 19:47:04.449177 30157 slave.cpp:6389] Querying resource estimator for oversubscribable
resources
I0807 19:47:04.449378 30158 slave.cpp:6403] Received oversubscribable resources {} from the
resource estimator
I0807 19:47:04.451207 30162 process.cpp:3933] Handling HTTP event for process 'slave(803)'
with path: '/slave(803)/monitor/statistics.json'
I0807 19:47:04.452951 30175 http.cpp:1166] HTTP GET for /slave(803)/monitor/statistics.json
from 172.17.0.2:50000
I0807 19:47:04.453025 30175 http.cpp:957] Authorizing principal 'test-principal' to GET the
'/monitor/statistics.json' endpoint
I0807 19:47:04.454957 30170 slave.cpp:843] Agent terminating
[       OK ] Endpoint/SlaveEndpointTest.UnauthorizedRequest/1 (29 ms)
[ RUN      ] Endpoint/SlaveEndpointTest.UnauthorizedRequest/2
I0807 19:47:04.465621  9354 containerizer.cpp:246] Using isolation: posix/cpu,posix/mem,filesystem/posix,network/cni,environment_secret
W0807 19:47:04.466095  9354 backend.cpp:76] Failed to create 'aufs' backend: AufsBackend requires
root privileges
W0807 19:47:04.466209  9354 backend.cpp:76] Failed to create 'bind' backend: BindBackend requires
root privileges
I0807 19:47:04.466243  9354 provisioner.cpp:255] Using default backend 'copy'
I0807 19:47:04.469614 30162 slave.cpp:250] Mesos agent started on (804)@172.17.0.2:40130
I0807 19:47:04.469636 30162 slave.cpp:251] Flags at startup: --acls="" --appc_simple_discovery_uri_prefix="http://"
--appc_store_dir="/tmp/Endpoint_SlaveEndpointTest_UnauthorizedRequest_2_H3IgQx/store/appc"
--authenticate_http_executors="true" --authenticate_http_readonly="true" --authenticate_http_readwrite="true"
--authenticatee="crammd5" --authentication_backoff_factor="1secs" --authorizer="local" --cgroups_cpu_enable_pids_and_tids_count="false"
--cgroups_enable_cfs="false" --cgroups_hierarchy="/sys/fs/cgroup" --cgroups_limit_swap="false"
--cgroups_root="mesos" --container_disk_watch_interval="15secs" --containerizers="mesos" --credential="/tmp/Endpoint_SlaveEndpointTest_UnauthorizedRequest_2_H3IgQx/credential"
--default_role="*" --disk_watch_interval="1mins" --docker="docker" --docker_kill_orphans="true"
--docker_registry="https://registry-1.docker.io" --docker_remove_delay="6hrs" --docker_socket="/var/run/docker.sock"
--docker_stop_timeout="0ns" --docker_store_dir="/tmp/Endpoint_SlaveEndpointTest_UnauthorizedRequest_2_H3IgQx/store/docker"
--docker_volume_checkpoint_dir="/var/run/mesos/isolators/docker/volume" --enforce_container_disk_quota="false"
--executor_registration_timeout="1mins" --executor_reregistration_timeout="2secs" --executor_secret_key="/tmp/Endpoint_SlaveEndpointTest_UnauthorizedRequest_2_H3IgQx/executor_secret_key"
--executor_shutdown_grace_period="5secs" --fetcher_cache_dir="/tmp/Endpoint_SlaveEndpointTest_UnauthorizedRequest_2_H3IgQx/fetch"
--fetcher_cache_size="2GB" --frameworks_home="" --gc_delay="1weeks" --gc_disk_headroom="0.1"
--hadoop_home="" --help="false" --hostname_lookup="true" --http_command_executor="false" --http_credentials="/tmp/Endpoint_SlaveEndpointTest_UnauthorizedRequest_2_H3IgQx/http_credentials"
--http_heartbeat_interval="30secs" --initialize_driver_logging="true" --isolation="posix/cpu,posix/mem"
--launcher="posix" --launcher_dir="/mesos/mesos-1.4.0/_build/src" --logbufsecs="0" --logging_level="INFO"
--max_completed_executors_per_framework="150" --oversubscribed_resources_interval="15secs"
--perf_duration="10secs" --perf_interval="1mins" --port="5051" --qos_correction_interval_min="0ns"
--quiet="false" --recover="reconnect" --recovery_timeout="15mins" --registration_backoff_factor="10ms"
--resources="cpus:2;gpus:0;mem:1024;disk:1024;ports:[31000-32000]" --revocable_cpu_low_priority="true"
--runtime_dir="/tmp/Endpoint_SlaveEndpointTest_UnauthorizedRequest_2_H3IgQx" --sandbox_directory="/mnt/mesos/sandbox"
--strict="true" --switch_user="true" --systemd_enable_support="true" --systemd_runtime_directory="/run/systemd/system"
--version="false" --work_dir="/tmp/Endpoint_SlaveEndpointTest_UnauthorizedRequest_2_5kvhsp"
I0807 19:47:04.469990 30162 credentials.hpp:86] Loading credential for authentication from
'/tmp/Endpoint_SlaveEndpointTest_UnauthorizedRequest_2_H3IgQx/credential'
I0807 19:47:04.470137 30162 slave.cpp:283] Agent using credential for: test-principal
I0807 19:47:04.470157 30162 credentials.hpp:37] Loading credentials for authentication from
'/tmp/Endpoint_SlaveEndpointTest_UnauthorizedRequest_2_H3IgQx/http_credentials'
I0807 19:47:04.470427 30162 http.cpp:1026] Creating default 'basic' HTTP authenticator for
realm 'mesos-agent-executor'
I0807 19:47:04.470548 30162 http.cpp:1047] Creating default 'jwt' HTTP authenticator for realm
'mesos-agent-executor'
I0807 19:47:04.470736 30162 http.cpp:1026] Creating default 'basic' HTTP authenticator for
realm 'mesos-agent-readonly'
I0807 19:47:04.470835 30162 http.cpp:1047] Creating default 'jwt' HTTP authenticator for realm
'mesos-agent-readonly'
I0807 19:47:04.471009 30162 http.cpp:1026] Creating default 'basic' HTTP authenticator for
realm 'mesos-agent-readwrite'
I0807 19:47:04.471107 30162 http.cpp:1047] Creating default 'jwt' HTTP authenticator for realm
'mesos-agent-readwrite'
I0807 19:47:04.472439 30162 slave.cpp:565] Agent resources: [{"name":"cpus","scalar":{"value":2.0},"type":"SCALAR"},{"name":"mem","scalar":{"value":1024.0},"type":"SCALAR"},{"name":"disk","scalar":{"value":1024.0},"type":"SCALAR"},{"name":"ports","ranges":{"range":[{"begin":31000,"end":32000}]},"type":"RANGES"}]
I0807 19:47:04.472659 30162 slave.cpp:573] Agent attributes: [  ]
I0807 19:47:04.472674 30162 slave.cpp:582] Agent hostname: 13a1d6e006cf
I0807 19:47:04.472800 30156 status_update_manager.cpp:177] Pausing sending status updates
I0807 19:47:04.474107 30157 state.cpp:64] Recovering state from '/tmp/Endpoint_SlaveEndpointTest_UnauthorizedRequest_2_5kvhsp/meta'
I0807 19:47:04.474390 30165 status_update_manager.cpp:203] Recovering status update manager
I0807 19:47:04.474658 30160 containerizer.cpp:598] Recovering containerizer
I0807 19:47:04.475898 30168 provisioner.cpp:416] Provisioner recovery complete
I0807 19:47:04.476202 30175 slave.cpp:6207] Finished recovery
I0807 19:47:04.476619 30175 slave.cpp:6389] Querying resource estimator for oversubscribable
resources
I0807 19:47:04.476836 30170 slave.cpp:6403] Received oversubscribable resources {} from the
resource estimator
I0807 19:47:04.478739 30166 process.cpp:3933] Handling HTTP event for process 'slave(804)'
with path: '/slave(804)/containers'
I0807 19:47:04.480733 30172 http.cpp:1166] HTTP GET for /slave(804)/containers from 172.17.0.2:50002
I0807 19:47:04.480828 30172 http.cpp:957] Authorizing principal 'test-principal' to GET the
'/containers' endpoint
I0807 19:47:04.483649 30173 slave.cpp:843] Agent terminating
[       OK ] Endpoint/SlaveEndpointTest.UnauthorizedRequest/2 (28 ms)
[ RUN      ] Endpoint/SlaveEndpointTest.NoAuthorizer/0
I0807 19:47:04.493999  9354 containerizer.cpp:246] Using isolation: posix/cpu,posix/mem,filesystem/posix,network/cni,environment_secret
W0807 19:47:04.494462  9354 backend.cpp:76] Failed to create 'aufs' backend: AufsBackend requires
root privileges
W0807 19:47:04.494566  9354 backend.cpp:76] Failed to create 'bind' backend: BindBackend requires
root privileges
I0807 19:47:04.494597  9354 provisioner.cpp:255] Using default backend 'copy'
I0807 19:47:04.496296  9354 cluster.cpp:448] Creating default 'local' authorizer
I0807 19:47:04.498108 30172 slave.cpp:250] Mesos agent started on (805)@172.17.0.2:40130
I0807 19:47:04.498134 30172 slave.cpp:251] Flags at startup: --acls="" --appc_simple_discovery_uri_prefix="http://"
--appc_store_dir="/tmp/Endpoint_SlaveEndpointTest_NoAuthorizer_0_55FuC5/store/appc" --authenticate_http_executors="true"
--authenticate_http_readonly="true" --authenticate_http_readwrite="true" --authenticatee="crammd5"
--authentication_backoff_factor="1secs" --authorizer="local" --cgroups_cpu_enable_pids_and_tids_count="false"
--cgroups_enable_cfs="false" --cgroups_hierarchy="/sys/fs/cgroup" --cgroups_limit_swap="false"
--cgroups_root="mesos" --container_disk_watch_interval="15secs" --containerizers="mesos" --credential="/tmp/Endpoint_SlaveEndpointTest_NoAuthorizer_0_55FuC5/credential"
--default_role="*" --disk_watch_interval="1mins" --docker="docker" --docker_kill_orphans="true"
--docker_registry="https://registry-1.docker.io" --docker_remove_delay="6hrs" --docker_socket="/var/run/docker.sock"
--docker_stop_timeout="0ns" --docker_store_dir="/tmp/Endpoint_SlaveEndpointTest_NoAuthorizer_0_55FuC5/store/docker"
--docker_volume_checkpoint_dir="/var/run/mesos/isolators/docker/volume" --enforce_container_disk_quota="false"
--executor_registration_timeout="1mins" --executor_reregistration_timeout="2secs" --executor_secret_key="/tmp/Endpoint_SlaveEndpointTest_NoAuthorizer_0_55FuC5/executor_secret_key"
--executor_shutdown_grace_period="5secs" --fetcher_cache_dir="/tmp/Endpoint_SlaveEndpointTest_NoAuthorizer_0_55FuC5/fetch"
--fetcher_cache_size="2GB" --frameworks_home="" --gc_delay="1weeks" --gc_disk_headroom="0.1"
--hadoop_home="" --help="false" --hostname_lookup="true" --http_command_executor="false" --http_credentials="/tmp/Endpoint_SlaveEndpointTest_NoAuthorizer_0_55FuC5/http_credentials"
--http_heartbeat_interval="30secs" --initialize_driver_logging="true" --isolation="posix/cpu,posix/mem"
--launcher="posix" --launcher_dir="/mesos/mesos-1.4.0/_build/src" --logbufsecs="0" --logging_level="INFO"
--max_completed_executors_per_framework="150" --oversubscribed_resources_interval="15secs"
--perf_duration="10secs" --perf_interval="1mins" --port="5051" --qos_correction_interval_min="0ns"
--quiet="false" --recover="reconnect" --recovery_timeout="15mins" --registration_backoff_factor="10ms"
--resources="cpus:2;gpus:0;mem:1024;disk:1024;ports:[31000-32000]" --revocable_cpu_low_priority="true"
--runtime_dir="/tmp/Endpoint_SlaveEndpointTest_NoAuthorizer_0_55FuC5" --sandbox_directory="/mnt/mesos/sandbox"
--strict="true" --switch_user="true" --systemd_enable_support="true" --systemd_runtime_directory="/run/systemd/system"
--version="false" --work_dir="/tmp/Endpoint_SlaveEndpointTest_NoAuthorizer_0_lfVjaX"
I0807 19:47:04.498715 30172 credentials.hpp:86] Loading credential for authentication from
'/tmp/Endpoint_SlaveEndpointTest_NoAuthorizer_0_55FuC5/credential'
I0807 19:47:04.498868 30172 slave.cpp:283] Agent using credential for: test-principal
I0807 19:47:04.498889 30172 credentials.hpp:37] Loading credentials for authentication from
'/tmp/Endpoint_SlaveEndpointTest_NoAuthorizer_0_55FuC5/http_credentials'
I0807 19:47:04.499157 30172 http.cpp:1026] Creating default 'basic' HTTP authenticator for
realm 'mesos-agent-executor'
I0807 19:47:04.499274 30172 http.cpp:1047] Creating default 'jwt' HTTP authenticator for realm
'mesos-agent-executor'
I0807 19:47:04.499467 30172 http.cpp:1026] Creating default 'basic' HTTP authenticator for
realm 'mesos-agent-readonly'
I0807 19:47:04.499565 30172 http.cpp:1047] Creating default 'jwt' HTTP authenticator for realm
'mesos-agent-readonly'
I0807 19:47:04.499759 30172 http.cpp:1026] Creating default 'basic' HTTP authenticator for
realm 'mesos-agent-readwrite'
I0807 19:47:04.499858 30172 http.cpp:1047] Creating default 'jwt' HTTP authenticator for realm
'mesos-agent-readwrite'
I0807 19:47:04.501214 30172 slave.cpp:565] Agent resources: [{"name":"cpus","scalar":{"value":2.0},"type":"SCALAR"},{"name":"mem","scalar":{"value":1024.0},"type":"SCALAR"},{"name":"disk","scalar":{"value":1024.0},"type":"SCALAR"},{"name":"ports","ranges":{"range":[{"begin":31000,"end":32000}]},"type":"RANGES"}]
I0807 19:47:04.501433 30172 slave.cpp:573] Agent attributes: [  ]
I0807 19:47:04.501447 30172 slave.cpp:582] Agent hostname: 13a1d6e006cf
I0807 19:47:04.501567 30164 status_update_manager.cpp:177] Pausing sending status updates
I0807 19:47:04.502799 30160 state.cpp:64] Recovering state from '/tmp/Endpoint_SlaveEndpointTest_NoAuthorizer_0_lfVjaX/meta'
I0807 19:47:04.503106 30175 status_update_manager.cpp:203] Recovering status update manager
I0807 19:47:04.503311 30173 containerizer.cpp:598] Recovering containerizer
I0807 19:47:04.504477 30170 provisioner.cpp:416] Provisioner recovery complete
I0807 19:47:04.504832 30172 slave.cpp:6207] Finished recovery
I0807 19:47:04.505326 30172 slave.cpp:6389] Querying resource estimator for oversubscribable
resources
I0807 19:47:04.505539 30163 slave.cpp:6403] Received oversubscribable resources {} from the
resource estimator
I0807 19:47:04.507256 30164 process.cpp:3933] Handling HTTP event for process 'slave(805)'
with path: '/slave(805)/monitor/statistics'
I0807 19:47:04.508882 30162 http.cpp:1166] HTTP GET for /slave(805)/monitor/statistics from
172.17.0.2:50004
I0807 19:47:04.508946 30162 http.cpp:957] Authorizing principal 'test-principal' to GET the
'/monitor/statistics' endpoint
I0807 19:47:04.511502 30160 slave.cpp:843] Agent terminating
[       OK ] Endpoint/SlaveEndpointTest.NoAuthorizer/0 (28 ms)
[ RUN      ] Endpoint/SlaveEndpointTest.NoAuthorizer/1
I0807 19:47:04.528249  9354 containerizer.cpp:246] Using isolation: posix/cpu,posix/mem,filesystem/posix,network/cni,environment_secret
W0807 19:47:04.529304  9354 backend.cpp:76] Failed to create 'aufs' backend: AufsBackend requires
root privileges
W0807 19:47:04.529495  9354 backend.cpp:76] Failed to create 'bind' backend: BindBackend requires
root privileges
I0807 19:47:04.529547  9354 provisioner.cpp:255] Using default backend 'copy'
I0807 19:47:04.533406  9354 cluster.cpp:448] Creating default 'local' authorizer
I0807 19:47:04.536789 30160 slave.cpp:250] Mesos agent started on (806)@172.17.0.2:40130
I0807 19:47:04.536816 30160 slave.cpp:251] Flags at startup: --acls="" --appc_simple_discovery_uri_prefix="http://"
--appc_store_dir="/tmp/Endpoint_SlaveEndpointTest_NoAuthorizer_1_ZBgeGD/store/appc" --authenticate_http_executors="true"
--authenticate_http_readonly="true" --authenticate_http_readwrite="true" --authenticatee="crammd5"
--authentication_backoff_factor="1secs" --authorizer="local" --cgroups_cpu_enable_pids_and_tids_count="false"
--cgroups_enable_cfs="false" --cgroups_hierarchy="/sys/fs/cgroup" --cgroups_limit_swap="false"
--cgroups_root="mesos" --container_disk_watch_interval="15secs" --containerizers="mesos" --credential="/tmp/Endpoint_SlaveEndpointTest_NoAuthorizer_1_ZBgeGD/credential"
--default_role="*" --disk_watch_interval="1mins" --docker="docker" --docker_kill_orphans="true"
--docker_registry="https://registry-1.docker.io" --docker_remove_delay="6hrs" --docker_socket="/var/run/docker.sock"
--docker_stop_timeout="0ns" --docker_store_dir="/tmp/Endpoint_SlaveEndpointTest_NoAuthorizer_1_ZBgeGD/store/docker"
--docker_volume_checkpoint_dir="/var/run/mesos/isolators/docker/volume" --enforce_container_disk_quota="false"
--executor_registration_timeout="1mins" --executor_reregistration_timeout="2secs" --executor_secret_key="/tmp/Endpoint_SlaveEndpointTest_NoAuthorizer_1_ZBgeGD/executor_secret_key"
--executor_shutdown_grace_period="5secs" --fetcher_cache_dir="/tmp/Endpoint_SlaveEndpointTest_NoAuthorizer_1_ZBgeGD/fetch"
--fetcher_cache_size="2GB" --frameworks_home="" --gc_delay="1weeks" --gc_disk_headroom="0.1"
--hadoop_home="" --help="false" --hostname_lookup="true" --http_command_executor="false" --http_credentials="/tmp/Endpoint_SlaveEndpointTest_NoAuthorizer_1_ZBgeGD/http_credentials"
--http_heartbeat_interval="30secs" --initialize_driver_logging="true" --isolation="posix/cpu,posix/mem"
--launcher="posix" --launcher_dir="/mesos/mesos-1.4.0/_build/src" --logbufsecs="0" --logging_level="INFO"
--max_completed_executors_per_framework="150" --oversubscribed_resources_interval="15secs"
--perf_duration="10secs" --perf_interval="1mins" --port="5051" --qos_correction_interval_min="0ns"
--quiet="false" --recover="reconnect" --recovery_timeout="15mins" --registration_backoff_factor="10ms"
--resources="cpus:2;gpus:0;mem:1024;disk:1024;ports:[31000-32000]" --revocable_cpu_low_priority="true"
--runtime_dir="/tmp/Endpoint_SlaveEndpointTest_NoAuthorizer_1_ZBgeGD" --sandbox_directory="/mnt/mesos/sandbox"
--strict="true" --switch_user="true" --systemd_enable_support="true" --systemd_runtime_directory="/run/systemd/system"
--version="false" --work_dir="/tmp/Endpoint_SlaveEndpointTest_NoAuthorizer_1_8xuw9u"
I0807 19:47:04.537467 30160 credentials.hpp:86] Loading credential for authentication from
'/tmp/Endpoint_SlaveEndpointTest_NoAuthorizer_1_ZBgeGD/credential'
I0807 19:47:04.537693 30160 slave.cpp:283] Agent using credential for: test-principal
I0807 19:47:04.537734 30160 credentials.hpp:37] Loading credentials for authentication from
'/tmp/Endpoint_SlaveEndpointTest_NoAuthorizer_1_ZBgeGD/http_credentials'
I0807 19:47:04.538168 30160 http.cpp:1026] Creating default 'basic' HTTP authenticator for
realm 'mesos-agent-executor'
I0807 19:47:04.538332 30160 http.cpp:1047] Creating default 'jwt' HTTP authenticator for realm
'mesos-agent-executor'
I0807 19:47:04.538663 30160 http.cpp:1026] Creating default 'basic' HTTP authenticator for
realm 'mesos-agent-readonly'
I0807 19:47:04.538825 30160 http.cpp:1047] Creating default 'jwt' HTTP authenticator for realm
'mesos-agent-readonly'
I0807 19:47:04.539117 30160 http.cpp:1026] Creating default 'basic' HTTP authenticator for
realm 'mesos-agent-readwrite'
I0807 19:47:04.539235 30160 http.cpp:1047] Creating default 'jwt' HTTP authenticator for realm
'mesos-agent-readwrite'
I0807 19:47:04.541059 30160 slave.cpp:565] Agent resources: [{"name":"cpus","scalar":{"value":2.0},"type":"SCALAR"},{"name":"mem","scalar":{"value":1024.0},"type":"SCALAR"},{"name":"disk","scalar":{"value":1024.0},"type":"SCALAR"},{"name":"ports","ranges":{"range":[{"begin":31000,"end":32000}]},"type":"RANGES"}]
I0807 19:47:04.541363 30160 slave.cpp:573] Agent attributes: [  ]
I0807 19:47:04.541379 30160 slave.cpp:582] Agent hostname: 13a1d6e006cf
I0807 19:47:04.541584 30175 status_update_manager.cpp:177] Pausing sending status updates
I0807 19:47:04.543259 30156 state.cpp:64] Recovering state from '/tmp/Endpoint_SlaveEndpointTest_NoAuthorizer_1_8xuw9u/meta'
I0807 19:47:04.543612 30155 status_update_manager.cpp:203] Recovering status update manager
I0807 19:47:04.543798 30157 containerizer.cpp:598] Recovering containerizer
I0807 19:47:04.545406 30170 provisioner.cpp:416] Provisioner recovery complete
I0807 19:47:04.545867 30160 slave.cpp:6207] Finished recovery
I0807 19:47:04.546427 30160 slave.cpp:6389] Querying resource estimator for oversubscribable
resources
I0807 19:47:04.546726 30173 slave.cpp:6403] Received oversubscribable resources {} from the
resource estimator
I0807 19:47:04.550843 30175 process.cpp:3933] Handling HTTP event for process 'slave(806)'
with path: '/slave(806)/monitor/statistics.json'
I0807 19:47:04.553575 30163 http.cpp:1166] HTTP GET for /slave(806)/monitor/statistics.json
from 172.17.0.2:50006
I0807 19:47:04.553660 30163 http.cpp:957] Authorizing principal 'test-principal' to GET the
'/monitor/statistics.json' endpoint
I0807 19:47:04.558553  9354 slave.cpp:843] Agent terminating
[       OK ] Endpoint/SlaveEndpointTest.NoAuthorizer/1 (50 ms)
[ RUN      ] Endpoint/SlaveEndpointTest.NoAuthorizer/2
I0807 19:47:04.574468  9354 containerizer.cpp:246] Using isolation: posix/cpu,posix/mem,filesystem/posix,network/cni,environment_secret
W0807 19:47:04.575038  9354 backend.cpp:76] Failed to create 'aufs' backend: AufsBackend requires
root privileges
W0807 19:47:04.575170  9354 backend.cpp:76] Failed to create 'bind' backend: BindBackend requires
root privileges
I0807 19:47:04.575206  9354 provisioner.cpp:255] Using default backend 'copy'
I0807 19:47:04.577282  9354 cluster.cpp:448] Creating default 'local' authorizer
I0807 19:47:04.579349 30155 slave.cpp:250] Mesos agent started on (807)@172.17.0.2:40130
I0807 19:47:04.579380 30155 slave.cpp:251] Flags at startup: --acls="" --appc_simple_discovery_uri_prefix="http://"
--appc_store_dir="/tmp/Endpoint_SlaveEndpointTest_NoAuthorizer_2_9Zc8bc/store/appc" --authenticate_http_executors="true"
--authenticate_http_readonly="true" --authenticate_http_readwrite="true" --authenticatee="crammd5"
--authentication_backoff_factor="1secs" --authorizer="local" --cgroups_cpu_enable_pids_and_tids_count="false"
--cgroups_enable_cfs="false" --cgroups_hierarchy="/sys/fs/cgroup" --cgroups_limit_swap="false"
--cgroups_root="mesos" --container_disk_watch_interval="15secs" --containerizers="mesos" --credential="/tmp/Endpoint_SlaveEndpointTest_NoAuthorizer_2_9Zc8bc/credential"
--default_role="*" --disk_watch_interval="1mins" --docker="docker" --docker_kill_orphans="true"
--docker_registry="https://registry-1.docker.io" --docker_remove_delay="6hrs" --docker_socket="/var/run/docker.sock"
--docker_stop_timeout="0ns" --docker_store_dir="/tmp/Endpoint_SlaveEndpointTest_NoAuthorizer_2_9Zc8bc/store/docker"
--docker_volume_checkpoint_dir="/var/run/mesos/isolators/docker/volume" --enforce_container_disk_quota="false"
--executor_registration_timeout="1mins" --executor_reregistration_timeout="2secs" --executor_secret_key="/tmp/Endpoint_SlaveEndpointTest_NoAuthorizer_2_9Zc8bc/executor_secret_key"
--executor_shutdown_grace_period="5secs" --fetcher_cache_dir="/tmp/Endpoint_SlaveEndpointTest_NoAuthorizer_2_9Zc8bc/fetch"
--fetcher_cache_size="2GB" --frameworks_home="" --gc_delay="1weeks" --gc_disk_headroom="0.1"
--hadoop_home="" --help="false" --hostname_lookup="true" --http_command_executor="false" --http_credentials="/tmp/Endpoint_SlaveEndpointTest_NoAuthorizer_2_9Zc8bc/http_credentials"
--http_heartbeat_interval="30secs" --initialize_driver_logging="true" --isolation="posix/cpu,posix/mem"
--launcher="posix" --launcher_dir="/mesos/mesos-1.4.0/_build/src" --logbufsecs="0" --logging_level="INFO"
--max_completed_executors_per_framework="150" --oversubscribed_resources_interval="15secs"
--perf_duration="10secs" --perf_interval="1mins" --port="5051" --qos_correction_interval_min="0ns"
--quiet="false" --recover="reconnect" --recovery_timeout="15mins" --registration_backoff_factor="10ms"
--resources="cpus:2;gpus:0;mem:1024;disk:1024;ports:[31000-32000]" --revocable_cpu_low_priority="true"
--runtime_dir="/tmp/Endpoint_SlaveEndpointTest_NoAuthorizer_2_9Zc8bc" --sandbox_directory="/mnt/mesos/sandbox"
--strict="true" --switch_user="true" --systemd_enable_support="true" --systemd_runtime_directory="/run/systemd/system"
--version="false" --work_dir="/tmp/Endpoint_SlaveEndpointTest_NoAuthorizer_2_Pnf9x3"
I0807 19:47:04.579874 30155 credentials.hpp:86] Loading credential for authentication from
'/tmp/Endpoint_SlaveEndpointTest_NoAuthorizer_2_9Zc8bc/credential'
I0807 19:47:04.580075 30155 slave.cpp:283] Agent using credential for: test-principal
I0807 19:47:04.580102 30155 credentials.hpp:37] Loading credentials for authentication from
'/tmp/Endpoint_SlaveEndpointTest_NoAuthorizer_2_9Zc8bc/http_credentials'
I0807 19:47:04.580441 30155 http.cpp:1026] Creating default 'basic' HTTP authenticator for
realm 'mesos-agent-executor'
I0807 19:47:04.580593 30155 http.cpp:1047] Creating default 'jwt' HTTP authenticator for realm
'mesos-agent-executor'
I0807 19:47:04.580898 30155 http.cpp:1026] Creating default 'basic' HTTP authenticator for
realm 'mesos-agent-readonly'
I0807 19:47:04.581051 30155 http.cpp:1047] Creating default 'jwt' HTTP authenticator for realm
'mesos-agent-readonly'
I0807 19:47:04.581312 30155 http.cpp:1026] Creating default 'basic' HTTP authenticator for
realm 'mesos-agent-readwrite'
I0807 19:47:04.581444 30155 http.cpp:1047] Creating default 'jwt' HTTP authenticator for realm
'mesos-agent-readwrite'
I0807 19:47:04.583132 30155 slave.cpp:565] Agent resources: [{"name":"cpus","scalar":{"value":2.0},"type":"SCALAR"},{"name":"mem","scalar":{"value":1024.0},"type":"SCALAR"},{"name":"disk","scalar":{"value":1024.0},"type":"SCALAR"},{"name":"ports","ranges":{"range":[{"begin":31000,"end":32000}]},"type":"RANGES"}]
I0807 19:47:04.583420 30155 slave.cpp:573] Agent attributes: [  ]
I0807 19:47:04.583436 30155 slave.cpp:582] Agent hostname: 13a1d6e006cf
I0807 19:47:04.583631 30154 status_update_manager.cpp:177] Pausing sending status updates
I0807 19:47:04.585319 30156 state.cpp:64] Recovering state from '/tmp/Endpoint_SlaveEndpointTest_NoAuthorizer_2_Pnf9x3/meta'
I0807 19:47:04.585669 30173 status_update_manager.cpp:203] Recovering status update manager
I0807 19:47:04.585939 30161 containerizer.cpp:598] Recovering containerizer
I0807 19:47:04.587754 30160 provisioner.cpp:416] Provisioner recovery complete
I0807 19:47:04.588243 30176 slave.cpp:6207] Finished recovery
I0807 19:47:04.588834 30176 slave.cpp:6389] Querying resource estimator for oversubscribable
resources
I0807 19:47:04.589193 30172 slave.cpp:6403] Received oversubscribable resources {} from the
resource estimator
I0807 19:47:04.591770 30159 process.cpp:3933] Handling HTTP event for process 'slave(807)'
with path: '/slave(807)/containers'
I0807 19:47:04.593905 30173 http.cpp:1166] HTTP GET for /slave(807)/containers from 172.17.0.2:50008
I0807 19:47:04.593996 30173 http.cpp:957] Authorizing principal 'test-principal' to GET the
'/containers' endpoint
I0807 19:47:04.598444 30155 slave.cpp:843] Agent terminating
[       OK ] Endpoint/SlaveEndpointTest.NoAuthorizer/2 (37 ms)
[----------] 9 tests from Endpoint/SlaveEndpointTest (332 ms total)

[----------] 2 tests from ContainerizerType/DefaultContainerDNSFlagTest
[ RUN      ] ContainerizerType/DefaultContainerDNSFlagTest.ValidateFlag/0
[       OK ] ContainerizerType/DefaultContainerDNSFlagTest.ValidateFlag/0 (10 ms)
[ RUN      ] ContainerizerType/DefaultContainerDNSFlagTest.ValidateFlag/1
[       OK ] ContainerizerType/DefaultContainerDNSFlagTest.ValidateFlag/1 (9 ms)
[----------] 2 tests from ContainerizerType/DefaultContainerDNSFlagTest (20 ms total)

[----------] Global test environment tear-down
[==========] 1659 tests from 184 test cases ran. (728198 ms total)
[  PASSED  ] 1658 tests.
[  FAILED  ] 1 test, listed below:
[  FAILED  ] MasterTest.IgnoreOldAgentReregistration

 1 FAILED TEST
  YOU HAVE 20 DISABLED TESTS

I0807 19:47:04.687271 30177 process.cpp:1072] Failed to accept socket: future discarded
make[4]: *** [check-local] Error 1
make[4]: Leaving directory `/mesos/mesos-1.4.0/_build/src'
make[3]: *** [check-am] Error 2
make[3]: Leaving directory `/mesos/mesos-1.4.0/_build/src'
make[2]: *** [check] Error 2
make[2]: Leaving directory `/mesos/mesos-1.4.0/_build/src'
make[1]: *** [check-recursive] Error 1
make[1]: Leaving directory `/mesos/mesos-1.4.0/_build'
make: *** [distcheck] Error 1
+ docker rmi mesos-1502132190-13197
Untagged: mesos-1502132190-13197:latest
Deleted: sha256:cc9701116dbf57435283c37f9ec169764d33aa79fbfed10665a67c9205f436e5
Deleted: sha256:279ee17d3746f0947e826a4c27ff8d08be6f0ff90b5ecb53b07e901b157e2c70
Deleted: sha256:a3f419561aa717ea76e38480906dd23681755614f3e5fe1282c2688fadbc5081
Deleted: sha256:865fbdf143445595d68300af3b57cd8382bf43087af980cfc46dbde2f84bb896
Deleted: sha256:a3b5d5ae6f326f8cade6591a7cbeae860268284cdcb9a04b964e93462301ff2d
Deleted: sha256:377d18bf32a746817b076d271158b94d4c43d41dd2400332430c8e3cf14a0f47
Deleted: sha256:1351bc27ea904850e5adbbd0e4a4f9cceac0915d0afd064a38d0f0fa118f07a7
Deleted: sha256:f60f6a96b736424a8e5e04a9583b3a2e77936c74503316b77decf6f00151b391
Deleted: sha256:1df400bbbc1d3055550aca106e0e84a453fc4466fb3346ee71bc0ee7782b9591
Deleted: sha256:cf545663b0532e5112a6c000b4a894d3f87090d4840c214c4204354392ab8fbc
Deleted: sha256:de57fb9a754325918aef681103fd6d1423265e8e95b2db2e4e83370701c10bf7
Deleted: sha256:cf876a9fec24235d624ae99c4270305b4cc01a7b44e13db9853163a50c0ef563
Deleted: sha256:f879376f7590a56bfc7327749faa7c92861dd4bb82cc86eb611c1ba36a932a41
Deleted: sha256:940c3d367d1bc5aabe3e8ef600cf7048942ce8519f985d08e2c5418c18f254df
Deleted: sha256:4010df2a67aa34166a439f17280eee0e3fc74fc35b6536e7c50f6ad0a8ca561a
Deleted: sha256:6f1936338b5d014b7f0a72c08d5f9f0788abebb29f9aecc7ff50c92912830fc0
Deleted: sha256:c293650b1881dda2a2ced3b2e21cefcf7363367f11f5c5c7882e8494977a7a96
Deleted: sha256:879eeaf66979f718a99d16933312b910a0faa4094287530c153e4181eb144f37
Deleted: sha256:c9a7104da6316bb643c24ba87705971dd672364adcf92484a76ed2e761555225
Deleted: sha256:7f51801456a15e66fc3149761c83cf2b08aa122d107320ef45c65626497dadf5
Deleted: sha256:4a15cce1543e44a7a3863c0577d931960e018296a20eb8e38d7b36c06dec9020
Deleted: sha256:8285b4fb6eb40893edb69b5fdb904caeb0cc90547aec35efab74a84c5b7ddcfb
Deleted: sha256:67050701fa1396777317df13274075ac80630c1d3f3c4e7e0fc66e0a3d1bb372
Deleted: sha256:8ad5e8c42bc39a8e2fdcd1e25e3f9c10d51f07d5f8997570ba7d394d7813a2b5
Deleted: sha256:dd9680a90b4203ed9bae1303f92307aa81f64007cf7a266c03112c13e5f02f8e
Build step 'Execute shell' marked build as failure

Mime
View raw message