mesos-builds mailing list archives

Site index · List index
Message view « Date » · « Thread »
Top « Date » · « Thread »
From Apache Jenkins Server <jenk...@builds.apache.org>
Subject Build failed in Jenkins: Mesos-Buildbot » autotools,gcc,--verbose --enable-libevent --enable-ssl,GLOG_v=1 MESOS_VERBOSE=1,ubuntu:14.04,(ubuntu)&&(!ubuntu-us1)&&(!ubuntu-eu2) #4108
Date Tue, 15 Aug 2017 05:56:22 GMT
See <https://builds.apache.org/job/Mesos-Buildbot/BUILDTOOL=autotools,COMPILER=gcc,CONFIGURATION=--verbose%20--enable-libevent%20--enable-ssl,ENVIRONMENT=GLOG_v=1%20MESOS_VERBOSE=1,OS=ubuntu%3A14.04,label_exp=(ubuntu)&&(!ubuntu-us1)&&(!ubuntu-eu2)/4108/display/redirect?page=changes>

Changes:

[songzihao1990] Added container PID namespace control protobuf field in LinuxInfo.

[songzihao1990] Introduced `--disallow_sharing_agent_pid_namespace` agent flag.

[songzihao1990] Added pid ns sharing based on agent flag and protobuf message field.

[songzihao1990] Fixed a bug in the test `NamespacesIsolatorTest`.

[songzihao1990] Added a test `NamespacesIsolatorTest.ROOT_SharePidNamespace`.

[songzihao1990] Added test `NamespacesIsolatorTest.ROOT_SharePidNamespaceWhenDisallow`.

[songzihao1990] Added the test `ROOT_CGROUPS_LaunchNestedSharePidNamespace`.

[songzihao1990] Added a test `DefaultExecutorTest.ROOT_MultiTaskgroupSharePidNamespace`.

------------------------------------------
[...truncated 32.22 MB...]
I0815 05:56:15.462374 29753 slave.cpp:250] Mesos agent started on (806)@172.17.0.7:42084
I0815 05:56:15.462399 29753 slave.cpp:251] Flags at startup: --acls="" --appc_simple_discovery_uri_prefix="http://"
--appc_store_dir="/tmp/Endpoint_SlaveEndpointTest_UnauthorizedRequest_0_BkIXgV/store/appc"
--authenticate_http_executors="true" --authenticate_http_readonly="true" --authenticate_http_readwrite="true"
--authenticatee="crammd5" --authentication_backoff_factor="1secs" --authorizer="local" --cgroups_cpu_enable_pids_and_tids_count="false"
--cgroups_enable_cfs="false" --cgroups_hierarchy="/sys/fs/cgroup" --cgroups_limit_swap="false"
--cgroups_root="mesos" --container_disk_watch_interval="15secs" --containerizers="mesos" --credential="/tmp/Endpoint_SlaveEndpointTest_UnauthorizedRequest_0_BkIXgV/credential"
--default_role="*" --disallow_sharing_agent_pid_namespace="false" --disk_watch_interval="1mins"
--docker="docker" --docker_kill_orphans="true" --docker_registry="https://registry-1.docker.io"
--docker_remove_delay="6hrs" --docker_socket="/var/run/docker.sock" --docker_stop_timeout="0ns"
--docker_store_dir="/tmp/Endpoint_SlaveEndpointTest_UnauthorizedRequest_0_BkIXgV/store/docker"
--docker_volume_checkpoint_dir="/var/run/mesos/isolators/docker/volume" --enforce_container_disk_quota="false"
--executor_registration_timeout="1mins" --executor_reregistration_timeout="2secs" --executor_secret_key="/tmp/Endpoint_SlaveEndpointTest_UnauthorizedRequest_0_BkIXgV/executor_secret_key"
--executor_shutdown_grace_period="5secs" --fetcher_cache_dir="/tmp/Endpoint_SlaveEndpointTest_UnauthorizedRequest_0_BkIXgV/fetch"
--fetcher_cache_size="2GB" --frameworks_home="" --gc_delay="1weeks" --gc_disk_headroom="0.1"
--hadoop_home="" --help="false" --hostname_lookup="true" --http_command_executor="false" --http_credentials="/tmp/Endpoint_SlaveEndpointTest_UnauthorizedRequest_0_BkIXgV/http_credentials"
--http_heartbeat_interval="30secs" --initialize_driver_logging="true" --isolation="posix/cpu,posix/mem"
--launcher="posix" --launcher_dir="/mesos/mesos-1.4.0/_build/src" --logbufsecs="0" --logging_level="INFO"
--max_completed_executors_per_framework="150" --oversubscribed_resources_interval="15secs"
--perf_duration="10secs" --perf_interval="1mins" --port="5051" --qos_correction_interval_min="0ns"
--quiet="false" --recover="reconnect" --recovery_timeout="15mins" --registration_backoff_factor="10ms"
--resources="cpus:2;gpus:0;mem:1024;disk:1024;ports:[31000-32000]" --revocable_cpu_low_priority="true"
--runtime_dir="/tmp/Endpoint_SlaveEndpointTest_UnauthorizedRequest_0_BkIXgV" --sandbox_directory="/mnt/mesos/sandbox"
--strict="true" --switch_user="true" --systemd_enable_support="true" --systemd_runtime_directory="/run/systemd/system"
--version="false" --work_dir="/tmp/Endpoint_SlaveEndpointTest_UnauthorizedRequest_0_OS3dsV"
I0815 05:56:15.462846 29753 credentials.hpp:86] Loading credential for authentication from
'/tmp/Endpoint_SlaveEndpointTest_UnauthorizedRequest_0_BkIXgV/credential'
I0815 05:56:15.463006 29753 slave.cpp:283] Agent using credential for: test-principal
I0815 05:56:15.463028 29753 credentials.hpp:37] Loading credentials for authentication from
'/tmp/Endpoint_SlaveEndpointTest_UnauthorizedRequest_0_BkIXgV/http_credentials'
I0815 05:56:15.463307 29753 http.cpp:1026] Creating default 'basic' HTTP authenticator for
realm 'mesos-agent-executor'
I0815 05:56:15.463423 29753 http.cpp:1047] Creating default 'jwt' HTTP authenticator for realm
'mesos-agent-executor'
I0815 05:56:15.463640 29753 http.cpp:1026] Creating default 'basic' HTTP authenticator for
realm 'mesos-agent-readonly'
I0815 05:56:15.463742 29753 http.cpp:1047] Creating default 'jwt' HTTP authenticator for realm
'mesos-agent-readonly'
I0815 05:56:15.463923 29753 http.cpp:1026] Creating default 'basic' HTTP authenticator for
realm 'mesos-agent-readwrite'
I0815 05:56:15.464020 29753 http.cpp:1047] Creating default 'jwt' HTTP authenticator for realm
'mesos-agent-readwrite'
I0815 05:56:15.465394 29753 slave.cpp:565] Agent resources: [{"name":"cpus","scalar":{"value":2.0},"type":"SCALAR"},{"name":"mem","scalar":{"value":1024.0},"type":"SCALAR"},{"name":"disk","scalar":{"value":1024.0},"type":"SCALAR"},{"name":"ports","ranges":{"range":[{"begin":31000,"end":32000}]},"type":"RANGES"}]
I0815 05:56:15.465615 29753 slave.cpp:573] Agent attributes: [  ]
I0815 05:56:15.465628 29753 slave.cpp:582] Agent hostname: a7b23fc44719
I0815 05:56:15.465775 29743 status_update_manager.cpp:177] Pausing sending status updates
I0815 05:56:15.467139 29747 state.cpp:64] Recovering state from '/tmp/Endpoint_SlaveEndpointTest_UnauthorizedRequest_0_OS3dsV/meta'
I0815 05:56:15.467452 29745 status_update_manager.cpp:203] Recovering status update manager
I0815 05:56:15.467663 29744 containerizer.cpp:598] Recovering containerizer
I0815 05:56:15.469012 29748 provisioner.cpp:416] Provisioner recovery complete
I0815 05:56:15.469496 29757 slave.cpp:6210] Finished recovery
I0815 05:56:15.469939 29757 slave.cpp:6392] Querying resource estimator for oversubscribable
resources
I0815 05:56:15.470154 29758 slave.cpp:6406] Received oversubscribable resources {} from the
resource estimator
I0815 05:56:15.472532 29756 process.cpp:3933] Handling HTTP event for process 'slave(806)'
with path: '/slave(806)/monitor/statistics'
I0815 05:56:15.474570 29759 http.cpp:1166] HTTP GET for /slave(806)/monitor/statistics from
172.17.0.7:40712
I0815 05:56:15.474694 29759 http.cpp:957] Authorizing principal 'test-principal' to GET the
'/monitor/statistics' endpoint
I0815 05:56:15.477861 29757 slave.cpp:843] Agent terminating
[       OK ] Endpoint/SlaveEndpointTest.UnauthorizedRequest/0 (38 ms)
[ RUN      ] Endpoint/SlaveEndpointTest.UnauthorizedRequest/1
I0815 05:56:15.493736  8461 containerizer.cpp:246] Using isolation: posix/cpu,posix/mem,filesystem/posix,network/cni,environment_secret
W0815 05:56:15.494498  8461 backend.cpp:76] Failed to create 'aufs' backend: AufsBackend requires
root privileges
W0815 05:56:15.494669  8461 backend.cpp:76] Failed to create 'bind' backend: BindBackend requires
root privileges
I0815 05:56:15.494729  8461 provisioner.cpp:255] Using default backend 'copy'
I0815 05:56:15.499585 29749 slave.cpp:250] Mesos agent started on (807)@172.17.0.7:42084
I0815 05:56:15.499611 29749 slave.cpp:251] Flags at startup: --acls="" --appc_simple_discovery_uri_prefix="http://"
--appc_store_dir="/tmp/Endpoint_SlaveEndpointTest_UnauthorizedRequest_1_NkgjSU/store/appc"
--authenticate_http_executors="true" --authenticate_http_readonly="true" --authenticate_http_readwrite="true"
--authenticatee="crammd5" --authentication_backoff_factor="1secs" --authorizer="local" --cgroups_cpu_enable_pids_and_tids_count="false"
--cgroups_enable_cfs="false" --cgroups_hierarchy="/sys/fs/cgroup" --cgroups_limit_swap="false"
--cgroups_root="mesos" --container_disk_watch_interval="15secs" --containerizers="mesos" --credential="/tmp/Endpoint_SlaveEndpointTest_UnauthorizedRequest_1_NkgjSU/credential"
--default_role="*" --disallow_sharing_agent_pid_namespace="false" --disk_watch_interval="1mins"
--docker="docker" --docker_kill_orphans="true" --docker_registry="https://registry-1.docker.io"
--docker_remove_delay="6hrs" --docker_socket="/var/run/docker.sock" --docker_stop_timeout="0ns"
--docker_store_dir="/tmp/Endpoint_SlaveEndpointTest_UnauthorizedRequest_1_NkgjSU/store/docker"
--docker_volume_checkpoint_dir="/var/run/mesos/isolators/docker/volume" --enforce_container_disk_quota="false"
--executor_registration_timeout="1mins" --executor_reregistration_timeout="2secs" --executor_secret_key="/tmp/Endpoint_SlaveEndpointTest_UnauthorizedRequest_1_NkgjSU/executor_secret_key"
--executor_shutdown_grace_period="5secs" --fetcher_cache_dir="/tmp/Endpoint_SlaveEndpointTest_UnauthorizedRequest_1_NkgjSU/fetch"
--fetcher_cache_size="2GB" --frameworks_home="" --gc_delay="1weeks" --gc_disk_headroom="0.1"
--hadoop_home="" --help="false" --hostname_lookup="true" --http_command_executor="false" --http_credentials="/tmp/Endpoint_SlaveEndpointTest_UnauthorizedRequest_1_NkgjSU/http_credentials"
--http_heartbeat_interval="30secs" --initialize_driver_logging="true" --isolation="posix/cpu,posix/mem"
--launcher="posix" --launcher_dir="/mesos/mesos-1.4.0/_build/src" --logbufsecs="0" --logging_level="INFO"
--max_completed_executors_per_framework="150" --oversubscribed_resources_interval="15secs"
--perf_duration="10secs" --perf_interval="1mins" --port="5051" --qos_correction_interval_min="0ns"
--quiet="false" --recover="reconnect" --recovery_timeout="15mins" --registration_backoff_factor="10ms"
--resources="cpus:2;gpus:0;mem:1024;disk:1024;ports:[31000-32000]" --revocable_cpu_low_priority="true"
--runtime_dir="/tmp/Endpoint_SlaveEndpointTest_UnauthorizedRequest_1_NkgjSU" --sandbox_directory="/mnt/mesos/sandbox"
--strict="true" --switch_user="true" --systemd_enable_support="true" --systemd_runtime_directory="/run/systemd/system"
--version="false" --work_dir="/tmp/Endpoint_SlaveEndpointTest_UnauthorizedRequest_1_sXqCXU"
I0815 05:56:15.500039 29749 credentials.hpp:86] Loading credential for authentication from
'/tmp/Endpoint_SlaveEndpointTest_UnauthorizedRequest_1_NkgjSU/credential'
I0815 05:56:15.500195 29749 slave.cpp:283] Agent using credential for: test-principal
I0815 05:56:15.500216 29749 credentials.hpp:37] Loading credentials for authentication from
'/tmp/Endpoint_SlaveEndpointTest_UnauthorizedRequest_1_NkgjSU/http_credentials'
I0815 05:56:15.500555 29749 http.cpp:1026] Creating default 'basic' HTTP authenticator for
realm 'mesos-agent-executor'
I0815 05:56:15.500705 29749 http.cpp:1047] Creating default 'jwt' HTTP authenticator for realm
'mesos-agent-executor'
I0815 05:56:15.500934 29749 http.cpp:1026] Creating default 'basic' HTTP authenticator for
realm 'mesos-agent-readonly'
I0815 05:56:15.501076 29749 http.cpp:1047] Creating default 'jwt' HTTP authenticator for realm
'mesos-agent-readonly'
I0815 05:56:15.501277 29749 http.cpp:1026] Creating default 'basic' HTTP authenticator for
realm 'mesos-agent-readwrite'
I0815 05:56:15.501386 29749 http.cpp:1047] Creating default 'jwt' HTTP authenticator for realm
'mesos-agent-readwrite'
I0815 05:56:15.502837 29749 slave.cpp:565] Agent resources: [{"name":"cpus","scalar":{"value":2.0},"type":"SCALAR"},{"name":"mem","scalar":{"value":1024.0},"type":"SCALAR"},{"name":"disk","scalar":{"value":1024.0},"type":"SCALAR"},{"name":"ports","ranges":{"range":[{"begin":31000,"end":32000}]},"type":"RANGES"}]
I0815 05:56:15.503075 29749 slave.cpp:573] Agent attributes: [  ]
I0815 05:56:15.503090 29749 slave.cpp:582] Agent hostname: a7b23fc44719
I0815 05:56:15.503253 29764 status_update_manager.cpp:177] Pausing sending status updates
I0815 05:56:15.504837 29745 state.cpp:64] Recovering state from '/tmp/Endpoint_SlaveEndpointTest_UnauthorizedRequest_1_sXqCXU/meta'
I0815 05:56:15.505134 29757 status_update_manager.cpp:203] Recovering status update manager
I0815 05:56:15.505401 29752 containerizer.cpp:598] Recovering containerizer
I0815 05:56:15.507213 29756 provisioner.cpp:416] Provisioner recovery complete
I0815 05:56:15.507697 29756 slave.cpp:6210] Finished recovery
I0815 05:56:15.508090 29756 slave.cpp:6392] Querying resource estimator for oversubscribable
resources
I0815 05:56:15.508347 29758 slave.cpp:6406] Received oversubscribable resources {} from the
resource estimator
I0815 05:56:15.510721 29764 process.cpp:3933] Handling HTTP event for process 'slave(807)'
with path: '/slave(807)/monitor/statistics.json'
I0815 05:56:15.513231 29750 http.cpp:1166] HTTP GET for /slave(807)/monitor/statistics.json
from 172.17.0.7:40714
I0815 05:56:15.513310 29750 http.cpp:957] Authorizing principal 'test-principal' to GET the
'/monitor/statistics.json' endpoint
I0815 05:56:15.515780  8461 slave.cpp:843] Agent terminating
[       OK ] Endpoint/SlaveEndpointTest.UnauthorizedRequest/1 (38 ms)
[ RUN      ] Endpoint/SlaveEndpointTest.UnauthorizedRequest/2
I0815 05:56:15.530046  8461 containerizer.cpp:246] Using isolation: posix/cpu,posix/mem,filesystem/posix,network/cni,environment_secret
W0815 05:56:15.530637  8461 backend.cpp:76] Failed to create 'aufs' backend: AufsBackend requires
root privileges
W0815 05:56:15.530761  8461 backend.cpp:76] Failed to create 'bind' backend: BindBackend requires
root privileges
I0815 05:56:15.530797  8461 provisioner.cpp:255] Using default backend 'copy'
I0815 05:56:15.534881 29762 slave.cpp:250] Mesos agent started on (808)@172.17.0.7:42084
I0815 05:56:15.534905 29762 slave.cpp:251] Flags at startup: --acls="" --appc_simple_discovery_uri_prefix="http://"
--appc_store_dir="/tmp/Endpoint_SlaveEndpointTest_UnauthorizedRequest_2_1eZbQU/store/appc"
--authenticate_http_executors="true" --authenticate_http_readonly="true" --authenticate_http_readwrite="true"
--authenticatee="crammd5" --authentication_backoff_factor="1secs" --authorizer="local" --cgroups_cpu_enable_pids_and_tids_count="false"
--cgroups_enable_cfs="false" --cgroups_hierarchy="/sys/fs/cgroup" --cgroups_limit_swap="false"
--cgroups_root="mesos" --container_disk_watch_interval="15secs" --containerizers="mesos" --credential="/tmp/Endpoint_SlaveEndpointTest_UnauthorizedRequest_2_1eZbQU/credential"
--default_role="*" --disallow_sharing_agent_pid_namespace="false" --disk_watch_interval="1mins"
--docker="docker" --docker_kill_orphans="true" --docker_registry="https://registry-1.docker.io"
--docker_remove_delay="6hrs" --docker_socket="/var/run/docker.sock" --docker_stop_timeout="0ns"
--docker_store_dir="/tmp/Endpoint_SlaveEndpointTest_UnauthorizedRequest_2_1eZbQU/store/docker"
--docker_volume_checkpoint_dir="/var/run/mesos/isolators/docker/volume" --enforce_container_disk_quota="false"
--executor_registration_timeout="1mins" --executor_reregistration_timeout="2secs" --executor_secret_key="/tmp/Endpoint_SlaveEndpointTest_UnauthorizedRequest_2_1eZbQU/executor_secret_key"
--executor_shutdown_grace_period="5secs" --fetcher_cache_dir="/tmp/Endpoint_SlaveEndpointTest_UnauthorizedRequest_2_1eZbQU/fetch"
--fetcher_cache_size="2GB" --frameworks_home="" --gc_delay="1weeks" --gc_disk_headroom="0.1"
--hadoop_home="" --help="false" --hostname_lookup="true" --http_command_executor="false" --http_credentials="/tmp/Endpoint_SlaveEndpointTest_UnauthorizedRequest_2_1eZbQU/http_credentials"
--http_heartbeat_interval="30secs" --initialize_driver_logging="true" --isolation="posix/cpu,posix/mem"
--launcher="posix" --launcher_dir="/mesos/mesos-1.4.0/_build/src" --logbufsecs="0" --logging_level="INFO"
--max_completed_executors_per_framework="150" --oversubscribed_resources_interval="15secs"
--perf_duration="10secs" --perf_interval="1mins" --port="5051" --qos_correction_interval_min="0ns"
--quiet="false" --recover="reconnect" --recovery_timeout="15mins" --registration_backoff_factor="10ms"
--resources="cpus:2;gpus:0;mem:1024;disk:1024;ports:[31000-32000]" --revocable_cpu_low_priority="true"
--runtime_dir="/tmp/Endpoint_SlaveEndpointTest_UnauthorizedRequest_2_1eZbQU" --sandbox_directory="/mnt/mesos/sandbox"
--strict="true" --switch_user="true" --systemd_enable_support="true" --systemd_runtime_directory="/run/systemd/system"
--version="false" --work_dir="/tmp/Endpoint_SlaveEndpointTest_UnauthorizedRequest_2_GKSVPU"
I0815 05:56:15.535336 29762 credentials.hpp:86] Loading credential for authentication from
'/tmp/Endpoint_SlaveEndpointTest_UnauthorizedRequest_2_1eZbQU/credential'
I0815 05:56:15.535485 29762 slave.cpp:283] Agent using credential for: test-principal
I0815 05:56:15.535507 29762 credentials.hpp:37] Loading credentials for authentication from
'/tmp/Endpoint_SlaveEndpointTest_UnauthorizedRequest_2_1eZbQU/http_credentials'
I0815 05:56:15.535795 29762 http.cpp:1026] Creating default 'basic' HTTP authenticator for
realm 'mesos-agent-executor'
I0815 05:56:15.535925 29762 http.cpp:1047] Creating default 'jwt' HTTP authenticator for realm
'mesos-agent-executor'
I0815 05:56:15.536149 29762 http.cpp:1026] Creating default 'basic' HTTP authenticator for
realm 'mesos-agent-readonly'
I0815 05:56:15.536245 29762 http.cpp:1047] Creating default 'jwt' HTTP authenticator for realm
'mesos-agent-readonly'
I0815 05:56:15.536424 29762 http.cpp:1026] Creating default 'basic' HTTP authenticator for
realm 'mesos-agent-readwrite'
I0815 05:56:15.536525 29762 http.cpp:1047] Creating default 'jwt' HTTP authenticator for realm
'mesos-agent-readwrite'
I0815 05:56:15.538658 29762 slave.cpp:565] Agent resources: [{"name":"cpus","scalar":{"value":2.0},"type":"SCALAR"},{"name":"mem","scalar":{"value":1024.0},"type":"SCALAR"},{"name":"disk","scalar":{"value":1024.0},"type":"SCALAR"},{"name":"ports","ranges":{"range":[{"begin":31000,"end":32000}]},"type":"RANGES"}]
I0815 05:56:15.539050 29762 slave.cpp:573] Agent attributes: [  ]
I0815 05:56:15.539074 29762 slave.cpp:582] Agent hostname: a7b23fc44719
I0815 05:56:15.539227 29759 status_update_manager.cpp:177] Pausing sending status updates
I0815 05:56:15.541082 29765 state.cpp:64] Recovering state from '/tmp/Endpoint_SlaveEndpointTest_UnauthorizedRequest_2_GKSVPU/meta'
I0815 05:56:15.541517 29751 status_update_manager.cpp:203] Recovering status update manager
I0815 05:56:15.541774 29752 containerizer.cpp:598] Recovering containerizer
I0815 05:56:15.543527 29748 provisioner.cpp:416] Provisioner recovery complete
I0815 05:56:15.543977 29763 slave.cpp:6210] Finished recovery
I0815 05:56:15.544416 29763 slave.cpp:6392] Querying resource estimator for oversubscribable
resources
I0815 05:56:15.544675 29755 slave.cpp:6406] Received oversubscribable resources {} from the
resource estimator
I0815 05:56:15.546726 29759 process.cpp:3933] Handling HTTP event for process 'slave(808)'
with path: '/slave(808)/containers'
I0815 05:56:15.548939 29757 http.cpp:1166] HTTP GET for /slave(808)/containers from 172.17.0.7:40716
I0815 05:56:15.549065 29757 http.cpp:957] Authorizing principal 'test-principal' to GET the
'/containers' endpoint
I0815 05:56:15.551625  8461 slave.cpp:843] Agent terminating
[       OK ] Endpoint/SlaveEndpointTest.UnauthorizedRequest/2 (33 ms)
[ RUN      ] Endpoint/SlaveEndpointTest.NoAuthorizer/0
I0815 05:56:15.563896  8461 containerizer.cpp:246] Using isolation: posix/cpu,posix/mem,filesystem/posix,network/cni,environment_secret
W0815 05:56:15.564421  8461 backend.cpp:76] Failed to create 'aufs' backend: AufsBackend requires
root privileges
W0815 05:56:15.564529  8461 backend.cpp:76] Failed to create 'bind' backend: BindBackend requires
root privileges
I0815 05:56:15.564563  8461 provisioner.cpp:255] Using default backend 'copy'
I0815 05:56:15.566809  8461 cluster.cpp:448] Creating default 'local' authorizer
I0815 05:56:15.568843 29745 slave.cpp:250] Mesos agent started on (809)@172.17.0.7:42084
I0815 05:56:15.568873 29745 slave.cpp:251] Flags at startup: --acls="" --appc_simple_discovery_uri_prefix="http://"
--appc_store_dir="/tmp/Endpoint_SlaveEndpointTest_NoAuthorizer_0_fyZF8U/store/appc" --authenticate_http_executors="true"
--authenticate_http_readonly="true" --authenticate_http_readwrite="true" --authenticatee="crammd5"
--authentication_backoff_factor="1secs" --authorizer="local" --cgroups_cpu_enable_pids_and_tids_count="false"
--cgroups_enable_cfs="false" --cgroups_hierarchy="/sys/fs/cgroup" --cgroups_limit_swap="false"
--cgroups_root="mesos" --container_disk_watch_interval="15secs" --containerizers="mesos" --credential="/tmp/Endpoint_SlaveEndpointTest_NoAuthorizer_0_fyZF8U/credential"
--default_role="*" --disallow_sharing_agent_pid_namespace="false" --disk_watch_interval="1mins"
--docker="docker" --docker_kill_orphans="true" --docker_registry="https://registry-1.docker.io"
--docker_remove_delay="6hrs" --docker_socket="/var/run/docker.sock" --docker_stop_timeout="0ns"
--docker_store_dir="/tmp/Endpoint_SlaveEndpointTest_NoAuthorizer_0_fyZF8U/store/docker" --docker_volume_checkpoint_dir="/var/run/mesos/isolators/docker/volume"
--enforce_container_disk_quota="false" --executor_registration_timeout="1mins" --executor_reregistration_timeout="2secs"
--executor_secret_key="/tmp/Endpoint_SlaveEndpointTest_NoAuthorizer_0_fyZF8U/executor_secret_key"
--executor_shutdown_grace_period="5secs" --fetcher_cache_dir="/tmp/Endpoint_SlaveEndpointTest_NoAuthorizer_0_fyZF8U/fetch"
--fetcher_cache_size="2GB" --frameworks_home="" --gc_delay="1weeks" --gc_disk_headroom="0.1"
--hadoop_home="" --help="false" --hostname_lookup="true" --http_command_executor="false" --http_credentials="/tmp/Endpoint_SlaveEndpointTest_NoAuthorizer_0_fyZF8U/http_credentials"
--http_heartbeat_interval="30secs" --initialize_driver_logging="true" --isolation="posix/cpu,posix/mem"
--launcher="posix" --launcher_dir="/mesos/mesos-1.4.0/_build/src" --logbufsecs="0" --logging_level="INFO"
--max_completed_executors_per_framework="150" --oversubscribed_resources_interval="15secs"
--perf_duration="10secs" --perf_interval="1mins" --port="5051" --qos_correction_interval_min="0ns"
--quiet="false" --recover="reconnect" --recovery_timeout="15mins" --registration_backoff_factor="10ms"
--resources="cpus:2;gpus:0;mem:1024;disk:1024;ports:[31000-32000]" --revocable_cpu_low_priority="true"
--runtime_dir="/tmp/Endpoint_SlaveEndpointTest_NoAuthorizer_0_fyZF8U" --sandbox_directory="/mnt/mesos/sandbox"
--strict="true" --switch_user="true" --systemd_enable_support="true" --systemd_runtime_directory="/run/systemd/system"
--version="false" --work_dir="/tmp/Endpoint_SlaveEndpointTest_NoAuthorizer_0_o2rm3U"
I0815 05:56:15.569308 29745 credentials.hpp:86] Loading credential for authentication from
'/tmp/Endpoint_SlaveEndpointTest_NoAuthorizer_0_fyZF8U/credential'
I0815 05:56:15.569479 29745 slave.cpp:283] Agent using credential for: test-principal
I0815 05:56:15.569502 29745 credentials.hpp:37] Loading credentials for authentication from
'/tmp/Endpoint_SlaveEndpointTest_NoAuthorizer_0_fyZF8U/http_credentials'
I0815 05:56:15.569841 29745 http.cpp:1026] Creating default 'basic' HTTP authenticator for
realm 'mesos-agent-executor'
I0815 05:56:15.569985 29745 http.cpp:1047] Creating default 'jwt' HTTP authenticator for realm
'mesos-agent-executor'
I0815 05:56:15.570228 29745 http.cpp:1026] Creating default 'basic' HTTP authenticator for
realm 'mesos-agent-readonly'
I0815 05:56:15.570348 29745 http.cpp:1047] Creating default 'jwt' HTTP authenticator for realm
'mesos-agent-readonly'
I0815 05:56:15.570612 29745 http.cpp:1026] Creating default 'basic' HTTP authenticator for
realm 'mesos-agent-readwrite'
I0815 05:56:15.570741 29745 http.cpp:1047] Creating default 'jwt' HTTP authenticator for realm
'mesos-agent-readwrite'
I0815 05:56:15.572324 29745 slave.cpp:565] Agent resources: [{"name":"cpus","scalar":{"value":2.0},"type":"SCALAR"},{"name":"mem","scalar":{"value":1024.0},"type":"SCALAR"},{"name":"disk","scalar":{"value":1024.0},"type":"SCALAR"},{"name":"ports","ranges":{"range":[{"begin":31000,"end":32000}]},"type":"RANGES"}]
I0815 05:56:15.572576 29745 slave.cpp:573] Agent attributes: [  ]
I0815 05:56:15.572589 29745 slave.cpp:582] Agent hostname: a7b23fc44719
I0815 05:56:15.572767 29764 status_update_manager.cpp:177] Pausing sending status updates
I0815 05:56:15.574350 29763 state.cpp:64] Recovering state from '/tmp/Endpoint_SlaveEndpointTest_NoAuthorizer_0_o2rm3U/meta'
I0815 05:56:15.574708 29752 status_update_manager.cpp:203] Recovering status update manager
I0815 05:56:15.575103 29757 containerizer.cpp:598] Recovering containerizer
I0815 05:56:15.576968 29748 provisioner.cpp:416] Provisioner recovery complete
I0815 05:56:15.577541 29744 slave.cpp:6210] Finished recovery
I0815 05:56:15.578001 29744 slave.cpp:6392] Querying resource estimator for oversubscribable
resources
I0815 05:56:15.578328 29747 slave.cpp:6406] Received oversubscribable resources {} from the
resource estimator
I0815 05:56:15.580863 29759 process.cpp:3933] Handling HTTP event for process 'slave(809)'
with path: '/slave(809)/monitor/statistics'
I0815 05:56:15.583238 29752 http.cpp:1166] HTTP GET for /slave(809)/monitor/statistics from
172.17.0.7:40718
I0815 05:56:15.583360 29752 http.cpp:957] Authorizing principal 'test-principal' to GET the
'/monitor/statistics' endpoint
I0815 05:56:15.587749  8461 slave.cpp:843] Agent terminating
[       OK ] Endpoint/SlaveEndpointTest.NoAuthorizer/0 (36 ms)
[ RUN      ] Endpoint/SlaveEndpointTest.NoAuthorizer/1
I0815 05:56:15.600395  8461 containerizer.cpp:246] Using isolation: posix/cpu,posix/mem,filesystem/posix,network/cni,environment_secret
W0815 05:56:15.600910  8461 backend.cpp:76] Failed to create 'aufs' backend: AufsBackend requires
root privileges
W0815 05:56:15.601024  8461 backend.cpp:76] Failed to create 'bind' backend: BindBackend requires
root privileges
I0815 05:56:15.601065  8461 provisioner.cpp:255] Using default backend 'copy'
I0815 05:56:15.603155  8461 cluster.cpp:448] Creating default 'local' authorizer
I0815 05:56:15.605208 29757 slave.cpp:250] Mesos agent started on (810)@172.17.0.7:42084
I0815 05:56:15.605238 29757 slave.cpp:251] Flags at startup: --acls="" --appc_simple_discovery_uri_prefix="http://"
--appc_store_dir="/tmp/Endpoint_SlaveEndpointTest_NoAuthorizer_1_NstqMV/store/appc" --authenticate_http_executors="true"
--authenticate_http_readonly="true" --authenticate_http_readwrite="true" --authenticatee="crammd5"
--authentication_backoff_factor="1secs" --authorizer="local" --cgroups_cpu_enable_pids_and_tids_count="false"
--cgroups_enable_cfs="false" --cgroups_hierarchy="/sys/fs/cgroup" --cgroups_limit_swap="false"
--cgroups_root="mesos" --container_disk_watch_interval="15secs" --containerizers="mesos" --credential="/tmp/Endpoint_SlaveEndpointTest_NoAuthorizer_1_NstqMV/credential"
--default_role="*" --disallow_sharing_agent_pid_namespace="false" --disk_watch_interval="1mins"
--docker="docker" --docker_kill_orphans="true" --docker_registry="https://registry-1.docker.io"
--docker_remove_delay="6hrs" --docker_socket="/var/run/docker.sock" --docker_stop_timeout="0ns"
--docker_store_dir="/tmp/Endpoint_SlaveEndpointTest_NoAuthorizer_1_NstqMV/store/docker" --docker_volume_checkpoint_dir="/var/run/mesos/isolators/docker/volume"
--enforce_container_disk_quota="false" --executor_registration_timeout="1mins" --executor_reregistration_timeout="2secs"
--executor_secret_key="/tmp/Endpoint_SlaveEndpointTest_NoAuthorizer_1_NstqMV/executor_secret_key"
--executor_shutdown_grace_period="5secs" --fetcher_cache_dir="/tmp/Endpoint_SlaveEndpointTest_NoAuthorizer_1_NstqMV/fetch"
--fetcher_cache_size="2GB" --frameworks_home="" --gc_delay="1weeks" --gc_disk_headroom="0.1"
--hadoop_home="" --help="false" --hostname_lookup="true" --http_command_executor="false" --http_credentials="/tmp/Endpoint_SlaveEndpointTest_NoAuthorizer_1_NstqMV/http_credentials"
--http_heartbeat_interval="30secs" --initialize_driver_logging="true" --isolation="posix/cpu,posix/mem"
--launcher="posix" --launcher_dir="/mesos/mesos-1.4.0/_build/src" --logbufsecs="0" --logging_level="INFO"
--max_completed_executors_per_framework="150" --oversubscribed_resources_interval="15secs"
--perf_duration="10secs" --perf_interval="1mins" --port="5051" --qos_correction_interval_min="0ns"
--quiet="false" --recover="reconnect" --recovery_timeout="15mins" --registration_backoff_factor="10ms"
--resources="cpus:2;gpus:0;mem:1024;disk:1024;ports:[31000-32000]" --revocable_cpu_low_priority="true"
--runtime_dir="/tmp/Endpoint_SlaveEndpointTest_NoAuthorizer_1_NstqMV" --sandbox_directory="/mnt/mesos/sandbox"
--strict="true" --switch_user="true" --systemd_enable_support="true" --systemd_runtime_directory="/run/systemd/system"
--version="false" --work_dir="/tmp/Endpoint_SlaveEndpointTest_NoAuthorizer_1_wdnGBV"
I0815 05:56:15.605590 29757 credentials.hpp:86] Loading credential for authentication from
'/tmp/Endpoint_SlaveEndpointTest_NoAuthorizer_1_NstqMV/credential'
I0815 05:56:15.605733 29757 slave.cpp:283] Agent using credential for: test-principal
I0815 05:56:15.605757 29757 credentials.hpp:37] Loading credentials for authentication from
'/tmp/Endpoint_SlaveEndpointTest_NoAuthorizer_1_NstqMV/http_credentials'
I0815 05:56:15.606019 29757 http.cpp:1026] Creating default 'basic' HTTP authenticator for
realm 'mesos-agent-executor'
I0815 05:56:15.606140 29757 http.cpp:1047] Creating default 'jwt' HTTP authenticator for realm
'mesos-agent-executor'
I0815 05:56:15.606336 29757 http.cpp:1026] Creating default 'basic' HTTP authenticator for
realm 'mesos-agent-readonly'
I0815 05:56:15.606437 29757 http.cpp:1047] Creating default 'jwt' HTTP authenticator for realm
'mesos-agent-readonly'
I0815 05:56:15.606619 29757 http.cpp:1026] Creating default 'basic' HTTP authenticator for
realm 'mesos-agent-readwrite'
I0815 05:56:15.606720 29757 http.cpp:1047] Creating default 'jwt' HTTP authenticator for realm
'mesos-agent-readwrite'
I0815 05:56:15.608108 29757 slave.cpp:565] Agent resources: [{"name":"cpus","scalar":{"value":2.0},"type":"SCALAR"},{"name":"mem","scalar":{"value":1024.0},"type":"SCALAR"},{"name":"disk","scalar":{"value":1024.0},"type":"SCALAR"},{"name":"ports","ranges":{"range":[{"begin":31000,"end":32000}]},"type":"RANGES"}]
I0815 05:56:15.608332 29757 slave.cpp:573] Agent attributes: [  ]
I0815 05:56:15.608347 29757 slave.cpp:582] Agent hostname: a7b23fc44719
I0815 05:56:15.608505 29762 status_update_manager.cpp:177] Pausing sending status updates
I0815 05:56:15.610010 29756 state.cpp:64] Recovering state from '/tmp/Endpoint_SlaveEndpointTest_NoAuthorizer_1_wdnGBV/meta'
I0815 05:56:15.610505 29751 status_update_manager.cpp:203] Recovering status update manager
I0815 05:56:15.610721 29751 containerizer.cpp:598] Recovering containerizer
I0815 05:56:15.612495 29752 provisioner.cpp:416] Provisioner recovery complete
I0815 05:56:15.612947 29753 slave.cpp:6210] Finished recovery
I0815 05:56:15.613411 29753 slave.cpp:6392] Querying resource estimator for oversubscribable
resources
I0815 05:56:15.613651 29764 slave.cpp:6406] Received oversubscribable resources {} from the
resource estimator
I0815 05:56:15.615592 29754 process.cpp:3933] Handling HTTP event for process 'slave(810)'
with path: '/slave(810)/monitor/statistics.json'
I0815 05:56:15.617709 29744 http.cpp:1166] HTTP GET for /slave(810)/monitor/statistics.json
from 172.17.0.7:40720
I0815 05:56:15.617800 29744 http.cpp:957] Authorizing principal 'test-principal' to GET the
'/monitor/statistics.json' endpoint
I0815 05:56:15.621337  8461 slave.cpp:843] Agent terminating
[       OK ] Endpoint/SlaveEndpointTest.NoAuthorizer/1 (34 ms)
[ RUN      ] Endpoint/SlaveEndpointTest.NoAuthorizer/2
I0815 05:56:15.636996  8461 containerizer.cpp:246] Using isolation: posix/cpu,posix/mem,filesystem/posix,network/cni,environment_secret
W0815 05:56:15.637666  8461 backend.cpp:76] Failed to create 'aufs' backend: AufsBackend requires
root privileges
W0815 05:56:15.637820  8461 backend.cpp:76] Failed to create 'bind' backend: BindBackend requires
root privileges
I0815 05:56:15.637850  8461 provisioner.cpp:255] Using default backend 'copy'
I0815 05:56:15.639580  8461 cluster.cpp:448] Creating default 'local' authorizer
I0815 05:56:15.641366 29745 slave.cpp:250] Mesos agent started on (811)@172.17.0.7:42084
I0815 05:56:15.641393 29745 slave.cpp:251] Flags at startup: --acls="" --appc_simple_discovery_uri_prefix="http://"
--appc_store_dir="/tmp/Endpoint_SlaveEndpointTest_NoAuthorizer_2_zgt2KW/store/appc" --authenticate_http_executors="true"
--authenticate_http_readonly="true" --authenticate_http_readwrite="true" --authenticatee="crammd5"
--authentication_backoff_factor="1secs" --authorizer="local" --cgroups_cpu_enable_pids_and_tids_count="false"
--cgroups_enable_cfs="false" --cgroups_hierarchy="/sys/fs/cgroup" --cgroups_limit_swap="false"
--cgroups_root="mesos" --container_disk_watch_interval="15secs" --containerizers="mesos" --credential="/tmp/Endpoint_SlaveEndpointTest_NoAuthorizer_2_zgt2KW/credential"
--default_role="*" --disallow_sharing_agent_pid_namespace="false" --disk_watch_interval="1mins"
--docker="docker" --docker_kill_orphans="true" --docker_registry="https://registry-1.docker.io"
--docker_remove_delay="6hrs" --docker_socket="/var/run/docker.sock" --docker_stop_timeout="0ns"
--docker_store_dir="/tmp/Endpoint_SlaveEndpointTest_NoAuthorizer_2_zgt2KW/store/docker" --docker_volume_checkpoint_dir="/var/run/mesos/isolators/docker/volume"
--enforce_container_disk_quota="false" --executor_registration_timeout="1mins" --executor_reregistration_timeout="2secs"
--executor_secret_key="/tmp/Endpoint_SlaveEndpointTest_NoAuthorizer_2_zgt2KW/executor_secret_key"
--executor_shutdown_grace_period="5secs" --fetcher_cache_dir="/tmp/Endpoint_SlaveEndpointTest_NoAuthorizer_2_zgt2KW/fetch"
--fetcher_cache_size="2GB" --frameworks_home="" --gc_delay="1weeks" --gc_disk_headroom="0.1"
--hadoop_home="" --help="false" --hostname_lookup="true" --http_command_executor="false" --http_credentials="/tmp/Endpoint_SlaveEndpointTest_NoAuthorizer_2_zgt2KW/http_credentials"
--http_heartbeat_interval="30secs" --initialize_driver_logging="true" --isolation="posix/cpu,posix/mem"
--launcher="posix" --launcher_dir="/mesos/mesos-1.4.0/_build/src" --logbufsecs="0" --logging_level="INFO"
--max_completed_executors_per_framework="150" --oversubscribed_resources_interval="15secs"
--perf_duration="10secs" --perf_interval="1mins" --port="5051" --qos_correction_interval_min="0ns"
--quiet="false" --recover="reconnect" --recovery_timeout="15mins" --registration_backoff_factor="10ms"
--resources="cpus:2;gpus:0;mem:1024;disk:1024;ports:[31000-32000]" --revocable_cpu_low_priority="true"
--runtime_dir="/tmp/Endpoint_SlaveEndpointTest_NoAuthorizer_2_zgt2KW" --sandbox_directory="/mnt/mesos/sandbox"
--strict="true" --switch_user="true" --systemd_enable_support="true" --systemd_runtime_directory="/run/systemd/system"
--version="false" --work_dir="/tmp/Endpoint_SlaveEndpointTest_NoAuthorizer_2_qUX3uW"
I0815 05:56:15.641722 29745 credentials.hpp:86] Loading credential for authentication from
'/tmp/Endpoint_SlaveEndpointTest_NoAuthorizer_2_zgt2KW/credential'
I0815 05:56:15.641858 29745 slave.cpp:283] Agent using credential for: test-principal
I0815 05:56:15.641880 29745 credentials.hpp:37] Loading credentials for authentication from
'/tmp/Endpoint_SlaveEndpointTest_NoAuthorizer_2_zgt2KW/http_credentials'
I0815 05:56:15.642134 29745 http.cpp:1026] Creating default 'basic' HTTP authenticator for
realm 'mesos-agent-executor'
I0815 05:56:15.642246 29745 http.cpp:1047] Creating default 'jwt' HTTP authenticator for realm
'mesos-agent-executor'
I0815 05:56:15.642483 29745 http.cpp:1026] Creating default 'basic' HTTP authenticator for
realm 'mesos-agent-readonly'
I0815 05:56:15.642591 29745 http.cpp:1047] Creating default 'jwt' HTTP authenticator for realm
'mesos-agent-readonly'
I0815 05:56:15.642772 29745 http.cpp:1026] Creating default 'basic' HTTP authenticator for
realm 'mesos-agent-readwrite'
I0815 05:56:15.642868 29745 http.cpp:1047] Creating default 'jwt' HTTP authenticator for realm
'mesos-agent-readwrite'
I0815 05:56:15.644261 29745 slave.cpp:565] Agent resources: [{"name":"cpus","scalar":{"value":2.0},"type":"SCALAR"},{"name":"mem","scalar":{"value":1024.0},"type":"SCALAR"},{"name":"disk","scalar":{"value":1024.0},"type":"SCALAR"},{"name":"ports","ranges":{"range":[{"begin":31000,"end":32000}]},"type":"RANGES"}]
I0815 05:56:15.644493 29745 slave.cpp:573] Agent attributes: [  ]
I0815 05:56:15.644520 29745 slave.cpp:582] Agent hostname: a7b23fc44719
I0815 05:56:15.644673 29759 status_update_manager.cpp:177] Pausing sending status updates
I0815 05:56:15.646071 29764 state.cpp:64] Recovering state from '/tmp/Endpoint_SlaveEndpointTest_NoAuthorizer_2_qUX3uW/meta'
I0815 05:56:15.646541 29746 status_update_manager.cpp:203] Recovering status update manager
I0815 05:56:15.646775 29758 containerizer.cpp:598] Recovering containerizer
I0815 05:56:15.648329 29759 provisioner.cpp:416] Provisioner recovery complete
I0815 05:56:15.648706 29747 slave.cpp:6210] Finished recovery
I0815 05:56:15.649147 29747 slave.cpp:6392] Querying resource estimator for oversubscribable
resources
I0815 05:56:15.649444 29762 slave.cpp:6406] Received oversubscribable resources {} from the
resource estimator
I0815 05:56:15.651589 29760 process.cpp:3933] Handling HTTP event for process 'slave(811)'
with path: '/slave(811)/containers'
I0815 05:56:15.653815 29761 http.cpp:1166] HTTP GET for /slave(811)/containers from 172.17.0.7:40722
I0815 05:56:15.653899 29761 http.cpp:957] Authorizing principal 'test-principal' to GET the
'/containers' endpoint
I0815 05:56:15.658252 29755 slave.cpp:843] Agent terminating
[       OK ] Endpoint/SlaveEndpointTest.NoAuthorizer/2 (35 ms)
[----------] 9 tests from Endpoint/SlaveEndpointTest (338 ms total)

[----------] 2 tests from ContainerizerType/DefaultContainerDNSFlagTest
[ RUN      ] ContainerizerType/DefaultContainerDNSFlagTest.ValidateFlag/0
[       OK ] ContainerizerType/DefaultContainerDNSFlagTest.ValidateFlag/0 (9 ms)
[ RUN      ] ContainerizerType/DefaultContainerDNSFlagTest.ValidateFlag/1
[       OK ] ContainerizerType/DefaultContainerDNSFlagTest.ValidateFlag/1 (9 ms)
[----------] 2 tests from ContainerizerType/DefaultContainerDNSFlagTest (18 ms total)

[----------] Global test environment tear-down
[==========] 1663 tests from 184 test cases ran. (648193 ms total)
[  PASSED  ] 1659 tests.
[  FAILED  ] 4 tests, listed below:
[  FAILED  ] DefaultExecutorCheckTest.CommandCheckDeliveredAndReconciled
[  FAILED  ] DefaultExecutorCheckTest.CommandCheckStatusChange
[  FAILED  ] DefaultExecutorCheckTest.CommandCheckSeesParentsEnv
[  FAILED  ] DefaultExecutorCheckTest.CommandCheckSharesWorkDirWithTask

 4 FAILED TESTS
  YOU HAVE 20 DISABLED TESTS

I0815 05:56:15.739444 29767 process.cpp:1072] Failed to accept socket: future discarded
make[4]: *** [check-local] Error 1
make[4]: Leaving directory `/mesos/mesos-1.4.0/_build/src'
make[3]: *** [check-am] Error 2
make[3]: Leaving directory `/mesos/mesos-1.4.0/_build/src'
make[2]: *** [check] Error 2
make[2]: Leaving directory `/mesos/mesos-1.4.0/_build/src'
make[1]: *** [check-recursive] Error 1
make[1]: Leaving directory `/mesos/mesos-1.4.0/_build'
make: *** [distcheck] Error 1
+ docker rmi mesos-1502773200-21329
Untagged: mesos-1502773200-21329:latest
Deleted: sha256:7e3c442562b0724e2512a27f7d4c36add631739798b8ae370c69524131537508
Deleted: sha256:428e14ffbf9bfd165cf939504dedea18eccb8822447bffd51e9860cbe281fd6d
Deleted: sha256:3cb09eca4336180ae12636a438dc2cd85d60fa0a5e50bc483484889b27b2a2f6
Deleted: sha256:0041ae3869354d9eaf108d666ffdc11c76de757e41fb57966a09c8d7630884b6
Deleted: sha256:42759fd125a3b89650cc1e5d662172c4c95791b7eb8c224e2d2592eafede3132
Deleted: sha256:b568962c3af60947f7face5305f98cec64be5580debbeb6ff79d48c6e9cbf40f
Deleted: sha256:d0fc7fcb0f627790727f590f78b256d4e87e59558ae1b51aee92fc293fde20ea
Deleted: sha256:1910ea9780ca9704fd40f600d1d4846cac8fbe2e8d3128a101f4c2c139059c19
Deleted: sha256:877347bdb4198de425eb5160292f38de65839ac7b522af90ea5288ce11e75e1b
Deleted: sha256:d4cdcc04c6792d71335ce1cece9da6f6708727258c0b773a562c7d8257828ce0
Deleted: sha256:3ae8825a16ab7500600498607f9446b597bcf1d532066852e8dfee00246c951a
Deleted: sha256:3eba488f0b302d08f314b140264342716262be0580d4036f01ee03c0fdf9d8a1
Deleted: sha256:ce75d7a6b3fa070c473c741eb909a99b8025729838b0c26bdc013d43612734f0
Deleted: sha256:77c7d5ab5c0070cd6574a64836006a8b821a804b103338d3a20db11fa7c5e8f4
Deleted: sha256:adce5b4422f1148a3cb75de0862b6b52a7fe60a8c234647fd8b76c9d5948704e
Deleted: sha256:e47d5e6e35f32a3f35e429e51d1b076ccd88c3510ba0bcb74405e572f0cdd8a9
Deleted: sha256:af9db1b1f5fe7e7e6b0830fb63303b643d7fbaceee9587552678306db31b5968
Deleted: sha256:24c8c48334a7dc37b0fdbc29b04b65ab8cfc9edd338cb6ee608e4c838a0a4846
Deleted: sha256:e68a1802f3bb86f77749f360495b544923a36083672981fc006385bef92f2832
Deleted: sha256:81794fd271719df8cbde9e835190ffa05f565fbb5149f95821a368b2f561a02b
Deleted: sha256:cdc8203508ba54abcb69fd55ce5b2198c2d1a04c1d4262796fb7d7e49a2dce92
Deleted: sha256:2978eb988ca18b9958014ffff7e59d608f4514514382911cf07f5ebb56c216df
Deleted: sha256:04fb5598108350ec0daeb56a7728ce4abd1561b11400f24332f95799bbc8af41
Deleted: sha256:be2a03de120043051a209c18ca2a466d7c34885226a00a2ab2458a5ba333bbf6
Build step 'Execute shell' marked build as failure
Not sending mail to unregistered user songzihao1990@gmail.com

Mime
View raw message