mesos-builds mailing list archives

Site index · List index
Message view « Date » · « Thread »
Top « Date » · « Thread »
From Apache Jenkins Server <jenk...@builds.apache.org>
Subject Build failed in Jenkins: Mesos-Buildbot » cmake,clang,--verbose,GLOG_v=1 MESOS_VERBOSE=1,ubuntu:14.04,(ubuntu)&&(!ubuntu-us1)&&(!ubuntu-eu2) #4064
Date Fri, 04 Aug 2017 03:50:41 GMT
See <https://builds.apache.org/job/Mesos-Buildbot/BUILDTOOL=cmake,COMPILER=clang,CONFIGURATION=--verbose,ENVIRONMENT=GLOG_v=1%20MESOS_VERBOSE=1,OS=ubuntu%3A14.04,label_exp=(ubuntu)&&(!ubuntu-us1)&&(!ubuntu-eu2)/4064/display/redirect?page=changes>

Changes:

[bmahler] Remove support for omitting 202 responses to old libprocess clients.

------------------------------------------
[...truncated 1.47 MB...]
make[3]: Entering directory `/mesos/build'
/usr/bin/cmake -E cmake_progress_report /mesos/build/CMakeFiles 
[ 78%] /usr/bin/cmake -E cmake_progress_report /mesos/build/CMakeFiles 
/usr/bin/cmake -E cmake_progress_report /mesos/build/CMakeFiles 
[ 78%] /usr/bin/cmake -E cmake_progress_report /mesos/build/CMakeFiles 
/usr/bin/cmake -E cmake_progress_report /mesos/build/CMakeFiles 
Building CXX object src/tests/CMakeFiles/test-helper.dir/active_user_test_helper.cpp.o
[ 78%] [ 78%] cd /mesos/build/src/tests && /usr/bin/clang++-3.5   -DBUILD_DIR=\"/mesos/build\" -DBUILD_FLAGS=\"\" -DBUILD_JAVA_JVM_LIBRARY=\"\" -DHAS_AUTHENTICATION=1 -DLIBDIR=\"/usr/local/libmesos\" -DPICOJSON_USE_INT64 -DPKGDATADIR=\"/usr/local/share/mesos\" -DPKGLIBEXECDIR=\"/usr/local/libexec/mesos\" -DPKGMODULEDIR=\"\" -DSBINDIR=\"\" -DSOURCE_DIR=\"/mesos\" -DTESTLIBEXECDIR=\"\" -DUSE_CMAKE_BUILD_CONFIG -DUSE_STATIC_LIB -DVERSION=\"1.4.0\" -D__STDC_FORMAT_MACROS -std=c++11 -fPIE -I/mesos/build/include -I/mesos/build/include/mesos -I/mesos/build/src -I/mesos/src -isystem /mesos/build/3rdparty/protobuf-3.3.0/src/protobuf-3.3.0-lib/lib/include -isystem /mesos/3rdparty/libprocess/include -isystem /usr/include/apr-1.0 -isystem /mesos/build/3rdparty/boost-1.53.0/src/boost-1.53.0 -isystem /mesos/build/3rdparty/elfio-3.2/src/elfio-3.2 -isystem /mesos/build/3rdparty/glog-0.3.3/src/glog-0.3.3-lib/lib/include -isystem /mesos/build/3rdparty/nvml-352.79/src/nvml-352.79 -isystem /mesos/build/3rdparty/picojson-1.3.0/src/picojson-1.3.0 -isystem /usr/include/subversion-1 -isystem /mesos/3rdparty/stout/include -isystem /mesos/build/3rdparty/http_parser-2.6.2/src/http_parser-2.6.2 -isystem /mesos/build/3rdparty/concurrentqueue-1.0.0-beta/src/concurrentqueue-1.0.0-beta -isystem /mesos/build/3rdparty/libev-4.22/src/libev-4.22 -isystem /mesos/build/3rdparty/zookeeper-3.4.8/src/zookeeper-3.4.8/src/c/include -isystem /mesos/build/3rdparty/zookeeper-3.4.8/src/zookeeper-3.4.8/src/c/generated -isystem /mesos/build/3rdparty/leveldb-1.19/src/leveldb-1.19/include -I/mesos/include -isystem /mesos/build/3rdparty/googletest-1.8.0/src/googletest-1.8.0/googlemock/include -isystem /mesos/build/3rdparty/googletest-1.8.0/src/googletest-1.8.0/googletest/include    -o CMakeFiles/test-helper.dir/active_user_test_helper.cpp.o -c /mesos/src/tests/active_user_test_helper.cpp
[ 78%] Building CXX object src/tests/CMakeFiles/test-helper.dir/flags.cpp.o
Building CXX object src/tests/CMakeFiles/test-helper.dir/http_server_test_helper.cpp.o
Building CXX object src/tests/CMakeFiles/test-helper.dir/resources_utils.cpp.o
cd /mesos/build/src/tests && /usr/bin/clang++-3.5   -DBUILD_DIR=\"/mesos/build\" -DBUILD_FLAGS=\"\" -DBUILD_JAVA_JVM_LIBRARY=\"\" -DHAS_AUTHENTICATION=1 -DLIBDIR=\"/usr/local/libmesos\" -DPICOJSON_USE_INT64 -DPKGDATADIR=\"/usr/local/share/mesos\" -DPKGLIBEXECDIR=\"/usr/local/libexec/mesos\" -DPKGMODULEDIR=\"\" -DSBINDIR=\"\" -DSOURCE_DIR=\"/mesos\" -DTESTLIBEXECDIR=\"\" -DUSE_CMAKE_BUILD_CONFIG -DUSE_STATIC_LIB -DVERSION=\"1.4.0\" -D__STDC_FORMAT_MACROS -std=c++11 -fPIE -I/mesos/build/include -I/mesos/build/include/mesos -I/mesos/build/src -I/mesos/src -isystem /mesos/build/3rdparty/protobuf-3.3.0/src/protobuf-3.3.0-lib/lib/include -isystem /mesos/3rdparty/libprocess/include -isystem /usr/include/apr-1.0 -isystem /mesos/build/3rdparty/boost-1.53.0/src/boost-1.53.0 -isystem /mesos/build/3rdparty/elfio-3.2/src/elfio-3.2 -isystem /mesos/build/3rdparty/glog-0.3.3/src/glog-0.3.3-lib/lib/include -isystem /mesos/build/3rdparty/nvml-352.79/src/nvml-352.79 -isystem /mesos/build/3rdparty/picojson-1.3.0/src/picojson-1.3.0 -isystem /usr/include/subversion-1 -isystem /mesos/3rdparty/stout/include -isystem /mesos/build/3rdparty/http_parser-2.6.2/src/http_parser-2.6.2 -isystem /mesos/build/3rdparty/concurrentqueue-1.0.0-beta/src/concurrentqueue-1.0.0-beta -isystem /mesos/build/3rdparty/libev-4.22/src/libev-4.22 -isystem /mesos/build/3rdparty/zookeeper-3.4.8/src/zookeeper-3.4.8/src/c/include -isystem /mesos/build/3rdparty/zookeeper-3.4.8/src/zookeeper-3.4.8/src/c/generated -isystem /mesos/build/3rdparty/leveldb-1.19/src/leveldb-1.19/include -I/mesos/include -isystem /mesos/build/3rdparty/googletest-1.8.0/src/googletest-1.8.0/googlemock/include -isystem /mesos/build/3rdparty/googletest-1.8.0/src/googletest-1.8.0/googletest/include    -o CMakeFiles/test-helper.dir/flags.cpp.o -c /mesos/src/tests/flags.cpp
cd /mesos/build/src/tests && /usr/bin/clang++-3.5   -DBUILD_DIR=\"/mesos/build\" -DBUILD_FLAGS=\"\" -DBUILD_JAVA_JVM_LIBRARY=\"\" -DHAS_AUTHENTICATION=1 -DLIBDIR=\"/usr/local/libmesos\" -DPICOJSON_USE_INT64 -DPKGDATADIR=\"/usr/local/share/mesos\" -DPKGLIBEXECDIR=\"/usr/local/libexec/mesos\" -DPKGMODULEDIR=\"\" -DSBINDIR=\"\" -DSOURCE_DIR=\"/mesos\" -DTESTLIBEXECDIR=\"\" -DUSE_CMAKE_BUILD_CONFIG -DUSE_STATIC_LIB -DVERSION=\"1.4.0\" -D__STDC_FORMAT_MACROS -std=c++11 -fPIE -I/mesos/build/include -I/mesos/build/include/mesos -I/mesos/build/src -I/mesos/src -isystem /mesos/build/3rdparty/protobuf-3.3.0/src/protobuf-3.3.0-lib/lib/include -isystem /mesos/3rdparty/libprocess/include -isystem /usr/include/apr-1.0 -isystem /mesos/build/3rdparty/boost-1.53.0/src/boost-1.53.0 -isystem /mesos/build/3rdparty/elfio-3.2/src/elfio-3.2 -isystem /mesos/build/3rdparty/glog-0.3.3/src/glog-0.3.3-lib/lib/include -isystem /mesos/build/3rdparty/nvml-352.79/src/nvml-352.79 -isystem /mesos/build/3rdparty/picojson-1.3.0/src/picojson-1.3.0 -isystem /usr/include/subversion-1 -isystem /mesos/3rdparty/stout/include -isystem /mesos/build/3rdparty/http_parser-2.6.2/src/http_parser-2.6.2 -isystem /mesos/build/3rdparty/concurrentqueue-1.0.0-beta/src/concurrentqueue-1.0.0-beta -isystem /mesos/build/3rdparty/libev-4.22/src/libev-4.22 -isystem /mesos/build/3rdparty/zookeeper-3.4.8/src/zookeeper-3.4.8/src/c/include -isystem /mesos/build/3rdparty/zookeeper-3.4.8/src/zookeeper-3.4.8/src/c/generated -isystem /mesos/build/3rdparty/leveldb-1.19/src/leveldb-1.19/include -I/mesos/include -isystem /mesos/build/3rdparty/googletest-1.8.0/src/googletest-1.8.0/googlemock/include -isystem /mesos/build/3rdparty/googletest-1.8.0/src/googletest-1.8.0/googletest/include    -o CMakeFiles/test-helper.dir/http_server_test_helper.cpp.o -c /mesos/src/tests/http_server_test_helper.cpp
Building CXX object src/tests/CMakeFiles/test-helper.dir/test_helper_main.cpp.o
cd /mesos/build/src/tests && /usr/bin/clang++-3.5   -DBUILD_DIR=\"/mesos/build\" -DBUILD_FLAGS=\"\" -DBUILD_JAVA_JVM_LIBRARY=\"\" -DHAS_AUTHENTICATION=1 -DLIBDIR=\"/usr/local/libmesos\" -DPICOJSON_USE_INT64 -DPKGDATADIR=\"/usr/local/share/mesos\" -DPKGLIBEXECDIR=\"/usr/local/libexec/mesos\" -DPKGMODULEDIR=\"\" -DSBINDIR=\"\" -DSOURCE_DIR=\"/mesos\" -DTESTLIBEXECDIR=\"\" -DUSE_CMAKE_BUILD_CONFIG -DUSE_STATIC_LIB -DVERSION=\"1.4.0\" -D__STDC_FORMAT_MACROS -std=c++11 -fPIE -I/mesos/build/include -I/mesos/build/include/mesos -I/mesos/build/src -I/mesos/src -isystem /mesos/build/3rdparty/protobuf-3.3.0/src/protobuf-3.3.0-lib/lib/include -isystem /mesos/3rdparty/libprocess/include -isystem /usr/include/apr-1.0 -isystem /mesos/build/3rdparty/boost-1.53.0/src/boost-1.53.0 -isystem /mesos/build/3rdparty/elfio-3.2/src/elfio-3.2 -isystem /mesos/build/3rdparty/glog-0.3.3/src/glog-0.3.3-lib/lib/include -isystem /mesos/build/3rdparty/nvml-352.79/src/nvml-352.79 -isystem /mesos/build/3rdparty/picojson-1.3.0/src/picojson-1.3.0 -isystem /usr/include/subversion-1 -isystem /mesos/3rdparty/stout/include -isystem /mesos/build/3rdparty/http_parser-2.6.2/src/http_parser-2.6.2 -isystem /mesos/build/3rdparty/concurrentqueue-1.0.0-beta/src/concurrentqueue-1.0.0-beta -isystem /mesos/build/3rdparty/libev-4.22/src/libev-4.22 -isystem /mesos/build/3rdparty/zookeeper-3.4.8/src/zookeeper-3.4.8/src/c/include -isystem /mesos/build/3rdparty/zookeeper-3.4.8/src/zookeeper-3.4.8/src/c/generated -isystem /mesos/build/3rdparty/leveldb-1.19/src/leveldb-1.19/include -I/mesos/include -isystem /mesos/build/3rdparty/googletest-1.8.0/src/googletest-1.8.0/googlemock/include -isystem /mesos/build/3rdparty/googletest-1.8.0/src/googletest-1.8.0/googletest/include    -o CMakeFiles/test-helper.dir/resources_utils.cpp.o -c /mesos/src/tests/resources_utils.cpp
/usr/bin/cmake -E cmake_progress_report /mesos/build/CMakeFiles 
cd /mesos/build/src/tests && /usr/bin/clang++-3.5   -DBUILD_DIR=\"/mesos/build\" -DBUILD_FLAGS=\"\" -DBUILD_JAVA_JVM_LIBRARY=\"\" -DHAS_AUTHENTICATION=1 -DLIBDIR=\"/usr/local/libmesos\" -DPICOJSON_USE_INT64 -DPKGDATADIR=\"/usr/local/share/mesos\" -DPKGLIBEXECDIR=\"/usr/local/libexec/mesos\" -DPKGMODULEDIR=\"\" -DSBINDIR=\"\" -DSOURCE_DIR=\"/mesos\" -DTESTLIBEXECDIR=\"\" -DUSE_CMAKE_BUILD_CONFIG -DUSE_STATIC_LIB -DVERSION=\"1.4.0\" -D__STDC_FORMAT_MACROS -std=c++11 -fPIE -I/mesos/build/include -I/mesos/build/include/mesos -I/mesos/build/src -I/mesos/src -isystem /mesos/build/3rdparty/protobuf-3.3.0/src/protobuf-3.3.0-lib/lib/include -isystem /mesos/3rdparty/libprocess/include -isystem /usr/include/apr-1.0 -isystem /mesos/build/3rdparty/boost-1.53.0/src/boost-1.53.0 -isystem /mesos/build/3rdparty/elfio-3.2/src/elfio-3.2 -isystem /mesos/build/3rdparty/glog-0.3.3/src/glog-0.3.3-lib/lib/include -isystem /mesos/build/3rdparty/nvml-352.79/src/nvml-352.79 -isystem /mesos/build/3rdparty/picojson-1.3.0/src/picojson-1.3.0 -isystem /usr/include/subversion-1 -isystem /mesos/3rdparty/stout/include -isystem /mesos/build/3rdparty/http_parser-2.6.2/src/http_parser-2.6.2 -isystem /mesos/build/3rdparty/concurrentqueue-1.0.0-beta/src/concurrentqueue-1.0.0-beta -isystem /mesos/build/3rdparty/libev-4.22/src/libev-4.22 -isystem /mesos/build/3rdparty/zookeeper-3.4.8/src/zookeeper-3.4.8/src/c/include -isystem /mesos/build/3rdparty/zookeeper-3.4.8/src/zookeeper-3.4.8/src/c/generated -isystem /mesos/build/3rdparty/leveldb-1.19/src/leveldb-1.19/include -I/mesos/include -isystem /mesos/build/3rdparty/googletest-1.8.0/src/googletest-1.8.0/googlemock/include -isystem /mesos/build/3rdparty/googletest-1.8.0/src/googletest-1.8.0/googletest/include    -o CMakeFiles/test-helper.dir/test_helper_main.cpp.o -c /mesos/src/tests/test_helper_main.cpp
[ 78%] Building CXX object src/tests/CMakeFiles/test-helper.dir/utils.cpp.o
cd /mesos/build/src/tests && /usr/bin/clang++-3.5   -DBUILD_DIR=\"/mesos/build\" -DBUILD_FLAGS=\"\" -DBUILD_JAVA_JVM_LIBRARY=\"\" -DHAS_AUTHENTICATION=1 -DLIBDIR=\"/usr/local/libmesos\" -DPICOJSON_USE_INT64 -DPKGDATADIR=\"/usr/local/share/mesos\" -DPKGLIBEXECDIR=\"/usr/local/libexec/mesos\" -DPKGMODULEDIR=\"\" -DSBINDIR=\"\" -DSOURCE_DIR=\"/mesos\" -DTESTLIBEXECDIR=\"\" -DUSE_CMAKE_BUILD_CONFIG -DUSE_STATIC_LIB -DVERSION=\"1.4.0\" -D__STDC_FORMAT_MACROS -std=c++11 -fPIE -I/mesos/build/include -I/mesos/build/include/mesos -I/mesos/build/src -I/mesos/src -isystem /mesos/build/3rdparty/protobuf-3.3.0/src/protobuf-3.3.0-lib/lib/include -isystem /mesos/3rdparty/libprocess/include -isystem /usr/include/apr-1.0 -isystem /mesos/build/3rdparty/boost-1.53.0/src/boost-1.53.0 -isystem /mesos/build/3rdparty/elfio-3.2/src/elfio-3.2 -isystem /mesos/build/3rdparty/glog-0.3.3/src/glog-0.3.3-lib/lib/include -isystem /mesos/build/3rdparty/nvml-352.79/src/nvml-352.79 -isystem /mesos/build/3rdparty/picojson-1.3.0/src/picojson-1.3.0 -isystem /usr/include/subversion-1 -isystem /mesos/3rdparty/stout/include -isystem /mesos/build/3rdparty/http_parser-2.6.2/src/http_parser-2.6.2 -isystem /mesos/build/3rdparty/concurrentqueue-1.0.0-beta/src/concurrentqueue-1.0.0-beta -isystem /mesos/build/3rdparty/libev-4.22/src/libev-4.22 -isystem /mesos/build/3rdparty/zookeeper-3.4.8/src/zookeeper-3.4.8/src/c/include -isystem /mesos/build/3rdparty/zookeeper-3.4.8/src/zookeeper-3.4.8/src/c/generated -isystem /mesos/build/3rdparty/leveldb-1.19/src/leveldb-1.19/include -I/mesos/include -isystem /mesos/build/3rdparty/googletest-1.8.0/src/googletest-1.8.0/googlemock/include -isystem /mesos/build/3rdparty/googletest-1.8.0/src/googletest-1.8.0/googletest/include    -o CMakeFiles/test-helper.dir/utils.cpp.o -c /mesos/src/tests/utils.cpp
/usr/bin/cmake -E cmake_progress_report /mesos/build/CMakeFiles 96
[ 79%] Building CXX object src/tests/CMakeFiles/test-helper.dir/kill_policy_test_helper.cpp.o
cd /mesos/build/src/tests && /usr/bin/clang++-3.5   -DBUILD_DIR=\"/mesos/build\" -DBUILD_FLAGS=\"\" -DBUILD_JAVA_JVM_LIBRARY=\"\" -DHAS_AUTHENTICATION=1 -DLIBDIR=\"/usr/local/libmesos\" -DPICOJSON_USE_INT64 -DPKGDATADIR=\"/usr/local/share/mesos\" -DPKGLIBEXECDIR=\"/usr/local/libexec/mesos\" -DPKGMODULEDIR=\"\" -DSBINDIR=\"\" -DSOURCE_DIR=\"/mesos\" -DTESTLIBEXECDIR=\"\" -DUSE_CMAKE_BUILD_CONFIG -DUSE_STATIC_LIB -DVERSION=\"1.4.0\" -D__STDC_FORMAT_MACROS -std=c++11 -fPIE -I/mesos/build/include -I/mesos/build/include/mesos -I/mesos/build/src -I/mesos/src -isystem /mesos/build/3rdparty/protobuf-3.3.0/src/protobuf-3.3.0-lib/lib/include -isystem /mesos/3rdparty/libprocess/include -isystem /usr/include/apr-1.0 -isystem /mesos/build/3rdparty/boost-1.53.0/src/boost-1.53.0 -isystem /mesos/build/3rdparty/elfio-3.2/src/elfio-3.2 -isystem /mesos/build/3rdparty/glog-0.3.3/src/glog-0.3.3-lib/lib/include -isystem /mesos/build/3rdparty/nvml-352.79/src/nvml-352.79 -isystem /mesos/build/3rdparty/picojson-1.3.0/src/picojson-1.3.0 -isystem /usr/include/subversion-1 -isystem /mesos/3rdparty/stout/include -isystem /mesos/build/3rdparty/http_parser-2.6.2/src/http_parser-2.6.2 -isystem /mesos/build/3rdparty/concurrentqueue-1.0.0-beta/src/concurrentqueue-1.0.0-beta -isystem /mesos/build/3rdparty/libev-4.22/src/libev-4.22 -isystem /mesos/build/3rdparty/zookeeper-3.4.8/src/zookeeper-3.4.8/src/c/include -isystem /mesos/build/3rdparty/zookeeper-3.4.8/src/zookeeper-3.4.8/src/c/generated -isystem /mesos/build/3rdparty/leveldb-1.19/src/leveldb-1.19/include -I/mesos/include -isystem /mesos/build/3rdparty/googletest-1.8.0/src/googletest-1.8.0/googlemock/include -isystem /mesos/build/3rdparty/googletest-1.8.0/src/googletest-1.8.0/googletest/include    -o CMakeFiles/test-helper.dir/kill_policy_test_helper.cpp.o -c /mesos/src/tests/kill_policy_test_helper.cpp
/usr/bin/cmake -E cmake_progress_report /mesos/build/CMakeFiles 
[ 79%] Building CXX object src/tests/CMakeFiles/test-helper.dir/containerizer/memory_test_helper.cpp.o
cd /mesos/build/src/tests && /usr/bin/clang++-3.5   -DBUILD_DIR=\"/mesos/build\" -DBUILD_FLAGS=\"\" -DBUILD_JAVA_JVM_LIBRARY=\"\" -DHAS_AUTHENTICATION=1 -DLIBDIR=\"/usr/local/libmesos\" -DPICOJSON_USE_INT64 -DPKGDATADIR=\"/usr/local/share/mesos\" -DPKGLIBEXECDIR=\"/usr/local/libexec/mesos\" -DPKGMODULEDIR=\"\" -DSBINDIR=\"\" -DSOURCE_DIR=\"/mesos\" -DTESTLIBEXECDIR=\"\" -DUSE_CMAKE_BUILD_CONFIG -DUSE_STATIC_LIB -DVERSION=\"1.4.0\" -D__STDC_FORMAT_MACROS -std=c++11 -fPIE -I/mesos/build/include -I/mesos/build/include/mesos -I/mesos/build/src -I/mesos/src -isystem /mesos/build/3rdparty/protobuf-3.3.0/src/protobuf-3.3.0-lib/lib/include -isystem /mesos/3rdparty/libprocess/include -isystem /usr/include/apr-1.0 -isystem /mesos/build/3rdparty/boost-1.53.0/src/boost-1.53.0 -isystem /mesos/build/3rdparty/elfio-3.2/src/elfio-3.2 -isystem /mesos/build/3rdparty/glog-0.3.3/src/glog-0.3.3-lib/lib/include -isystem /mesos/build/3rdparty/nvml-352.79/src/nvml-352.79 -isystem /mesos/build/3rdparty/picojson-1.3.0/src/picojson-1.3.0 -isystem /usr/include/subversion-1 -isystem /mesos/3rdparty/stout/include -isystem /mesos/build/3rdparty/http_parser-2.6.2/src/http_parser-2.6.2 -isystem /mesos/build/3rdparty/concurrentqueue-1.0.0-beta/src/concurrentqueue-1.0.0-beta -isystem /mesos/build/3rdparty/libev-4.22/src/libev-4.22 -isystem /mesos/build/3rdparty/zookeeper-3.4.8/src/zookeeper-3.4.8/src/c/include -isystem /mesos/build/3rdparty/zookeeper-3.4.8/src/zookeeper-3.4.8/src/c/generated -isystem /mesos/build/3rdparty/leveldb-1.19/src/leveldb-1.19/include -I/mesos/include -isystem /mesos/build/3rdparty/googletest-1.8.0/src/googletest-1.8.0/googlemock/include -isystem /mesos/build/3rdparty/googletest-1.8.0/src/googletest-1.8.0/googletest/include    -o CMakeFiles/test-helper.dir/containerizer/memory_test_helper.cpp.o -c /mesos/src/tests/containerizer/memory_test_helper.cpp
/usr/bin/cmake -E cmake_progress_report /mesos/build/CMakeFiles 
[ 79%] Building CXX object src/tests/CMakeFiles/test-helper.dir/containerizer/capabilities_test_helper.cpp.o
cd /mesos/build/src/tests && /usr/bin/clang++-3.5   -DBUILD_DIR=\"/mesos/build\" -DBUILD_FLAGS=\"\" -DBUILD_JAVA_JVM_LIBRARY=\"\" -DHAS_AUTHENTICATION=1 -DLIBDIR=\"/usr/local/libmesos\" -DPICOJSON_USE_INT64 -DPKGDATADIR=\"/usr/local/share/mesos\" -DPKGLIBEXECDIR=\"/usr/local/libexec/mesos\" -DPKGMODULEDIR=\"\" -DSBINDIR=\"\" -DSOURCE_DIR=\"/mesos\" -DTESTLIBEXECDIR=\"\" -DUSE_CMAKE_BUILD_CONFIG -DUSE_STATIC_LIB -DVERSION=\"1.4.0\" -D__STDC_FORMAT_MACROS -std=c++11 -fPIE -I/mesos/build/include -I/mesos/build/include/mesos -I/mesos/build/src -I/mesos/src -isystem /mesos/build/3rdparty/protobuf-3.3.0/src/protobuf-3.3.0-lib/lib/include -isystem /mesos/3rdparty/libprocess/include -isystem /usr/include/apr-1.0 -isystem /mesos/build/3rdparty/boost-1.53.0/src/boost-1.53.0 -isystem /mesos/build/3rdparty/elfio-3.2/src/elfio-3.2 -isystem /mesos/build/3rdparty/glog-0.3.3/src/glog-0.3.3-lib/lib/include -isystem /mesos/build/3rdparty/nvml-352.79/src/nvml-352.79 -isystem /mesos/build/3rdparty/picojson-1.3.0/src/picojson-1.3.0 -isystem /usr/include/subversion-1 -isystem /mesos/3rdparty/stout/include -isystem /mesos/build/3rdparty/http_parser-2.6.2/src/http_parser-2.6.2 -isystem /mesos/build/3rdparty/concurrentqueue-1.0.0-beta/src/concurrentqueue-1.0.0-beta -isystem /mesos/build/3rdparty/libev-4.22/src/libev-4.22 -isystem /mesos/build/3rdparty/zookeeper-3.4.8/src/zookeeper-3.4.8/src/c/include -isystem /mesos/build/3rdparty/zookeeper-3.4.8/src/zookeeper-3.4.8/src/c/generated -isystem /mesos/build/3rdparty/leveldb-1.19/src/leveldb-1.19/include -I/mesos/include -isystem /mesos/build/3rdparty/googletest-1.8.0/src/googletest-1.8.0/googlemock/include -isystem /mesos/build/3rdparty/googletest-1.8.0/src/googletest-1.8.0/googletest/include    -o CMakeFiles/test-helper.dir/containerizer/capabilities_test_helper.cpp.o -c /mesos/src/tests/containerizer/capabilities_test_helper.cpp
/usr/bin/cmake -E cmake_progress_report /mesos/build/CMakeFiles 
[ 79%] Building CXX object src/tests/CMakeFiles/test-helper.dir/containerizer/setns_test_helper.cpp.o
cd /mesos/build/src/tests && /usr/bin/clang++-3.5   -DBUILD_DIR=\"/mesos/build\" -DBUILD_FLAGS=\"\" -DBUILD_JAVA_JVM_LIBRARY=\"\" -DHAS_AUTHENTICATION=1 -DLIBDIR=\"/usr/local/libmesos\" -DPICOJSON_USE_INT64 -DPKGDATADIR=\"/usr/local/share/mesos\" -DPKGLIBEXECDIR=\"/usr/local/libexec/mesos\" -DPKGMODULEDIR=\"\" -DSBINDIR=\"\" -DSOURCE_DIR=\"/mesos\" -DTESTLIBEXECDIR=\"\" -DUSE_CMAKE_BUILD_CONFIG -DUSE_STATIC_LIB -DVERSION=\"1.4.0\" -D__STDC_FORMAT_MACROS -std=c++11 -fPIE -I/mesos/build/include -I/mesos/build/include/mesos -I/mesos/build/src -I/mesos/src -isystem /mesos/build/3rdparty/protobuf-3.3.0/src/protobuf-3.3.0-lib/lib/include -isystem /mesos/3rdparty/libprocess/include -isystem /usr/include/apr-1.0 -isystem /mesos/build/3rdparty/boost-1.53.0/src/boost-1.53.0 -isystem /mesos/build/3rdparty/elfio-3.2/src/elfio-3.2 -isystem /mesos/build/3rdparty/glog-0.3.3/src/glog-0.3.3-lib/lib/include -isystem /mesos/build/3rdparty/nvml-352.79/src/nvml-352.79 -isystem /mesos/build/3rdparty/picojson-1.3.0/src/picojson-1.3.0 -isystem /usr/include/subversion-1 -isystem /mesos/3rdparty/stout/include -isystem /mesos/build/3rdparty/http_parser-2.6.2/src/http_parser-2.6.2 -isystem /mesos/build/3rdparty/concurrentqueue-1.0.0-beta/src/concurrentqueue-1.0.0-beta -isystem /mesos/build/3rdparty/libev-4.22/src/libev-4.22 -isystem /mesos/build/3rdparty/zookeeper-3.4.8/src/zookeeper-3.4.8/src/c/include -isystem /mesos/build/3rdparty/zookeeper-3.4.8/src/zookeeper-3.4.8/src/c/generated -isystem /mesos/build/3rdparty/leveldb-1.19/src/leveldb-1.19/include -I/mesos/include -isystem /mesos/build/3rdparty/googletest-1.8.0/src/googletest-1.8.0/googlemock/include -isystem /mesos/build/3rdparty/googletest-1.8.0/src/googletest-1.8.0/googletest/include    -o CMakeFiles/test-helper.dir/containerizer/setns_test_helper.cpp.o -c /mesos/src/tests/containerizer/setns_test_helper.cpp
Linking CXX executable ../test-helper
cd /mesos/build/src/tests && /usr/bin/cmake -E cmake_link_script CMakeFiles/test-helper.dir/link.txt --verbose=1
/usr/bin/clang++-3.5    -std=c++11    CMakeFiles/test-helper.dir/active_user_test_helper.cpp.o CMakeFiles/test-helper.dir/flags.cpp.o CMakeFiles/test-helper.dir/http_server_test_helper.cpp.o CMakeFiles/test-helper.dir/resources_utils.cpp.o CMakeFiles/test-helper.dir/test_helper_main.cpp.o CMakeFiles/test-helper.dir/utils.cpp.o CMakeFiles/test-helper.dir/kill_policy_test_helper.cpp.o CMakeFiles/test-helper.dir/containerizer/memory_test_helper.cpp.o CMakeFiles/test-helper.dir/containerizer/capabilities_test_helper.cpp.o CMakeFiles/test-helper.dir/containerizer/setns_test_helper.cpp.o  -o ../test-helper  -L/mesos/build/3rdparty/protobuf-3.3.0/src/protobuf-3.3.0-lib/lib/lib  -L/mesos/build/3rdparty/glog-0.3.3/src/glog-0.3.3-lib/lib/lib  -L/mesos/build/3rdparty/http_parser-2.6.2/src/http_parser-2.6.2-build  -L/mesos/build/3rdparty/libev-4.22/src/libev-4.22-build/.libs  -L/mesos/build/3rdparty/zookeeper-3.4.8/src/zookeeper-3.4.8/src/c  -L/mesos/build/3rdparty/googletest-1.8.0/src/googletest-1.8.0-lib/lib  -L/mesos/build/3rdparty/googletest-1.8.0/src/googletest-1.8.0-lib/lib/gtest  -L/mesos/build/3rdparty/zookeeper-3.4.8/src/zookeeper-3.4.8/src/c/lib -rdynamic ../.libs/libmesos-1.4.0.so.1.4.0 ../../3rdparty/libprocess/src/libprocess-0.0.1.so.0.0.1 -lgmock -lgtest ../.libs/libload_qos_controller.so ../.libs/libfixed_resource_estimator.so ../.libs/liblogrotate_container_logger.so ../.libs/libmesos-1.4.0.so.1.4.0 ../../3rdparty/libprocess/src/libprocess-0.0.1.so.0.0.1 ../libmesos-protobufs.so -lapr-1 -lcurl -lglog -lsvn_delta-1 -lsvn_diff-1 -lsvn_subr-1 -lprotobuf -ldl -lapr-1 -lzookeeper_mt ../../3rdparty/leveldb-1.19/src/leveldb-1.19/out-static/libleveldb.a -lsasl2 -lrt -lhttp_parser -lev -lrt -lhttp_parser -lev -lz -lpthread -Wl,-rpath,/mesos/build/3rdparty/protobuf-3.3.0/src/protobuf-3.3.0-lib/lib/lib:/mesos/build/3rdparty/glog-0.3.3/src/glog-0.3.3-lib/lib/lib:/mesos/build/3rdparty/http_parser-2.6.2/src/http_parser-2.6.2-build:/mesos/build/3rdparty/libev-4.22/src/libev-4.22-build/.libs:/mesos/build/3rdparty/zookeeper-3.4.8/src/zookeeper-3.4.8/src/c:/mesos/build/3rdparty/googletest-1.8.0/src/googletest-1.8.0-lib/lib:/mesos/build/3rdparty/googletest-1.8.0/src/googletest-1.8.0-lib/lib/gtest:/mesos/build/src/.libs:/mesos/build/3rdparty/libprocess/src:/mesos/build/src:/mesos/build/3rdparty/zookeeper-3.4.8/src/zookeeper-3.4.8/src/c/lib 
make[3]: Leaving directory `/mesos/build'
/usr/bin/cmake -E cmake_progress_report /mesos/build/CMakeFiles  96
[ 79%] Built target test-helper
make -f src/tests/CMakeFiles/mesos-tests.dir/build.make src/tests/CMakeFiles/mesos-tests.dir/depend
make[3]: Entering directory `/mesos/build'
cd /mesos/build && /usr/bin/cmake -E cmake_depends "Unix Makefiles" /mesos /mesos/src/tests /mesos/build /mesos/build/src/tests /mesos/build/src/tests/CMakeFiles/mesos-tests.dir/DependInfo.cmake --color=
Scanning dependencies of target mesos-tests
make[3]: Leaving directory `/mesos/build'
make -f src/tests/CMakeFiles/mesos-tests.dir/build.make src/tests/CMakeFiles/mesos-tests.dir/build
make[3]: Entering directory `/mesos/build'
/usr/bin/cmake -E cmake_progress_report /mesos/build/CMakeFiles 
[ 79%] /usr/bin/cmake -E cmake_progress_report /mesos/build/CMakeFiles 
Building CXX object src/tests/CMakeFiles/mesos-tests.dir/active_user_test_helper.cpp.o
[ 79%] /usr/bin/cmake -E cmake_progress_report /mesos/build/CMakeFiles 
cd /mesos/build/src/tests && /usr/bin/clang++-3.5   -DBUILD_DIR=\"/mesos/build\" -DBUILD_FLAGS=\"\" -DBUILD_JAVA_JVM_LIBRARY=\"\" -DHAS_AUTHENTICATION=1 -DLIBDIR=\"/usr/local/libmesos\" -DPICOJSON_USE_INT64 -DPKGDATADIR=\"/usr/local/share/mesos\" -DPKGLIBEXECDIR=\"/usr/local/libexec/mesos\" -DPKGMODULEDIR=\"\" -DSBINDIR=\"\" -DSOURCE_DIR=\"/mesos\" -DTESTLIBEXECDIR=\"\" -DUSE_CMAKE_BUILD_CONFIG -DUSE_STATIC_LIB -DVERSION=\"1.4.0\" -D__STDC_FORMAT_MACROS -std=c++11 -fPIE -I/mesos/build/include -I/mesos/build/include/mesos -I/mesos/build/src -I/mesos/src -isystem /mesos/build/3rdparty/protobuf-3.3.0/src/protobuf-3.3.0-lib/lib/include -isystem /mesos/3rdparty/libprocess/include -isystem /usr/include/apr-1.0 -isystem /mesos/build/3rdparty/boost-1.53.0/src/boost-1.53.0 -isystem /mesos/build/3rdparty/elfio-3.2/src/elfio-3.2 -isystem /mesos/build/3rdparty/glog-0.3.3/src/glog-0.3.3-lib/lib/include -isystem /mesos/build/3rdparty/nvml-352.79/src/nvml-352.79 -isystem /mesos/build/3rdparty/picojson-1.3.0/src/picojson-1.3.0 -isystem /usr/include/subversion-1 -isystem /mesos/3rdparty/stout/include -isystem /mesos/build/3rdparty/http_parser-2.6.2/src/http_parser-2.6.2 -isystem /mesos/build/3rdparty/concurrentqueue-1.0.0-beta/src/concurrentqueue-1.0.0-beta -isystem /mesos/build/3rdparty/libev-4.22/src/libev-4.22 -isystem /mesos/build/3rdparty/zookeeper-3.4.8/src/zookeeper-3.4.8/src/c/include -isystem /mesos/build/3rdparty/zookeeper-3.4.8/src/zookeeper-3.4.8/src/c/generated -isystem /mesos/build/3rdparty/leveldb-1.19/src/leveldb-1.19/include -I/mesos/include -isystem /mesos/build/3rdparty/googletest-1.8.0/src/googletest-1.8.0/googlemock/include -isystem /mesos/build/3rdparty/googletest-1.8.0/src/googletest-1.8.0/googletest/include    -o CMakeFiles/mesos-tests.dir/active_user_test_helper.cpp.o -c /mesos/src/tests/active_user_test_helper.cpp
/usr/bin/cmake -E cmake_progress_report /mesos/build/CMakeFiles 
[ 79%] /usr/bin/cmake -E cmake_progress_report /mesos/build/CMakeFiles 60
/usr/bin/cmake -E cmake_progress_report /mesos/build/CMakeFiles 
[ 79%] Building CXX object src/tests/CMakeFiles/mesos-tests.dir/cluster.cpp.o
Building CXX object src/tests/CMakeFiles/mesos-tests.dir/containerizer.cpp.o
cd /mesos/build/src/tests && /usr/bin/clang++-3.5   -DBUILD_DIR=\"/mesos/build\" -DBUILD_FLAGS=\"\" -DBUILD_JAVA_JVM_LIBRARY=\"\" -DHAS_AUTHENTICATION=1 -DLIBDIR=\"/usr/local/libmesos\" -DPICOJSON_USE_INT64 -DPKGDATADIR=\"/usr/local/share/mesos\" -DPKGLIBEXECDIR=\"/usr/local/libexec/mesos\" -DPKGMODULEDIR=\"\" -DSBINDIR=\"\" -DSOURCE_DIR=\"/mesos\" -DTESTLIBEXECDIR=\"\" -DUSE_CMAKE_BUILD_CONFIG -DUSE_STATIC_LIB -DVERSION=\"1.4.0\" -D__STDC_FORMAT_MACROS -std=c++11 -fPIE -I/mesos/build/include -I/mesos/build/include/mesos -I/mesos/build/src -I/mesos/src -isystem /mesos/build/3rdparty/protobuf-3.3.0/src/protobuf-3.3.0-lib/lib/include -isystem /mesos/3rdparty/libprocess/include -isystem /usr/include/apr-1.0 -isystem /mesos/build/3rdparty/boost-1.53.0/src/boost-1.53.0 -isystem /mesos/build/3rdparty/elfio-3.2/src/elfio-3.2 -isystem /mesos/build/3rdparty/glog-0.3.3/src/glog-0.3.3-lib/lib/include -isystem /mesos/build/3rdparty/nvml-352.79/src/nvml-352.79 -isystem /mesos/build/3rdparty/picojson-1.3.0/src/picojson-1.3.0 -isystem /usr/include/subversion-1 -isystem /mesos/3rdparty/stout/include -isystem /mesos/build/3rdparty/http_parser-2.6.2/src/http_parser-2.6.2 -isystem /mesos/build/3rdparty/concurrentqueue-1.0.0-beta/src/concurrentqueue-1.0.0-beta -isystem /mesos/build/3rdparty/libev-4.22/src/libev-4.22 -isystem /mesos/build/3rdparty/zookeeper-3.4.8/src/zookeeper-3.4.8/src/c/include -isystem /mesos/build/3rdparty/zookeeper-3.4.8/src/zookeeper-3.4.8/src/c/generated -isystem /mesos/build/3rdparty/leveldb-1.19/src/leveldb-1.19/include -I/mesos/include -isystem /mesos/build/3rdparty/googletest-1.8.0/src/googletest-1.8.0/googlemock/include -isystem /mesos/build/3rdparty/googletest-1.8.0/src/googletest-1.8.0/googletest/include    -o CMakeFiles/mesos-tests.dir/cluster.cpp.o -c /mesos/src/tests/cluster.cpp
[ 79%] [ 80%] Building CXX object src/tests/CMakeFiles/mesos-tests.dir/http_server_test_helper.cpp.o
cd /mesos/build/src/tests && /usr/bin/clang++-3.5   -DBUILD_DIR=\"/mesos/build\" -DBUILD_FLAGS=\"\" -DBUILD_JAVA_JVM_LIBRARY=\"\" -DHAS_AUTHENTICATION=1 -DLIBDIR=\"/usr/local/libmesos\" -DPICOJSON_USE_INT64 -DPKGDATADIR=\"/usr/local/share/mesos\" -DPKGLIBEXECDIR=\"/usr/local/libexec/mesos\" -DPKGMODULEDIR=\"\" -DSBINDIR=\"\" -DSOURCE_DIR=\"/mesos\" -DTESTLIBEXECDIR=\"\" -DUSE_CMAKE_BUILD_CONFIG -DUSE_STATIC_LIB -DVERSION=\"1.4.0\" -D__STDC_FORMAT_MACROS -std=c++11 -fPIE -I/mesos/build/include -I/mesos/build/include/mesos -I/mesos/build/src -I/mesos/src -isystem /mesos/build/3rdparty/protobuf-3.3.0/src/protobuf-3.3.0-lib/lib/include -isystem /mesos/3rdparty/libprocess/include -isystem /usr/include/apr-1.0 -isystem /mesos/build/3rdparty/boost-1.53.0/src/boost-1.53.0 -isystem /mesos/build/3rdparty/elfio-3.2/src/elfio-3.2 -isystem /mesos/build/3rdparty/glog-0.3.3/src/glog-0.3.3-lib/lib/include -isystem /mesos/build/3rdparty/nvml-352.79/src/nvml-352.79 -isystem /mesos/build/3rdparty/picojson-1.3.0/src/picojson-1.3.0 -isystem /usr/include/subversion-1 -isystem /mesos/3rdparty/stout/include -isystem /mesos/build/3rdparty/http_parser-2.6.2/src/http_parser-2.6.2 -isystem /mesos/build/3rdparty/concurrentqueue-1.0.0-beta/src/concurrentqueue-1.0.0-beta -isystem /mesos/build/3rdparty/libev-4.22/src/libev-4.22 -isystem /mesos/build/3rdparty/zookeeper-3.4.8/src/zookeeper-3.4.8/src/c/include -isystem /mesos/build/3rdparty/zookeeper-3.4.8/src/zookeeper-3.4.8/src/c/generated -isystem /mesos/build/3rdparty/leveldb-1.19/src/leveldb-1.19/include -I/mesos/include -isystem /mesos/build/3rdparty/googletest-1.8.0/src/googletest-1.8.0/googlemock/include -isystem /mesos/build/3rdparty/googletest-1.8.0/src/googletest-1.8.0/googletest/include    -o CMakeFiles/mesos-tests.dir/containerizer.cpp.o -c /mesos/src/tests/containerizer.cpp
cd /mesos/build/src/tests && /usr/bin/clang++-3.5   -DBUILD_DIR=\"/mesos/build\" -DBUILD_FLAGS=\"\" -DBUILD_JAVA_JVM_LIBRARY=\"\" -DHAS_AUTHENTICATION=1 -DLIBDIR=\"/usr/local/libmesos\" -DPICOJSON_USE_INT64 -DPKGDATADIR=\"/usr/local/share/mesos\" -DPKGLIBEXECDIR=\"/usr/local/libexec/mesos\" -DPKGMODULEDIR=\"\" -DSBINDIR=\"\" -DSOURCE_DIR=\"/mesos\" -DTESTLIBEXECDIR=\"\" -DUSE_CMAKE_BUILD_CONFIG -DUSE_STATIC_LIB -DVERSION=\"1.4.0\" -D__STDC_FORMAT_MACROS -std=c++11 -fPIE -I/mesos/build/include -I/mesos/build/include/mesos -I/mesos/build/src -I/mesos/src -isystem /mesos/build/3rdparty/protobuf-3.3.0/src/protobuf-3.3.0-lib/lib/include -isystem /mesos/3rdparty/libprocess/include -isystem /usr/include/apr-1.0 -isystem /mesos/build/3rdparty/boost-1.53.0/src/boost-1.53.0 -isystem /mesos/build/3rdparty/elfio-3.2/src/elfio-3.2 -isystem /mesos/build/3rdparty/glog-0.3.3/src/glog-0.3.3-lib/lib/include -isystem /mesos/build/3rdparty/nvml-352.79/src/nvml-352.79 -isystem /mesos/build/3rdparty/picojson-1.3.0/src/picojson-1.3.0 -isystem /usr/include/subversion-1 -isystem /mesos/3rdparty/stout/include -isystem /mesos/build/3rdparty/http_parser-2.6.2/src/http_parser-2.6.2 -isystem /mesos/build/3rdparty/concurrentqueue-1.0.0-beta/src/concurrentqueue-1.0.0-beta -isystem /mesos/build/3rdparty/libev-4.22/src/libev-4.22 -isystem /mesos/build/3rdparty/zookeeper-3.4.8/src/zookeeper-3.4.8/src/c/include -isystem /mesos/build/3rdparty/zookeeper-3.4.8/src/zookeeper-3.4.8/src/c/generated -isystem /mesos/build/3rdparty/leveldb-1.19/src/leveldb-1.19/include -I/mesos/include -isystem /mesos/build/3rdparty/googletest-1.8.0/src/googletest-1.8.0/googlemock/include -isystem /mesos/build/3rdparty/googletest-1.8.0/src/googletest-1.8.0/googletest/include    -o CMakeFiles/mesos-tests.dir/http_server_test_helper.cpp.o -c /mesos/src/tests/http_server_test_helper.cpp
Building CXX object src/tests/CMakeFiles/mesos-tests.dir/environment.cpp.o
cd /mesos/build/src/tests && /usr/bin/clang++-3.5   -DBUILD_DIR=\"/mesos/build\" -DBUILD_FLAGS=\"\" -DBUILD_JAVA_JVM_LIBRARY=\"\" -DHAS_AUTHENTICATION=1 -DLIBDIR=\"/usr/local/libmesos\" -DPICOJSON_USE_INT64 -DPKGDATADIR=\"/usr/local/share/mesos\" -DPKGLIBEXECDIR=\"/usr/local/libexec/mesos\" -DPKGMODULEDIR=\"\" -DSBINDIR=\"\" -DSOURCE_DIR=\"/mesos\" -DTESTLIBEXECDIR=\"\" -DUSE_CMAKE_BUILD_CONFIG -DUSE_STATIC_LIB -DVERSION=\"1.4.0\" -D__STDC_FORMAT_MACROS -std=c++11 -fPIE -I/mesos/build/include -I/mesos/build/include/mesos -I/mesos/build/src -I/mesos/src -isystem /mesos/build/3rdparty/protobuf-3.3.0/src/protobuf-3.3.0-lib/lib/include -isystem /mesos/3rdparty/libprocess/include -isystem /usr/include/apr-1.0 -isystem /mesos/build/3rdparty/boost-1.53.0/src/boost-1.53.0 -isystem /mesos/build/3rdparty/elfio-3.2/src/elfio-3.2 -isystem /mesos/build/3rdparty/glog-0.3.3/src/glog-0.3.3-lib/lib/include -isystem /mesos/build/3rdparty/nvml-352.79/src/nvml-352.79 -isystem /mesos/build/3rdparty/picojson-1.3.0/src/picojson-1.3.0 -isystem /usr/include/subversion-1 -isystem /mesos/3rdparty/stout/include -isystem /mesos/build/3rdparty/http_parser-2.6.2/src/http_parser-2.6.2 -isystem /mesos/build/3rdparty/concurrentqueue-1.0.0-beta/src/concurrentqueue-1.0.0-beta -isystem /mesos/build/3rdparty/libev-4.22/src/libev-4.22 -isystem /mesos/build/3rdparty/zookeeper-3.4.8/src/zookeeper-3.4.8/src/c/include -isystem /mesos/build/3rdparty/zookeeper-3.4.8/src/zookeeper-3.4.8/src/c/generated -isystem /mesos/build/3rdparty/leveldb-1.19/src/leveldb-1.19/include -I/mesos/include -isystem /mesos/build/3rdparty/googletest-1.8.0/src/googletest-1.8.0/googlemock/include -isystem /mesos/build/3rdparty/googletest-1.8.0/src/googletest-1.8.0/googletest/include    -o CMakeFiles/mesos-tests.dir/environment.cpp.o -c /mesos/src/tests/environment.cpp
Building CXX object src/tests/CMakeFiles/mesos-tests.dir/flags.cpp.o
cd /mesos/build/src/tests && /usr/bin/clang++-3.5   -DBUILD_DIR=\"/mesos/build\" -DBUILD_FLAGS=\"\" -DBUILD_JAVA_JVM_LIBRARY=\"\" -DHAS_AUTHENTICATION=1 -DLIBDIR=\"/usr/local/libmesos\" -DPICOJSON_USE_INT64 -DPKGDATADIR=\"/usr/local/share/mesos\" -DPKGLIBEXECDIR=\"/usr/local/libexec/mesos\" -DPKGMODULEDIR=\"\" -DSBINDIR=\"\" -DSOURCE_DIR=\"/mesos\" -DTESTLIBEXECDIR=\"\" -DUSE_CMAKE_BUILD_CONFIG -DUSE_STATIC_LIB -DVERSION=\"1.4.0\" -D__STDC_FORMAT_MACROS -std=c++11 -fPIE -I/mesos/build/include -I/mesos/build/include/mesos -I/mesos/build/src -I/mesos/src -isystem /mesos/build/3rdparty/protobuf-3.3.0/src/protobuf-3.3.0-lib/lib/include -isystem /mesos/3rdparty/libprocess/include -isystem /usr/include/apr-1.0 -isystem /mesos/build/3rdparty/boost-1.53.0/src/boost-1.53.0 -isystem /mesos/build/3rdparty/elfio-3.2/src/elfio-3.2 -isystem /mesos/build/3rdparty/glog-0.3.3/src/glog-0.3.3-lib/lib/include -isystem /mesos/build/3rdparty/nvml-352.79/src/nvml-352.79 -isystem /mesos/build/3rdparty/picojson-1.3.0/src/picojson-1.3.0 -isystem /usr/include/subversion-1 -isystem /mesos/3rdparty/stout/include -isystem /mesos/build/3rdparty/http_parser-2.6.2/src/http_parser-2.6.2 -isystem /mesos/build/3rdparty/concurrentqueue-1.0.0-beta/src/concurrentqueue-1.0.0-beta -isystem /mesos/build/3rdparty/libev-4.22/src/libev-4.22 -isystem /mesos/build/3rdparty/zookeeper-3.4.8/src/zookeeper-3.4.8/src/c/include -isystem /mesos/build/3rdparty/zookeeper-3.4.8/src/zookeeper-3.4.8/src/c/generated -isystem /mesos/build/3rdparty/leveldb-1.19/src/leveldb-1.19/include -I/mesos/include -isystem /mesos/build/3rdparty/googletest-1.8.0/src/googletest-1.8.0/googlemock/include -isystem /mesos/build/3rdparty/googletest-1.8.0/src/googletest-1.8.0/googletest/include    -o CMakeFiles/mesos-tests.dir/flags.cpp.o -c /mesos/src/tests/flags.cpp
/usr/bin/cmake -E cmake_progress_report /mesos/build/CMakeFiles 
[ 80%] Building CXX object src/tests/CMakeFiles/mesos-tests.dir/main.cpp.o
cd /mesos/build/src/tests && /usr/bin/clang++-3.5   -DBUILD_DIR=\"/mesos/build\" -DBUILD_FLAGS=\"\" -DBUILD_JAVA_JVM_LIBRARY=\"\" -DHAS_AUTHENTICATION=1 -DLIBDIR=\"/usr/local/libmesos\" -DPICOJSON_USE_INT64 -DPKGDATADIR=\"/usr/local/share/mesos\" -DPKGLIBEXECDIR=\"/usr/local/libexec/mesos\" -DPKGMODULEDIR=\"\" -DSBINDIR=\"\" -DSOURCE_DIR=\"/mesos\" -DTESTLIBEXECDIR=\"\" -DUSE_CMAKE_BUILD_CONFIG -DUSE_STATIC_LIB -DVERSION=\"1.4.0\" -D__STDC_FORMAT_MACROS -std=c++11 -fPIE -I/mesos/build/include -I/mesos/build/include/mesos -I/mesos/build/src -I/mesos/src -isystem /mesos/build/3rdparty/protobuf-3.3.0/src/protobuf-3.3.0-lib/lib/include -isystem /mesos/3rdparty/libprocess/include -isystem /usr/include/apr-1.0 -isystem /mesos/build/3rdparty/boost-1.53.0/src/boost-1.53.0 -isystem /mesos/build/3rdparty/elfio-3.2/src/elfio-3.2 -isystem /mesos/build/3rdparty/glog-0.3.3/src/glog-0.3.3-lib/lib/include -isystem /mesos/build/3rdparty/nvml-352.79/src/nvml-352.79 -isystem /mesos/build/3rdparty/picojson-1.3.0/src/picojson-1.3.0 -isystem /usr/include/subversion-1 -isystem /mesos/3rdparty/stout/include -isystem /mesos/build/3rdparty/http_parser-2.6.2/src/http_parser-2.6.2 -isystem /mesos/build/3rdparty/concurrentqueue-1.0.0-beta/src/concurrentqueue-1.0.0-beta -isystem /mesos/build/3rdparty/libev-4.22/src/libev-4.22 -isystem /mesos/build/3rdparty/zookeeper-3.4.8/src/zookeeper-3.4.8/src/c/include -isystem /mesos/build/3rdparty/zookeeper-3.4.8/src/zookeeper-3.4.8/src/c/generated -isystem /mesos/build/3rdparty/leveldb-1.19/src/leveldb-1.19/include -I/mesos/include -isystem /mesos/build/3rdparty/googletest-1.8.0/src/googletest-1.8.0/googlemock/include -isystem /mesos/build/3rdparty/googletest-1.8.0/src/googletest-1.8.0/googletest/include    -o CMakeFiles/mesos-tests.dir/main.cpp.o -c /mesos/src/tests/main.cpp
/usr/bin/cmake -E cmake_progress_report /mesos/build/CMakeFiles 
[ 80%] Building CXX object src/tests/CMakeFiles/mesos-tests.dir/mesos.cpp.o
cd /mesos/build/src/tests && /usr/bin/clang++-3.5   -DBUILD_DIR=\"/mesos/build\" -DBUILD_FLAGS=\"\" -DBUILD_JAVA_JVM_LIBRARY=\"\" -DHAS_AUTHENTICATION=1 -DLIBDIR=\"/usr/local/libmesos\" -DPICOJSON_USE_INT64 -DPKGDATADIR=\"/usr/local/share/mesos\" -DPKGLIBEXECDIR=\"/usr/local/libexec/mesos\" -DPKGMODULEDIR=\"\" -DSBINDIR=\"\" -DSOURCE_DIR=\"/mesos\" -DTESTLIBEXECDIR=\"\" -DUSE_CMAKE_BUILD_CONFIG -DUSE_STATIC_LIB -DVERSION=\"1.4.0\" -D__STDC_FORMAT_MACROS -std=c++11 -fPIE -I/mesos/build/include -I/mesos/build/include/mesos -I/mesos/build/src -I/mesos/src -isystem /mesos/build/3rdparty/protobuf-3.3.0/src/protobuf-3.3.0-lib/lib/include -isystem /mesos/3rdparty/libprocess/include -isystem /usr/include/apr-1.0 -isystem /mesos/build/3rdparty/boost-1.53.0/src/boost-1.53.0 -isystem /mesos/build/3rdparty/elfio-3.2/src/elfio-3.2 -isystem /mesos/build/3rdparty/glog-0.3.3/src/glog-0.3.3-lib/lib/include -isystem /mesos/build/3rdparty/nvml-352.79/src/nvml-352.79 -isystem /mesos/build/3rdparty/picojson-1.3.0/src/picojson-1.3.0 -isystem /usr/include/subversion-1 -isystem /mesos/3rdparty/stout/include -isystem /mesos/build/3rdparty/http_parser-2.6.2/src/http_parser-2.6.2 -isystem /mesos/build/3rdparty/concurrentqueue-1.0.0-beta/src/concurrentqueue-1.0.0-beta -isystem /mesos/build/3rdparty/libev-4.22/src/libev-4.22 -isystem /mesos/build/3rdparty/zookeeper-3.4.8/src/zookeeper-3.4.8/src/c/include -isystem /mesos/build/3rdparty/zookeeper-3.4.8/src/zookeeper-3.4.8/src/c/generated -isystem /mesos/build/3rdparty/leveldb-1.19/src/leveldb-1.19/include -I/mesos/include -isystem /mesos/build/3rdparty/googletest-1.8.0/src/googletest-1.8.0/googlemock/include -isystem /mesos/build/3rdparty/googletest-1.8.0/src/googletest-1.8.0/googletest/include    -o CMakeFiles/mesos-tests.dir/mesos.cpp.o -c /mesos/src/tests/mesos.cpp
/usr/bin/cmake -E cmake_progress_report /mesos/build/CMakeFiles 
[ 80%] Building CXX object src/tests/CMakeFiles/mesos-tests.dir/mock_docker.cpp.o
cd /mesos/build/src/tests && /usr/bin/clang++-3.5   -DBUILD_DIR=\"/mesos/build\" -DBUILD_FLAGS=\"\" -DBUILD_JAVA_JVM_LIBRARY=\"\" -DHAS_AUTHENTICATION=1 -DLIBDIR=\"/usr/local/libmesos\" -DPICOJSON_USE_INT64 -DPKGDATADIR=\"/usr/local/share/mesos\" -DPKGLIBEXECDIR=\"/usr/local/libexec/mesos\" -DPKGMODULEDIR=\"\" -DSBINDIR=\"\" -DSOURCE_DIR=\"/mesos\" -DTESTLIBEXECDIR=\"\" -DUSE_CMAKE_BUILD_CONFIG -DUSE_STATIC_LIB -DVERSION=\"1.4.0\" -D__STDC_FORMAT_MACROS -std=c++11 -fPIE -I/mesos/build/include -I/mesos/build/include/mesos -I/mesos/build/src -I/mesos/src -isystem /mesos/build/3rdparty/protobuf-3.3.0/src/protobuf-3.3.0-lib/lib/include -isystem /mesos/3rdparty/libprocess/include -isystem /usr/include/apr-1.0 -isystem /mesos/build/3rdparty/boost-1.53.0/src/boost-1.53.0 -isystem /mesos/build/3rdparty/elfio-3.2/src/elfio-3.2 -isystem /mesos/build/3rdparty/glog-0.3.3/src/glog-0.3.3-lib/lib/include -isystem /mesos/build/3rdparty/nvml-352.79/src/nvml-352.79 -isystem /mesos/build/3rdparty/picojson-1.3.0/src/picojson-1.3.0 -isystem /usr/include/subversion-1 -isystem /mesos/3rdparty/stout/include -isystem /mesos/build/3rdparty/http_parser-2.6.2/src/http_parser-2.6.2 -isystem /mesos/build/3rdparty/concurrentqueue-1.0.0-beta/src/concurrentqueue-1.0.0-beta -isystem /mesos/build/3rdparty/libev-4.22/src/libev-4.22 -isystem /mesos/build/3rdparty/zookeeper-3.4.8/src/zookeeper-3.4.8/src/c/include -isystem /mesos/build/3rdparty/zookeeper-3.4.8/src/zookeeper-3.4.8/src/c/generated -isystem /mesos/build/3rdparty/leveldb-1.19/src/leveldb-1.19/include -I/mesos/include -isystem /mesos/build/3rdparty/googletest-1.8.0/src/googletest-1.8.0/googlemock/include -isystem /mesos/build/3rdparty/googletest-1.8.0/src/googletest-1.8.0/googletest/include    -o CMakeFiles/mesos-tests.dir/mock_docker.cpp.o -c /mesos/src/tests/mock_docker.cpp
/usr/bin/cmake -E cmake_progress_report /mesos/build/CMakeFiles 
[ 80%] Building CXX object src/tests/CMakeFiles/mesos-tests.dir/mock_fetcher.cpp.o
cd /mesos/build/src/tests && /usr/bin/clang++-3.5   -DBUILD_DIR=\"/mesos/build\" -DBUILD_FLAGS=\"\" -DBUILD_JAVA_JVM_LIBRARY=\"\" -DHAS_AUTHENTICATION=1 -DLIBDIR=\"/usr/local/libmesos\" -DPICOJSON_USE_INT64 -DPKGDATADIR=\"/usr/local/share/mesos\" -DPKGLIBEXECDIR=\"/usr/local/libexec/mesos\" -DPKGMODULEDIR=\"\" -DSBINDIR=\"\" -DSOURCE_DIR=\"/mesos\" -DTESTLIBEXECDIR=\"\" -DUSE_CMAKE_BUILD_CONFIG -DUSE_STATIC_LIB -DVERSION=\"1.4.0\" -D__STDC_FORMAT_MACROS -std=c++11 -fPIE -I/mesos/build/include -I/mesos/build/include/mesos -I/mesos/build/src -I/mesos/src -isystem /mesos/build/3rdparty/protobuf-3.3.0/src/protobuf-3.3.0-lib/lib/include -isystem /mesos/3rdparty/libprocess/include -isystem /usr/include/apr-1.0 -isystem /mesos/build/3rdparty/boost-1.53.0/src/boost-1.53.0 -isystem /mesos/build/3rdparty/elfio-3.2/src/elfio-3.2 -isystem /mesos/build/3rdparty/glog-0.3.3/src/glog-0.3.3-lib/lib/include -isystem /mesos/build/3rdparty/nvml-352.79/src/nvml-352.79 -isystem /mesos/build/3rdparty/picojson-1.3.0/src/picojson-1.3.0 -isystem /usr/include/subversion-1 -isystem /mesos/3rdparty/stout/include -isystem /mesos/build/3rdparty/http_parser-2.6.2/src/http_parser-2.6.2 -isystem /mesos/build/3rdparty/concurrentqueue-1.0.0-beta/src/concurrentqueue-1.0.0-beta -isystem /mesos/build/3rdparty/libev-4.22/src/libev-4.22 -isystem /mesos/build/3rdparty/zookeeper-3.4.8/src/zookeeper-3.4.8/src/c/include -isystem /mesos/build/3rdparty/zookeeper-3.4.8/src/zookeeper-3.4.8/src/c/generated -isystem /mesos/build/3rdparty/leveldb-1.19/src/leveldb-1.19/include -I/mesos/include -isystem /mesos/build/3rdparty/googletest-1.8.0/src/googletest-1.8.0/googlemock/include -isystem /mesos/build/3rdparty/googletest-1.8.0/src/googletest-1.8.0/googletest/include    -o CMakeFiles/mesos-tests.dir/mock_fetcher.cpp.o -c /mesos/src/tests/mock_fetcher.cpp
/usr/bin/cmake -E cmake_progress_report /mesos/build/CMakeFiles 
[ 80%] Building CXX object src/tests/CMakeFiles/mesos-tests.dir/mock_registrar.cpp.o
cd /mesos/build/src/tests && /usr/bin/clang++-3.5   -DBUILD_DIR=\"/mesos/build\" -DBUILD_FLAGS=\"\" -DBUILD_JAVA_JVM_LIBRARY=\"\" -DHAS_AUTHENTICATION=1 -DLIBDIR=\"/usr/local/libmesos\" -DPICOJSON_USE_INT64 -DPKGDATADIR=\"/usr/local/share/mesos\" -DPKGLIBEXECDIR=\"/usr/local/libexec/mesos\" -DPKGMODULEDIR=\"\" -DSBINDIR=\"\" -DSOURCE_DIR=\"/mesos\" -DTESTLIBEXECDIR=\"\" -DUSE_CMAKE_BUILD_CONFIG -DUSE_STATIC_LIB -DVERSION=\"1.4.0\" -D__STDC_FORMAT_MACROS -std=c++11 -fPIE -I/mesos/build/include -I/mesos/build/include/mesos -I/mesos/build/src -I/mesos/src -isystem /mesos/build/3rdparty/protobuf-3.3.0/src/protobuf-3.3.0-lib/lib/include -isystem /mesos/3rdparty/libprocess/include -isystem /usr/include/apr-1.0 -isystem /mesos/build/3rdparty/boost-1.53.0/src/boost-1.53.0 -isystem /mesos/build/3rdparty/elfio-3.2/src/elfio-3.2 -isystem /mesos/build/3rdparty/glog-0.3.3/src/glog-0.3.3-lib/lib/include -isystem /mesos/build/3rdparty/nvml-352.79/src/nvml-352.79 -isystem /mesos/build/3rdparty/picojson-1.3.0/src/picojson-1.3.0 -isystem /usr/include/subversion-1 -isystem /mesos/3rdparty/stout/include -isystem /mesos/build/3rdparty/http_parser-2.6.2/src/http_parser-2.6.2 -isystem /mesos/build/3rdparty/concurrentqueue-1.0.0-beta/src/concurrentqueue-1.0.0-beta -isystem /mesos/build/3rdparty/libev-4.22/src/libev-4.22 -isystem /mesos/build/3rdparty/zookeeper-3.4.8/src/zookeeper-3.4.8/src/c/include -isystem /mesos/build/3rdparty/zookeeper-3.4.8/src/zookeeper-3.4.8/src/c/generated -isystem /mesos/build/3rdparty/leveldb-1.19/src/leveldb-1.19/include -I/mesos/include -isystem /mesos/build/3rdparty/googletest-1.8.0/src/googletest-1.8.0/googlemock/include -isystem /mesos/build/3rdparty/googletest-1.8.0/src/googletest-1.8.0/googletest/include    -o CMakeFiles/mesos-tests.dir/mock_registrar.cpp.o -c /mesos/src/tests/mock_registrar.cpp
/usr/bin/cmake -E cmake_progress_report /mesos/build/CMakeFiles 61
[ 81%] Building CXX object src/tests/CMakeFiles/mesos-tests.dir/mock_slave.cpp.o
cd /mesos/build/src/tests && /usr/bin/clang++-3.5   -DBUILD_DIR=\"/mesos/build\" -DBUILD_FLAGS=\"\" -DBUILD_JAVA_JVM_LIBRARY=\"\" -DHAS_AUTHENTICATION=1 -DLIBDIR=\"/usr/local/libmesos\" -DPICOJSON_USE_INT64 -DPKGDATADIR=\"/usr/local/share/mesos\" -DPKGLIBEXECDIR=\"/usr/local/libexec/mesos\" -DPKGMODULEDIR=\"\" -DSBINDIR=\"\" -DSOURCE_DIR=\"/mesos\" -DTESTLIBEXECDIR=\"\" -DUSE_CMAKE_BUILD_CONFIG -DUSE_STATIC_LIB -DVERSION=\"1.4.0\" -D__STDC_FORMAT_MACROS -std=c++11 -fPIE -I/mesos/build/include -I/mesos/build/include/mesos -I/mesos/build/src -I/mesos/src -isystem /mesos/build/3rdparty/protobuf-3.3.0/src/protobuf-3.3.0-lib/lib/include -isystem /mesos/3rdparty/libprocess/include -isystem /usr/include/apr-1.0 -isystem /mesos/build/3rdparty/boost-1.53.0/src/boost-1.53.0 -isystem /mesos/build/3rdparty/elfio-3.2/src/elfio-3.2 -isystem /mesos/build/3rdparty/glog-0.3.3/src/glog-0.3.3-lib/lib/include -isystem /mesos/build/3rdparty/nvml-352.79/src/nvml-352.79 -isystem /mesos/build/3rdparty/picojson-1.3.0/src/picojson-1.3.0 -isystem /usr/include/subversion-1 -isystem /mesos/3rdparty/stout/include -isystem /mesos/build/3rdparty/http_parser-2.6.2/src/http_parser-2.6.2 -isystem /mesos/build/3rdparty/concurrentqueue-1.0.0-beta/src/concurrentqueue-1.0.0-beta -isystem /mesos/build/3rdparty/libev-4.22/src/libev-4.22 -isystem /mesos/build/3rdparty/zookeeper-3.4.8/src/zookeeper-3.4.8/src/c/include -isystem /mesos/build/3rdparty/zookeeper-3.4.8/src/zookeeper-3.4.8/src/c/generated -isystem /mesos/build/3rdparty/leveldb-1.19/src/leveldb-1.19/include -I/mesos/include -isystem /mesos/build/3rdparty/googletest-1.8.0/src/googletest-1.8.0/googlemock/include -isystem /mesos/build/3rdparty/googletest-1.8.0/src/googletest-1.8.0/googletest/include    -o CMakeFiles/mesos-tests.dir/mock_slave.cpp.o -c /mesos/src/tests/mock_slave.cpp
/usr/bin/cmake -E cmake_progress_report /mesos/build/CMakeFiles 
[ 81%] Building CXX object src/tests/CMakeFiles/mesos-tests.dir/module.cpp.o
cd /mesos/build/src/tests && /usr/bin/clang++-3.5   -DBUILD_DIR=\"/mesos/build\" -DBUILD_FLAGS=\"\" -DBUILD_JAVA_JVM_LIBRARY=\"\" -DHAS_AUTHENTICATION=1 -DLIBDIR=\"/usr/local/libmesos\" -DPICOJSON_USE_INT64 -DPKGDATADIR=\"/usr/local/share/mesos\" -DPKGLIBEXECDIR=\"/usr/local/libexec/mesos\" -DPKGMODULEDIR=\"\" -DSBINDIR=\"\" -DSOURCE_DIR=\"/mesos\" -DTESTLIBEXECDIR=\"\" -DUSE_CMAKE_BUILD_CONFIG -DUSE_STATIC_LIB -DVERSION=\"1.4.0\" -D__STDC_FORMAT_MACROS -std=c++11 -fPIE -I/mesos/build/include -I/mesos/build/include/mesos -I/mesos/build/src -I/mesos/src -isystem /mesos/build/3rdparty/protobuf-3.3.0/src/protobuf-3.3.0-lib/lib/include -isystem /mesos/3rdparty/libprocess/include -isystem /usr/include/apr-1.0 -isystem /mesos/build/3rdparty/boost-1.53.0/src/boost-1.53.0 -isystem /mesos/build/3rdparty/elfio-3.2/src/elfio-3.2 -isystem /mesos/build/3rdparty/glog-0.3.3/src/glog-0.3.3-lib/lib/include -isystem /mesos/build/3rdparty/nvml-352.79/src/nvml-352.79 -isystem /mesos/build/3rdparty/picojson-1.3.0/src/picojson-1.3.0 -isystem /usr/include/subversion-1 -isystem /mesos/3rdparty/stout/include -isystem /mesos/build/3rdparty/http_parser-2.6.2/src/http_parser-2.6.2 -isystem /mesos/build/3rdparty/concurrentqueue-1.0.0-beta/src/concurrentqueue-1.0.0-beta -isystem /mesos/build/3rdparty/libev-4.22/src/libev-4.22 -isystem /mesos/build/3rdparty/zookeeper-3.4.8/src/zookeeper-3.4.8/src/c/include -isystem /mesos/build/3rdparty/zookeeper-3.4.8/src/zookeeper-3.4.8/src/c/generated -isystem /mesos/build/3rdparty/leveldb-1.19/src/leveldb-1.19/include -I/mesos/include -isystem /mesos/build/3rdparty/googletest-1.8.0/src/googletest-1.8.0/googlemock/include -isystem /mesos/build/3rdparty/googletest-1.8.0/src/googletest-1.8.0/googletest/include    -o CMakeFiles/mesos-tests.dir/module.cpp.o -c /mesos/src/tests/module.cpp
/usr/bin/cmake -E cmake_progress_report /mesos/build/CMakeFiles 
[ 81%] Building CXX object src/tests/CMakeFiles/mesos-tests.dir/resources_utils.cpp.o
cd /mesos/build/src/tests && /usr/bin/clang++-3.5   -DBUILD_DIR=\"/mesos/build\" -DBUILD_FLAGS=\"\" -DBUILD_JAVA_JVM_LIBRARY=\"\" -DHAS_AUTHENTICATION=1 -DLIBDIR=\"/usr/local/libmesos\" -DPICOJSON_USE_INT64 -DPKGDATADIR=\"/usr/local/share/mesos\" -DPKGLIBEXECDIR=\"/usr/local/libexec/mesos\" -DPKGMODULEDIR=\"\" -DSBINDIR=\"\" -DSOURCE_DIR=\"/mesos\" -DTESTLIBEXECDIR=\"\" -DUSE_CMAKE_BUILD_CONFIG -DUSE_STATIC_LIB -DVERSION=\"1.4.0\" -D__STDC_FORMAT_MACROS -std=c++11 -fPIE -I/mesos/build/include -I/mesos/build/include/mesos -I/mesos/build/src -I/mesos/src -isystem /mesos/build/3rdparty/protobuf-3.3.0/src/protobuf-3.3.0-lib/lib/include -isystem /mesos/3rdparty/libprocess/include -isystem /usr/include/apr-1.0 -isystem /mesos/build/3rdparty/boost-1.53.0/src/boost-1.53.0 -isystem /mesos/build/3rdparty/elfio-3.2/src/elfio-3.2 -isystem /mesos/build/3rdparty/glog-0.3.3/src/glog-0.3.3-lib/lib/include -isystem /mesos/build/3rdparty/nvml-352.79/src/nvml-352.79 -isystem /mesos/build/3rdparty/picojson-1.3.0/src/picojson-1.3.0 -isystem /usr/include/subversion-1 -isystem /mesos/3rdparty/stout/include -isystem /mesos/build/3rdparty/http_parser-2.6.2/src/http_parser-2.6.2 -isystem /mesos/build/3rdparty/concurrentqueue-1.0.0-beta/src/concurrentqueue-1.0.0-beta -isystem /mesos/build/3rdparty/libev-4.22/src/libev-4.22 -isystem /mesos/build/3rdparty/zookeeper-3.4.8/src/zookeeper-3.4.8/src/c/include -isystem /mesos/build/3rdparty/zookeeper-3.4.8/src/zookeeper-3.4.8/src/c/generated -isystem /mesos/build/3rdparty/leveldb-1.19/src/leveldb-1.19/include -I/mesos/include -isystem /mesos/build/3rdparty/googletest-1.8.0/src/googletest-1.8.0/googlemock/include -isystem /mesos/build/3rdparty/googletest-1.8.0/src/googletest-1.8.0/googletest/include    -o CMakeFiles/mesos-tests.dir/resources_utils.cpp.o -c /mesos/src/tests/resources_utils.cpp
/usr/bin/cmake -E cmake_progress_report /mesos/build/CMakeFiles 
[ 81%] Building CXX object src/tests/CMakeFiles/mesos-tests.dir/utils.cpp.o
cd /mesos/build/src/tests && /usr/bin/clang++-3.5   -DBUILD_DIR=\"/mesos/build\" -DBUILD_FLAGS=\"\" -DBUILD_JAVA_JVM_LIBRARY=\"\" -DHAS_AUTHENTICATION=1 -DLIBDIR=\"/usr/local/libmesos\" -DPICOJSON_USE_INT64 -DPKGDATADIR=\"/usr/local/share/mesos\" -DPKGLIBEXECDIR=\"/usr/local/libexec/mesos\" -DPKGMODULEDIR=\"\" -DSBINDIR=\"\" -DSOURCE_DIR=\"/mesos\" -DTESTLIBEXECDIR=\"\" -DUSE_CMAKE_BUILD_CONFIG -DUSE_STATIC_LIB -DVERSION=\"1.4.0\" -D__STDC_FORMAT_MACROS -std=c++11 -fPIE -I/mesos/build/include -I/mesos/build/include/mesos -I/mesos/build/src -I/mesos/src -isystem /mesos/build/3rdparty/protobuf-3.3.0/src/protobuf-3.3.0-lib/lib/include -isystem /mesos/3rdparty/libprocess/include -isystem /usr/include/apr-1.0 -isystem /mesos/build/3rdparty/boost-1.53.0/src/boost-1.53.0 -isystem /mesos/build/3rdparty/elfio-3.2/src/elfio-3.2 -isystem /mesos/build/3rdparty/glog-0.3.3/src/glog-0.3.3-lib/lib/include -isystem /mesos/build/3rdparty/nvml-352.79/src/nvml-352.79 -isystem /mesos/build/3rdparty/picojson-1.3.0/src/picojson-1.3.0 -isystem /usr/include/subversion-1 -isystem /mesos/3rdparty/stout/include -isystem /mesos/build/3rdparty/http_parser-2.6.2/src/http_parser-2.6.2 -isystem /mesos/build/3rdparty/concurrentqueue-1.0.0-beta/src/concurrentqueue-1.0.0-beta -isystem /mesos/build/3rdparty/libev-4.22/src/libev-4.22 -isystem /mesos/build/3rdparty/zookeeper-3.4.8/src/zookeeper-3.4.8/src/c/include -isystem /mesos/build/3rdparty/zookeeper-3.4.8/src/zookeeper-3.4.8/src/c/generated -isystem /mesos/build/3rdparty/leveldb-1.19/src/leveldb-1.19/include -I/mesos/include -isystem /mesos/build/3rdparty/googletest-1.8.0/src/googletest-1.8.0/googlemock/include -isystem /mesos/build/3rdparty/googletest-1.8.0/src/googletest-1.8.0/googletest/include    -o CMakeFiles/mesos-tests.dir/utils.cpp.o -c /mesos/src/tests/utils.cpp
/usr/bin/cmake -E cmake_progress_report /mesos/build/CMakeFiles 
[ 81%] Building CXX object src/tests/CMakeFiles/mesos-tests.dir/containerizer/launcher.cpp.o
cd /mesos/build/src/tests && /usr/bin/clang++-3.5   -DBUILD_DIR=\"/mesos/build\" -DBUILD_FLAGS=\"\" -DBUILD_JAVA_JVM_LIBRARY=\"\" -DHAS_AUTHENTICATION=1 -DLIBDIR=\"/usr/local/libmesos\" -DPICOJSON_USE_INT64 -DPKGDATADIR=\"/usr/local/share/mesos\" -DPKGLIBEXECDIR=\"/usr/local/libexec/mesos\" -DPKGMODULEDIR=\"\" -DSBINDIR=\"\" -DSOURCE_DIR=\"/mesos\" -DTESTLIBEXECDIR=\"\" -DUSE_CMAKE_BUILD_CONFIG -DUSE_STATIC_LIB -DVERSION=\"1.4.0\" -D__STDC_FORMAT_MACROS -std=c++11 -fPIE -I/mesos/build/include -I/mesos/build/include/mesos -I/mesos/build/src -I/mesos/src -isystem /mesos/build/3rdparty/protobuf-3.3.0/src/protobuf-3.3.0-lib/lib/include -isystem /mesos/3rdparty/libprocess/include -isystem /usr/include/apr-1.0 -isystem /mesos/build/3rdparty/boost-1.53.0/src/boost-1.53.0 -isystem /mesos/build/3rdparty/elfio-3.2/src/elfio-3.2 -isystem /mesos/build/3rdparty/glog-0.3.3/src/glog-0.3.3-lib/lib/include -isystem /mesos/build/3rdparty/nvml-352.79/src/nvml-352.79 -isystem /mesos/build/3rdparty/picojson-1.3.0/src/picojson-1.3.0 -isystem /usr/include/subversion-1 -isystem /mesos/3rdparty/stout/include -isystem /mesos/build/3rdparty/http_parser-2.6.2/src/http_parser-2.6.2 -isystem /mesos/build/3rdparty/concurrentqueue-1.0.0-beta/src/concurrentqueue-1.0.0-beta -isystem /mesos/build/3rdparty/libev-4.22/src/libev-4.22 -isystem /mesos/build/3rdparty/zookeeper-3.4.8/src/zookeeper-3.4.8/src/c/include -isystem /mesos/build/3rdparty/zookeeper-3.4.8/src/zookeeper-3.4.8/src/c/generated -isystem /mesos/build/3rdparty/leveldb-1.19/src/leveldb-1.19/include -I/mesos/include -isystem /mesos/build/3rdparty/googletest-1.8.0/src/googletest-1.8.0/googlemock/include -isystem /mesos/build/3rdparty/googletest-1.8.0/src/googletest-1.8.0/googletest/include    -o CMakeFiles/mesos-tests.dir/containerizer/launcher.cpp.o -c /mesos/src/tests/containerizer/launcher.cpp
/usr/bin/cmake -E cmake_progress_report /mesos/build/CMakeFiles 
[ 81%] Building CXX object src/tests/CMakeFiles/mesos-tests.dir/kill_policy_test_helper.cpp.o
cd /mesos/build/src/tests && /usr/bin/clang++-3.5   -DBUILD_DIR=\"/mesos/build\" -DBUILD_FLAGS=\"\" -DBUILD_JAVA_JVM_LIBRARY=\"\" -DHAS_AUTHENTICATION=1 -DLIBDIR=\"/usr/local/libmesos\" -DPICOJSON_USE_INT64 -DPKGDATADIR=\"/usr/local/share/mesos\" -DPKGLIBEXECDIR=\"/usr/local/libexec/mesos\" -DPKGMODULEDIR=\"\" -DSBINDIR=\"\" -DSOURCE_DIR=\"/mesos\" -DTESTLIBEXECDIR=\"\" -DUSE_CMAKE_BUILD_CONFIG -DUSE_STATIC_LIB -DVERSION=\"1.4.0\" -D__STDC_FORMAT_MACROS -std=c++11 -fPIE -I/mesos/build/include -I/mesos/build/include/mesos -I/mesos/build/src -I/mesos/src -isystem /mesos/build/3rdparty/protobuf-3.3.0/src/protobuf-3.3.0-lib/lib/include -isystem /mesos/3rdparty/libprocess/include -isystem /usr/include/apr-1.0 -isystem /mesos/build/3rdparty/boost-1.53.0/src/boost-1.53.0 -isystem /mesos/build/3rdparty/elfio-3.2/src/elfio-3.2 -isystem /mesos/build/3rdparty/glog-0.3.3/src/glog-0.3.3-lib/lib/include -isystem /mesos/build/3rdparty/nvml-352.79/src/nvml-352.79 -isystem /mesos/build/3rdparty/picojson-1.3.0/src/picojson-1.3.0 -isystem /usr/include/subversion-1 -isystem /mesos/3rdparty/stout/include -isystem /mesos/build/3rdparty/http_parser-2.6.2/src/http_parser-2.6.2 -isystem /mesos/build/3rdparty/concurrentqueue-1.0.0-beta/src/concurrentqueue-1.0.0-beta -isystem /mesos/build/3rdparty/libev-4.22/src/libev-4.22 -isystem /mesos/build/3rdparty/zookeeper-3.4.8/src/zookeeper-3.4.8/src/c/include -isystem /mesos/build/3rdparty/zookeeper-3.4.8/src/zookeeper-3.4.8/src/c/generated -isystem /mesos/build/3rdparty/leveldb-1.19/src/leveldb-1.19/include -I/mesos/include -isystem /mesos/build/3rdparty/googletest-1.8.0/src/googletest-1.8.0/googlemock/include -isystem /mesos/build/3rdparty/googletest-1.8.0/src/googletest-1.8.0/googletest/include    -o CMakeFiles/mesos-tests.dir/kill_policy_test_helper.cpp.o -c /mesos/src/tests/kill_policy_test_helper.cpp
/usr/bin/cmake -E cmake_progress_report /mesos/build/CMakeFiles 62
[ 82%] Building CXX object src/tests/CMakeFiles/mesos-tests.dir/script.cpp.o
cd /mesos/build/src/tests && /usr/bin/clang++-3.5   -DBUILD_DIR=\"/mesos/build\" -DBUILD_FLAGS=\"\" -DBUILD_JAVA_JVM_LIBRARY=\"\" -DHAS_AUTHENTICATION=1 -DLIBDIR=\"/usr/local/libmesos\" -DPICOJSON_USE_INT64 -DPKGDATADIR=\"/usr/local/share/mesos\" -DPKGLIBEXECDIR=\"/usr/local/libexec/mesos\" -DPKGMODULEDIR=\"\" -DSBINDIR=\"\" -DSOURCE_DIR=\"/mesos\" -DTESTLIBEXECDIR=\"\" -DUSE_CMAKE_BUILD_CONFIG -DUSE_STATIC_LIB -DVERSION=\"1.4.0\" -D__STDC_FORMAT_MACROS -std=c++11 -fPIE -I/mesos/build/include -I/mesos/build/include/mesos -I/mesos/build/src -I/mesos/src -isystem /mesos/build/3rdparty/protobuf-3.3.0/src/protobuf-3.3.0-lib/lib/include -isystem /mesos/3rdparty/libprocess/include -isystem /usr/include/apr-1.0 -isystem /mesos/build/3rdparty/boost-1.53.0/src/boost-1.53.0 -isystem /mesos/build/3rdparty/elfio-3.2/src/elfio-3.2 -isystem /mesos/build/3rdparty/glog-0.3.3/src/glog-0.3.3-lib/lib/include -isystem /mesos/build/3rdparty/nvml-352.79/src/nvml-352.79 -isystem /mesos/build/3rdparty/picojson-1.3.0/src/picojson-1.3.0 -isystem /usr/include/subversion-1 -isystem /mesos/3rdparty/stout/include -isystem /mesos/build/3rdparty/http_parser-2.6.2/src/http_parser-2.6.2 -isystem /mesos/build/3rdparty/concurrentqueue-1.0.0-beta/src/concurrentqueue-1.0.0-beta -isystem /mesos/build/3rdparty/libev-4.22/src/libev-4.22 -isystem /mesos/build/3rdparty/zookeeper-3.4.8/src/zookeeper-3.4.8/src/c/include -isystem /mesos/build/3rdparty/zookeeper-3.4.8/src/zookeeper-3.4.8/src/c/generated -isystem /mesos/build/3rdparty/leveldb-1.19/src/leveldb-1.19/include -I/mesos/include -isystem /mesos/build/3rdparty/googletest-1.8.0/src/googletest-1.8.0/googlemock/include -isystem /mesos/build/3rdparty/googletest-1.8.0/src/googletest-1.8.0/googletest/include    -o CMakeFiles/mesos-tests.dir/script.cpp.o -c /mesos/src/tests/script.cpp
/usr/bin/cmake -E cmake_progress_report /mesos/build/CMakeFiles 
[ 82%] Building CXX object src/tests/CMakeFiles/mesos-tests.dir/containerizer/memory_test_helper.cpp.o
cd /mesos/build/src/tests && /usr/bin/clang++-3.5   -DBUILD_DIR=\"/mesos/build\" -DBUILD_FLAGS=\"\" -DBUILD_JAVA_JVM_LIBRARY=\"\" -DHAS_AUTHENTICATION=1 -DLIBDIR=\"/usr/local/libmesos\" -DPICOJSON_USE_INT64 -DPKGDATADIR=\"/usr/local/share/mesos\" -DPKGLIBEXECDIR=\"/usr/local/libexec/mesos\" -DPKGMODULEDIR=\"\" -DSBINDIR=\"\" -DSOURCE_DIR=\"/mesos\" -DTESTLIBEXECDIR=\"\" -DUSE_CMAKE_BUILD_CONFIG -DUSE_STATIC_LIB -DVERSION=\"1.4.0\" -D__STDC_FORMAT_MACROS -std=c++11 -fPIE -I/mesos/build/include -I/mesos/build/include/mesos -I/mesos/build/src -I/mesos/src -isystem /mesos/build/3rdparty/protobuf-3.3.0/src/protobuf-3.3.0-lib/lib/include -isystem /mesos/3rdparty/libprocess/include -isystem /usr/include/apr-1.0 -isystem /mesos/build/3rdparty/boost-1.53.0/src/boost-1.53.0 -isystem /mesos/build/3rdparty/elfio-3.2/src/elfio-3.2 -isystem /mesos/build/3rdparty/glog-0.3.3/src/glog-0.3.3-lib/lib/include -isystem /mesos/build/3rdparty/nvml-352.79/src/nvml-352.79 -isystem /mesos/build/3rdparty/picojson-1.3.0/src/picojson-1.3.0 -isystem /usr/include/subversion-1 -isystem /mesos/3rdparty/stout/include -isystem /mesos/build/3rdparty/http_parser-2.6.2/src/http_parser-2.6.2 -isystem /mesos/build/3rdparty/concurrentqueue-1.0.0-beta/src/concurrentqueue-1.0.0-beta -isystem /mesos/build/3rdparty/libev-4.22/src/libev-4.22 -isystem /mesos/build/3rdparty/zookeeper-3.4.8/src/zookeeper-3.4.8/src/c/include -isystem /mesos/build/3rdparty/zookeeper-3.4.8/src/zookeeper-3.4.8/src/c/generated -isystem /mesos/build/3rdparty/leveldb-1.19/src/leveldb-1.19/include -I/mesos/include -isystem /mesos/build/3rdparty/googletest-1.8.0/src/googletest-1.8.0/googlemock/include -isystem /mesos/build/3rdparty/googletest-1.8.0/src/googletest-1.8.0/googletest/include    -o CMakeFiles/mesos-tests.dir/containerizer/memory_test_helper.cpp.o -c /mesos/src/tests/containerizer/memory_test_helper.cpp
/usr/bin/cmake -E cmake_progress_report /mesos/build/CMakeFiles 
[ 82%] Building CXX object src/tests/CMakeFiles/mesos-tests.dir/containerizer/capabilities_test_helper.cpp.o
cd /mesos/build/src/tests && /usr/bin/clang++-3.5   -DBUILD_DIR=\"/mesos/build\" -DBUILD_FLAGS=\"\" -DBUILD_JAVA_JVM_LIBRARY=\"\" -DHAS_AUTHENTICATION=1 -DLIBDIR=\"/usr/local/libmesos\" -DPICOJSON_USE_INT64 -DPKGDATADIR=\"/usr/local/share/mesos\" -DPKGLIBEXECDIR=\"/usr/local/libexec/mesos\" -DPKGMODULEDIR=\"\" -DSBINDIR=\"\" -DSOURCE_DIR=\"/mesos\" -DTESTLIBEXECDIR=\"\" -DUSE_CMAKE_BUILD_CONFIG -DUSE_STATIC_LIB -DVERSION=\"1.4.0\" -D__STDC_FORMAT_MACROS -std=c++11 -fPIE -I/mesos/build/include -I/mesos/build/include/mesos -I/mesos/build/src -I/mesos/src -isystem /mesos/build/3rdparty/protobuf-3.3.0/src/protobuf-3.3.0-lib/lib/include -isystem /mesos/3rdparty/libprocess/include -isystem /usr/include/apr-1.0 -isystem /mesos/build/3rdparty/boost-1.53.0/src/boost-1.53.0 -isystem /mesos/build/3rdparty/elfio-3.2/src/elfio-3.2 -isystem /mesos/build/3rdparty/glog-0.3.3/src/glog-0.3.3-lib/lib/include -isystem /mesos/build/3rdparty/nvml-352.79/src/nvml-352.79 -isystem /mesos/build/3rdparty/picojson-1.3.0/src/picojson-1.3.0 -isystem /usr/include/subversion-1 -isystem /mesos/3rdparty/stout/include -isystem /mesos/build/3rdparty/http_parser-2.6.2/src/http_parser-2.6.2 -isystem /mesos/build/3rdparty/concurrentqueue-1.0.0-beta/src/concurrentqueue-1.0.0-beta -isystem /mesos/build/3rdparty/libev-4.22/src/libev-4.22 -isystem /mesos/build/3rdparty/zookeeper-3.4.8/src/zookeeper-3.4.8/src/c/include -isystem /mesos/build/3rdparty/zookeeper-3.4.8/src/zookeeper-3.4.8/src/c/generated -isystem /mesos/build/3rdparty/leveldb-1.19/src/leveldb-1.19/include -I/mesos/include -isystem /mesos/build/3rdparty/googletest-1.8.0/src/googletest-1.8.0/googlemock/include -isystem /mesos/build/3rdparty/googletest-1.8.0/src/googletest-1.8.0/googletest/include    -o CMakeFiles/mesos-tests.dir/containerizer/capabilities_test_helper.cpp.o -c /mesos/src/tests/containerizer/capabilities_test_helper.cpp
/usr/bin/cmake -E cmake_progress_report /mesos/build/CMakeFiles 
[ 82%] Building CXX object src/tests/CMakeFiles/mesos-tests.dir/containerizer/setns_test_helper.cpp.o
cd /mesos/build/src/tests && /usr/bin/clang++-3.5   -DBUILD_DIR=\"/mesos/build\" -DBUILD_FLAGS=\"\" -DBUILD_JAVA_JVM_LIBRARY=\"\" -DHAS_AUTHENTICATION=1 -DLIBDIR=\"/usr/local/libmesos\" -DPICOJSON_USE_INT64 -DPKGDATADIR=\"/usr/local/share/mesos\" -DPKGLIBEXECDIR=\"/usr/local/libexec/mesos\" -DPKGMODULEDIR=\"\" -DSBINDIR=\"\" -DSOURCE_DIR=\"/mesos\" -DTESTLIBEXECDIR=\"\" -DUSE_CMAKE_BUILD_CONFIG -DUSE_STATIC_LIB -DVERSION=\"1.4.0\" -D__STDC_FORMAT_MACROS -std=c++11 -fPIE -I/mesos/build/include -I/mesos/build/include/mesos -I/mesos/build/src -I/mesos/src -isystem /mesos/build/3rdparty/protobuf-3.3.0/src/protobuf-3.3.0-lib/lib/include -isystem /mesos/3rdparty/libprocess/include -isystem /usr/include/apr-1.0 -isystem /mesos/build/3rdparty/boost-1.53.0/src/boost-1.53.0 -isystem /mesos/build/3rdparty/elfio-3.2/src/elfio-3.2 -isystem /mesos/build/3rdparty/glog-0.3.3/src/glog-0.3.3-lib/lib/include -isystem /mesos/build/3rdparty/nvml-352.79/src/nvml-352.79 -isystem /mesos/build/3rdparty/picojson-1.3.0/src/picojson-1.3.0 -isystem /usr/include/subversion-1 -isystem /mesos/3rdparty/stout/include -isystem /mesos/build/3rdparty/http_parser-2.6.2/src/http_parser-2.6.2 -isystem /mesos/build/3rdparty/concurrentqueue-1.0.0-beta/src/concurrentqueue-1.0.0-beta -isystem /mesos/build/3rdparty/libev-4.22/src/libev-4.22 -isystem /mesos/build/3rdparty/zookeeper-3.4.8/src/zookeeper-3.4.8/src/c/include -isystem /mesos/build/3rdparty/zookeeper-3.4.8/src/zookeeper-3.4.8/src/c/generated -isystem /mesos/build/3rdparty/leveldb-1.19/src/leveldb-1.19/include -I/mesos/include -isystem /mesos/build/3rdparty/googletest-1.8.0/src/googletest-1.8.0/googlemock/include -isystem /mesos/build/3rdparty/googletest-1.8.0/src/googletest-1.8.0/googletest/include    -o CMakeFiles/mesos-tests.dir/containerizer/setns_test_helper.cpp.o -c /mesos/src/tests/containerizer/setns_test_helper.cpp
/usr/bin/cmake -E cmake_progress_report /mesos/build/CMakeFiles 
[ 82%] Building CXX object src/tests/CMakeFiles/mesos-tests.dir/anonymous_tests.cpp.o
cd /mesos/build/src/tests && /usr/bin/clang++-3.5   -DBUILD_DIR=\"/mesos/build\" -DBUILD_FLAGS=\"\" -DBUILD_JAVA_JVM_LIBRARY=\"\" -DHAS_AUTHENTICATION=1 -DLIBDIR=\"/usr/local/libmesos\" -DPICOJSON_USE_INT64 -DPKGDATADIR=\"/usr/local/share/mesos\" -DPKGLIBEXECDIR=\"/usr/local/libexec/mesos\" -DPKGMODULEDIR=\"\" -DSBINDIR=\"\" -DSOURCE_DIR=\"/mesos\" -DTESTLIBEXECDIR=\"\" -DUSE_CMAKE_BUILD_CONFIG -DUSE_STATIC_LIB -DVERSION=\"1.4.0\" -D__STDC_FORMAT_MACROS -std=c++11 -fPIE -I/mesos/build/include -I/mesos/build/include/mesos -I/mesos/build/src -I/mesos/src -isystem /mesos/build/3rdparty/protobuf-3.3.0/src/protobuf-3.3.0-lib/lib/include -isystem /mesos/3rdparty/libprocess/include -isystem /usr/include/apr-1.0 -isystem /mesos/build/3rdparty/boost-1.53.0/src/boost-1.53.0 -isystem /mesos/build/3rdparty/elfio-3.2/src/elfio-3.2 -isystem /mesos/build/3rdparty/glog-0.3.3/src/glog-0.3.3-lib/lib/include -isystem /mesos/build/3rdparty/nvml-352.79/src/nvml-352.79 -isystem /mesos/build/3rdparty/picojson-1.3.0/src/picojson-1.3.0 -isystem /usr/include/subversion-1 -isystem /mesos/3rdparty/stout/include -isystem /mesos/build/3rdparty/http_parser-2.6.2/src/http_parser-2.6.2 -isystem /mesos/build/3rdparty/concurrentqueue-1.0.0-beta/src/concurrentqueue-1.0.0-beta -isystem /mesos/build/3rdparty/libev-4.22/src/libev-4.22 -isystem /mesos/build/3rdparty/zookeeper-3.4.8/src/zookeeper-3.4.8/src/c/include -isystem /mesos/build/3rdparty/zookeeper-3.4.8/src/zookeeper-3.4.8/src/c/generated -isystem /mesos/build/3rdparty/leveldb-1.19/src/leveldb-1.19/include -I/mesos/include -isystem /mesos/build/3rdparty/googletest-1.8.0/src/googletest-1.8.0/googlemock/include -isystem /mesos/build/3rdparty/googletest-1.8.0/src/googletest-1.8.0/googletest/include    -o CMakeFiles/mesos-tests.dir/anonymous_tests.cpp.o -c /mesos/src/tests/anonymous_tests.cpp
/usr/bin/cmake -E cmake_progress_report /mesos/build/CMakeFiles 
[ 82%] Building CXX object src/tests/CMakeFiles/mesos-tests.dir/api_tests.cpp.o
cd /mesos/build/src/tests && /usr/bin/clang++-3.5   -DBUILD_DIR=\"/mesos/build\" -DBUILD_FLAGS=\"\" -DBUILD_JAVA_JVM_LIBRARY=\"\" -DHAS_AUTHENTICATION=1 -DLIBDIR=\"/usr/local/libmesos\" -DPICOJSON_USE_INT64 -DPKGDATADIR=\"/usr/local/share/mesos\" -DPKGLIBEXECDIR=\"/usr/local/libexec/mesos\" -DPKGMODULEDIR=\"\" -DSBINDIR=\"\" -DSOURCE_DIR=\"/mesos\" -DTESTLIBEXECDIR=\"\" -DUSE_CMAKE_BUILD_CONFIG -DUSE_STATIC_LIB -DVERSION=\"1.4.0\" -D__STDC_FORMAT_MACROS -std=c++11 -fPIE -I/mesos/build/include -I/mesos/build/include/mesos -I/mesos/build/src -I/mesos/src -isystem /mesos/build/3rdparty/protobuf-3.3.0/src/protobuf-3.3.0-lib/lib/include -isystem /mesos/3rdparty/libprocess/include -isystem /usr/include/apr-1.0 -isystem /mesos/build/3rdparty/boost-1.53.0/src/boost-1.53.0 -isystem /mesos/build/3rdparty/elfio-3.2/src/elfio-3.2 -isystem /mesos/build/3rdparty/glog-0.3.3/src/glog-0.3.3-lib/lib/include -isystem /mesos/build/3rdparty/nvml-352.79/src/nvml-352.79 -isystem /mesos/build/3rdparty/picojson-1.3.0/src/picojson-1.3.0 -isystem /usr/include/subversion-1 -isystem /mesos/3rdparty/stout/include -isystem /mesos/build/3rdparty/http_parser-2.6.2/src/http_parser-2.6.2 -isystem /mesos/build/3rdparty/concurrentqueue-1.0.0-beta/src/concurrentqueue-1.0.0-beta -isystem /mesos/build/3rdparty/libev-4.22/src/libev-4.22 -isystem /mesos/build/3rdparty/zookeeper-3.4.8/src/zookeeper-3.4.8/src/c/include -isystem /mesos/build/3rdparty/zookeeper-3.4.8/src/zookeeper-3.4.8/src/c/generated -isystem /mesos/build/3rdparty/leveldb-1.19/src/leveldb-1.19/include -I/mesos/include -isystem /mesos/build/3rdparty/googletest-1.8.0/src/googletest-1.8.0/googlemock/include -isystem /mesos/build/3rdparty/googletest-1.8.0/src/googletest-1.8.0/googletest/include    -o CMakeFiles/mesos-tests.dir/api_tests.cpp.o -c /mesos/src/tests/api_tests.cpp
/usr/bin/cmake -E cmake_progress_report /mesos/build/CMakeFiles 
[ 82%] Building CXX object src/tests/CMakeFiles/mesos-tests.dir/attributes_tests.cpp.o
cd /mesos/build/src/tests && /usr/bin/clang++-3.5   -DBUILD_DIR=\"/mesos/build\" -DBUILD_FLAGS=\"\" -DBUILD_JAVA_JVM_LIBRARY=\"\" -DHAS_AUTHENTICATION=1 -DLIBDIR=\"/usr/local/libmesos\" -DPICOJSON_USE_INT64 -DPKGDATADIR=\"/usr/local/share/mesos\" -DPKGLIBEXECDIR=\"/usr/local/libexec/mesos\" -DPKGMODULEDIR=\"\" -DSBINDIR=\"\" -DSOURCE_DIR=\"/mesos\" -DTESTLIBEXECDIR=\"\" -DUSE_CMAKE_BUILD_CONFIG -DUSE_STATIC_LIB -DVERSION=\"1.4.0\" -D__STDC_FORMAT_MACROS -std=c++11 -fPIE -I/mesos/build/include -I/mesos/build/include/mesos -I/mesos/build/src -I/mesos/src -isystem /mesos/build/3rdparty/protobuf-3.3.0/src/protobuf-3.3.0-lib/lib/include -isystem /mesos/3rdparty/libprocess/include -isystem /usr/include/apr-1.0 -isystem /mesos/build/3rdparty/boost-1.53.0/src/boost-1.53.0 -isystem /mesos/build/3rdparty/elfio-3.2/src/elfio-3.2 -isystem /mesos/build/3rdparty/glog-0.3.3/src/glog-0.3.3-lib/lib/include -isystem /mesos/build/3rdparty/nvml-352.79/src/nvml-352.79 -isystem /mesos/build/3rdparty/picojson-1.3.0/src/picojson-1.3.0 -isystem /usr/include/subversion-1 -isystem /mesos/3rdparty/stout/include -isystem /mesos/build/3rdparty/http_parser-2.6.2/src/http_parser-2.6.2 -isystem /mesos/build/3rdparty/concurrentqueue-1.0.0-beta/src/concurrentqueue-1.0.0-beta -isystem /mesos/build/3rdparty/libev-4.22/src/libev-4.22 -isystem /mesos/build/3rdparty/zookeeper-3.4.8/src/zookeeper-3.4.8/src/c/include -isystem /mesos/build/3rdparty/zookeeper-3.4.8/src/zookeeper-3.4.8/src/c/generated -isystem /mesos/build/3rdparty/leveldb-1.19/src/leveldb-1.19/include -I/mesos/include -isystem /mesos/build/3rdparty/googletest-1.8.0/src/googletest-1.8.0/googlemock/include -isystem /mesos/build/3rdparty/googletest-1.8.0/src/googletest-1.8.0/googletest/include    -o CMakeFiles/mesos-tests.dir/attributes_tests.cpp.o -c /mesos/src/tests/attributes_tests.cpp
/usr/bin/cmake -E cmake_progress_report /mesos/build/CMakeFiles 63
[ 83%] Building CXX object src/tests/CMakeFiles/mesos-tests.dir/authentication_tests.cpp.o
cd /mesos/build/src/tests && /usr/bin/clang++-3.5   -DBUILD_DIR=\"/mesos/build\" -DBUILD_FLAGS=\"\" -DBUILD_JAVA_JVM_LIBRARY=\"\" -DHAS_AUTHENTICATION=1 -DLIBDIR=\"/usr/local/libmesos\" -DPICOJSON_USE_INT64 -DPKGDATADIR=\"/usr/local/share/mesos\" -DPKGLIBEXECDIR=\"/usr/local/libexec/mesos\" -DPKGMODULEDIR=\"\" -DSBINDIR=\"\" -DSOURCE_DIR=\"/mesos\" -DTESTLIBEXECDIR=\"\" -DUSE_CMAKE_BUILD_CONFIG -DUSE_STATIC_LIB -DVERSION=\"1.4.0\" -D__STDC_FORMAT_MACROS -std=c++11 -fPIE -I/mesos/build/include -I/mesos/build/include/mesos -I/mesos/build/src -I/mesos/src -isystem /mesos/build/3rdparty/protobuf-3.3.0/src/protobuf-3.3.0-lib/lib/include -isystem /mesos/3rdparty/libprocess/include -isystem /usr/include/apr-1.0 -isystem /mesos/build/3rdparty/boost-1.53.0/src/boost-1.53.0 -isystem /mesos/build/3rdparty/elfio-3.2/src/elfio-3.2 -isystem /mesos/build/3rdparty/glog-0.3.3/src/glog-0.3.3-lib/lib/include -isystem /mesos/build/3rdparty/nvml-352.79/src/nvml-352.79 -isystem /mesos/build/3rdparty/picojson-1.3.0/src/picojson-1.3.0 -isystem /usr/include/subversion-1 -isystem /mesos/3rdparty/stout/include -isystem /mesos/build/3rdparty/http_parser-2.6.2/src/http_parser-2.6.2 -isystem /mesos/build/3rdparty/concurrentqueue-1.0.0-beta/src/concurrentqueue-1.0.0-beta -isystem /mesos/build/3rdparty/libev-4.22/src/libev-4.22 -isystem /mesos/build/3rdparty/zookeeper-3.4.8/src/zookeeper-3.4.8/src/c/include -isystem /mesos/build/3rdparty/zookeeper-3.4.8/src/zookeeper-3.4.8/src/c/generated -isystem /mesos/build/3rdparty/leveldb-1.19/src/leveldb-1.19/include -I/mesos/include -isystem /mesos/build/3rdparty/googletest-1.8.0/src/googletest-1.8.0/googlemock/include -isystem /mesos/build/3rdparty/googletest-1.8.0/src/googletest-1.8.0/googletest/include    -o CMakeFiles/mesos-tests.dir/authentication_tests.cpp.o -c /mesos/src/tests/authentication_tests.cpp
/usr/bin/cmake -E cmake_progress_report /mesos/build/CMakeFiles 
[ 83%] Building CXX object src/tests/CMakeFiles/mesos-tests.dir/check_tests.cpp.o
cd /mesos/build/src/tests && /usr/bin/clang++-3.5   -DBUILD_DIR=\"/mesos/build\" -DBUILD_FLAGS=\"\" -DBUILD_JAVA_JVM_LIBRARY=\"\" -DHAS_AUTHENTICATION=1 -DLIBDIR=\"/usr/local/libmesos\" -DPICOJSON_USE_INT64 -DPKGDATADIR=\"/usr/local/share/mesos\" -DPKGLIBEXECDIR=\"/usr/local/libexec/mesos\" -DPKGMODULEDIR=\"\" -DSBINDIR=\"\" -DSOURCE_DIR=\"/mesos\" -DTESTLIBEXECDIR=\"\" -DUSE_CMAKE_BUILD_CONFIG -DUSE_STATIC_LIB -DVERSION=\"1.4.0\" -D__STDC_FORMAT_MACROS -std=c++11 -fPIE -I/mesos/build/include -I/mesos/build/include/mesos -I/mesos/build/src -I/mesos/src -isystem /mesos/build/3rdparty/protobuf-3.3.0/src/protobuf-3.3.0-lib/lib/include -isystem /mesos/3rdparty/libprocess/include -isystem /usr/include/apr-1.0 -isystem /mesos/build/3rdparty/boost-1.53.0/src/boost-1.53.0 -isystem /mesos/build/3rdparty/elfio-3.2/src/elfio-3.2 -isystem /mesos/build/3rdparty/glog-0.3.3/src/glog-0.3.3-lib/lib/include -isystem /mesos/build/3rdparty/nvml-352.79/src/nvml-352.79 -isystem /mesos/build/3rdparty/picojson-1.3.0/src/picojson-1.3.0 -isystem /usr/include/subversion-1 -isystem /mesos/3rdparty/stout/include -isystem /mesos/build/3rdparty/http_parser-2.6.2/src/http_parser-2.6.2 -isystem /mesos/build/3rdparty/concurrentqueue-1.0.0-beta/src/concurrentqueue-1.0.0-beta -isystem /mesos/build/3rdparty/libev-4.22/src/libev-4.22 -isystem /mesos/build/3rdparty/zookeeper-3.4.8/src/zookeeper-3.4.8/src/c/include -isystem /mesos/build/3rdparty/zookeeper-3.4.8/src/zookeeper-3.4.8/src/c/generated -isystem /mesos/build/3rdparty/leveldb-1.19/src/leveldb-1.19/include -I/mesos/include -isystem /mesos/build/3rdparty/googletest-1.8.0/src/googletest-1.8.0/googlemock/include -isystem /mesos/build/3rdparty/googletest-1.8.0/src/googletest-1.8.0/googletest/include    -o CMakeFiles/mesos-tests.dir/check_tests.cpp.o -c /mesos/src/tests/check_tests.cpp
/usr/bin/cmake -E cmake_progress_report /mesos/build/CMakeFiles 
[ 83%] Building CXX object src/tests/CMakeFiles/mesos-tests.dir/command_executor_tests.cpp.o
cd /mesos/build/src/tests && /usr/bin/clang++-3.5   -DBUILD_DIR=\"/mesos/build\" -DBUILD_FLAGS=\"\" -DBUILD_JAVA_JVM_LIBRARY=\"\" -DHAS_AUTHENTICATION=1 -DLIBDIR=\"/usr/local/libmesos\" -DPICOJSON_USE_INT64 -DPKGDATADIR=\"/usr/local/share/mesos\" -DPKGLIBEXECDIR=\"/usr/local/libexec/mesos\" -DPKGMODULEDIR=\"\" -DSBINDIR=\"\" -DSOURCE_DIR=\"/mesos\" -DTESTLIBEXECDIR=\"\" -DUSE_CMAKE_BUILD_CONFIG -DUSE_STATIC_LIB -DVERSION=\"1.4.0\" -D__STDC_FORMAT_MACROS -std=c++11 -fPIE -I/mesos/build/include -I/mesos/build/include/mesos -I/mesos/build/src -I/mesos/src -isystem /mesos/build/3rdparty/protobuf-3.3.0/src/protobuf-3.3.0-lib/lib/include -isystem /mesos/3rdparty/libprocess/include -isystem /usr/include/apr-1.0 -isystem /mesos/build/3rdparty/boost-1.53.0/src/boost-1.53.0 -isystem /mesos/build/3rdparty/elfio-3.2/src/elfio-3.2 -isystem /mesos/build/3rdparty/glog-0.3.3/src/glog-0.3.3-lib/lib/include -isystem /mesos/build/3rdparty/nvml-352.79/src/nvml-352.79 -isystem /mesos/build/3rdparty/picojson-1.3.0/src/picojson-1.3.0 -isystem /usr/include/subversion-1 -isystem /mesos/3rdparty/stout/include -isystem /mesos/build/3rdparty/http_parser-2.6.2/src/http_parser-2.6.2 -isystem /mesos/build/3rdparty/concurrentqueue-1.0.0-beta/src/concurrentqueue-1.0.0-beta -isystem /mesos/build/3rdparty/libev-4.22/src/libev-4.22 -isystem /mesos/build/3rdparty/zookeeper-3.4.8/src/zookeeper-3.4.8/src/c/include -isystem /mesos/build/3rdparty/zookeeper-3.4.8/src/zookeeper-3.4.8/src/c/generated -isystem /mesos/build/3rdparty/leveldb-1.19/src/leveldb-1.19/include -I/mesos/include -isystem /mesos/build/3rdparty/googletest-1.8.0/src/googletest-1.8.0/googlemock/include -isystem /mesos/build/3rdparty/googletest-1.8.0/src/googletest-1.8.0/googletest/include    -o CMakeFiles/mesos-tests.dir/command_executor_tests.cpp.o -c /mesos/src/tests/command_executor_tests.cpp
/usr/bin/cmake -E cmake_progress_report /mesos/build/CMakeFiles 
[ 83%] Building CXX object src/tests/CMakeFiles/mesos-tests.dir/credentials_tests.cpp.o
cd /mesos/build/src/tests && /usr/bin/clang++-3.5   -DBUILD_DIR=\"/mesos/build\" -DBUILD_FLAGS=\"\" -DBUILD_JAVA_JVM_LIBRARY=\"\" -DHAS_AUTHENTICATION=1 -DLIBDIR=\"/usr/local/libmesos\" -DPICOJSON_USE_INT64 -DPKGDATADIR=\"/usr/local/share/mesos\" -DPKGLIBEXECDIR=\"/usr/local/libexec/mesos\" -DPKGMODULEDIR=\"\" -DSBINDIR=\"\" -DSOURCE_DIR=\"/mesos\" -DTESTLIBEXECDIR=\"\" -DUSE_CMAKE_BUILD_CONFIG -DUSE_STATIC_LIB -DVERSION=\"1.4.0\" -D__STDC_FORMAT_MACROS -std=c++11 -fPIE -I/mesos/build/include -I/mesos/build/include/mesos -I/mesos/build/src -I/mesos/src -isystem /mesos/build/3rdparty/protobuf-3.3.0/src/protobuf-3.3.0-lib/lib/include -isystem /mesos/3rdparty/libprocess/include -isystem /usr/include/apr-1.0 -isystem /mesos/build/3rdparty/boost-1.53.0/src/boost-1.53.0 -isystem /mesos/build/3rdparty/elfio-3.2/src/elfio-3.2 -isystem /mesos/build/3rdparty/glog-0.3.3/src/glog-0.3.3-lib/lib/include -isystem /mesos/build/3rdparty/nvml-352.79/src/nvml-352.79 -isystem /mesos/build/3rdparty/picojson-1.3.0/src/picojson-1.3.0 -isystem /usr/include/subversion-1 -isystem /mesos/3rdparty/stout/include -isystem /mesos/build/3rdparty/http_parser-2.6.2/src/http_parser-2.6.2 -isystem /mesos/build/3rdparty/concurrentqueue-1.0.0-beta/src/concurrentqueue-1.0.0-beta -isystem /mesos/build/3rdparty/libev-4.22/src/libev-4.22 -isystem /mesos/build/3rdparty/zookeeper-3.4.8/src/zookeeper-3.4.8/src/c/include -isystem /mesos/build/3rdparty/zookeeper-3.4.8/src/zookeeper-3.4.8/src/c/generated -isystem /mesos/build/3rdparty/leveldb-1.19/src/leveldb-1.19/include -I/mesos/include -isystem /mesos/build/3rdparty/googletest-1.8.0/src/googletest-1.8.0/googlemock/include -isystem /mesos/build/3rdparty/googletest-1.8.0/src/googletest-1.8.0/googletest/include    -o CMakeFiles/mesos-tests.dir/credentials_tests.cpp.o -c /mesos/src/tests/credentials_tests.cpp
/usr/bin/cmake -E cmake_progress_report /mesos/build/CMakeFiles 
[ 83%] Building CXX object src/tests/CMakeFiles/mesos-tests.dir/default_executor_tests.cpp.o
cd /mesos/build/src/tests && /usr/bin/clang++-3.5   -DBUILD_DIR=\"/mesos/build\" -DBUILD_FLAGS=\"\" -DBUILD_JAVA_JVM_LIBRARY=\"\" -DHAS_AUTHENTICATION=1 -DLIBDIR=\"/usr/local/libmesos\" -DPICOJSON_USE_INT64 -DPKGDATADIR=\"/usr/local/share/mesos\" -DPKGLIBEXECDIR=\"/usr/local/libexec/mesos\" -DPKGMODULEDIR=\"\" -DSBINDIR=\"\" -DSOURCE_DIR=\"/mesos\" -DTESTLIBEXECDIR=\"\" -DUSE_CMAKE_BUILD_CONFIG -DUSE_STATIC_LIB -DVERSION=\"1.4.0\" -D__STDC_FORMAT_MACROS -std=c++11 -fPIE -I/mesos/build/include -I/mesos/build/include/mesos -I/mesos/build/src -I/mesos/src -isystem /mesos/build/3rdparty/protobuf-3.3.0/src/protobuf-3.3.0-lib/lib/include -isystem /mesos/3rdparty/libprocess/include -isystem /usr/include/apr-1.0 -isystem /mesos/build/3rdparty/boost-1.53.0/src/boost-1.53.0 -isystem /mesos/build/3rdparty/elfio-3.2/src/elfio-3.2 -isystem /mesos/build/3rdparty/glog-0.3.3/src/glog-0.3.3-lib/lib/include -isystem /mesos/build/3rdparty/nvml-352.79/src/nvml-352.79 -isystem /mesos/build/3rdparty/picojson-1.3.0/src/picojson-1.3.0 -isystem /usr/include/subversion-1 -isystem /mesos/3rdparty/stout/include -isystem /mesos/build/3rdparty/http_parser-2.6.2/src/http_parser-2.6.2 -isystem /mesos/build/3rdparty/concurrentqueue-1.0.0-beta/src/concurrentqueue-1.0.0-beta -isystem /mesos/build/3rdparty/libev-4.22/src/libev-4.22 -isystem /mesos/build/3rdparty/zookeeper-3.4.8/src/zookeeper-3.4.8/src/c/include -isystem /mesos/build/3rdparty/zookeeper-3.4.8/src/zookeeper-3.4.8/src/c/generated -isystem /mesos/build/3rdparty/leveldb-1.19/src/leveldb-1.19/include -I/mesos/include -isystem /mesos/build/3rdparty/googletest-1.8.0/src/googletest-1.8.0/googlemock/include -isystem /mesos/build/3rdparty/googletest-1.8.0/src/googletest-1.8.0/googletest/include    -o CMakeFiles/mesos-tests.dir/default_executor_tests.cpp.o -c /mesos/src/tests/default_executor_tests.cpp
/usr/bin/cmake -E cmake_progress_report /mesos/build/CMakeFiles 
[ 83%] Building CXX object src/tests/CMakeFiles/mesos-tests.dir/exception_tests.cpp.o
cd /mesos/build/src/tests && /usr/bin/clang++-3.5   -DBUILD_DIR=\"/mesos/build\" -DBUILD_FLAGS=\"\" -DBUILD_JAVA_JVM_LIBRARY=\"\" -DHAS_AUTHENTICATION=1 -DLIBDIR=\"/usr/local/libmesos\" -DPICOJSON_USE_INT64 -DPKGDATADIR=\"/usr/local/share/mesos\" -DPKGLIBEXECDIR=\"/usr/local/libexec/mesos\" -DPKGMODULEDIR=\"\" -DSBINDIR=\"\" -DSOURCE_DIR=\"/mesos\" -DTESTLIBEXECDIR=\"\" -DUSE_CMAKE_BUILD_CONFIG -DUSE_STATIC_LIB -DVERSION=\"1.4.0\" -D__STDC_FORMAT_MACROS -std=c++11 -fPIE -I/mesos/build/include -I/mesos/build/include/mesos -I/mesos/build/src -I/mesos/src -isystem /mesos/build/3rdparty/protobuf-3.3.0/src/protobuf-3.3.0-lib/lib/include -isystem /mesos/3rdparty/libprocess/include -isystem /usr/include/apr-1.0 -isystem /mesos/build/3rdparty/boost-1.53.0/src/boost-1.53.0 -isystem /mesos/build/3rdparty/elfio-3.2/src/elfio-3.2 -isystem /mesos/build/3rdparty/glog-0.3.3/src/glog-0.3.3-lib/lib/include -isystem /mesos/build/3rdparty/nvml-352.79/src/nvml-352.79 -isystem /mesos/build/3rdparty/picojson-1.3.0/src/picojson-1.3.0 -isystem /usr/include/subversion-1 -isystem /mesos/3rdparty/stout/include -isystem /mesos/build/3rdparty/http_parser-2.6.2/src/http_parser-2.6.2 -isystem /mesos/build/3rdparty/concurrentqueue-1.0.0-beta/src/concurrentqueue-1.0.0-beta -isystem /mesos/build/3rdparty/libev-4.22/src/libev-4.22 -isystem /mesos/build/3rdparty/zookeeper-3.4.8/src/zookeeper-3.4.8/src/c/include -isystem /mesos/build/3rdparty/zookeeper-3.4.8/src/zookeeper-3.4.8/src/c/generated -isystem /mesos/build/3rdparty/leveldb-1.19/src/leveldb-1.19/include -I/mesos/include -isystem /mesos/build/3rdparty/googletest-1.8.0/src/googletest-1.8.0/googlemock/include -isystem /mesos/build/3rdparty/googletest-1.8.0/src/googletest-1.8.0/googletest/include    -o CMakeFiles/mesos-tests.dir/exception_tests.cpp.o -c /mesos/src/tests/exception_tests.cpp
/usr/bin/cmake -E cmake_progress_report /mesos/build/CMakeFiles 
[ 83%] Building CXX object src/tests/CMakeFiles/mesos-tests.dir/executor_http_api_tests.cpp.o
cd /mesos/build/src/tests && /usr/bin/clang++-3.5   -DBUILD_DIR=\"/mesos/build\" -DBUILD_FLAGS=\"\" -DBUILD_JAVA_JVM_LIBRARY=\"\" -DHAS_AUTHENTICATION=1 -DLIBDIR=\"/usr/local/libmesos\" -DPICOJSON_USE_INT64 -DPKGDATADIR=\"/usr/local/share/mesos\" -DPKGLIBEXECDIR=\"/usr/local/libexec/mesos\" -DPKGMODULEDIR=\"\" -DSBINDIR=\"\" -DSOURCE_DIR=\"/mesos\" -DTESTLIBEXECDIR=\"\" -DUSE_CMAKE_BUILD_CONFIG -DUSE_STATIC_LIB -DVERSION=\"1.4.0\" -D__STDC_FORMAT_MACROS -std=c++11 -fPIE -I/mesos/build/include -I/mesos/build/include/mesos -I/mesos/build/src -I/mesos/src -isystem /mesos/build/3rdparty/protobuf-3.3.0/src/protobuf-3.3.0-lib/lib/include -isystem /mesos/3rdparty/libprocess/include -isystem /usr/include/apr-1.0 -isystem /mesos/build/3rdparty/boost-1.53.0/src/boost-1.53.0 -isystem /mesos/build/3rdparty/elfio-3.2/src/elfio-3.2 -isystem /mesos/build/3rdparty/glog-0.3.3/src/glog-0.3.3-lib/lib/include -isystem /mesos/build/3rdparty/nvml-352.79/src/nvml-352.79 -isystem /mesos/build/3rdparty/picojson-1.3.0/src/picojson-1.3.0 -isystem /usr/include/subversion-1 -isystem /mesos/3rdparty/stout/include -isystem /mesos/build/3rdparty/http_parser-2.6.2/src/http_parser-2.6.2 -isystem /mesos/build/3rdparty/concurrentqueue-1.0.0-beta/src/concurrentqueue-1.0.0-beta -isystem /mesos/build/3rdparty/libev-4.22/src/libev-4.22 -isystem /mesos/build/3rdparty/zookeeper-3.4.8/src/zookeeper-3.4.8/src/c/include -isystem /mesos/build/3rdparty/zookeeper-3.4.8/src/zookeeper-3.4.8/src/c/generated -isystem /mesos/build/3rdparty/leveldb-1.19/src/leveldb-1.19/include -I/mesos/include -isystem /mesos/build/3rdparty/googletest-1.8.0/src/googletest-1.8.0/googlemock/include -isystem /mesos/build/3rdparty/googletest-1.8.0/src/googletest-1.8.0/googletest/include    -o CMakeFiles/mesos-tests.dir/executor_http_api_tests.cpp.o -c /mesos/src/tests/executor_http_api_tests.cpp
/usr/bin/cmake -E cmake_progress_report /mesos/build/CMakeFiles 64
[ 84%] Building CXX object src/tests/CMakeFiles/mesos-tests.dir/fault_tolerance_tests.cpp.o
cd /mesos/build/src/tests && /usr/bin/clang++-3.5   -DBUILD_DIR=\"/mesos/build\" -DBUILD_FLAGS=\"\" -DBUILD_JAVA_JVM_LIBRARY=\"\" -DHAS_AUTHENTICATION=1 -DLIBDIR=\"/usr/local/libmesos\" -DPICOJSON_USE_INT64 -DPKGDATADIR=\"/usr/local/share/mesos\" -DPKGLIBEXECDIR=\"/usr/local/libexec/mesos\" -DPKGMODULEDIR=\"\" -DSBINDIR=\"\" -DSOURCE_DIR=\"/mesos\" -DTESTLIBEXECDIR=\"\" -DUSE_CMAKE_BUILD_CONFIG -DUSE_STATIC_LIB -DVERSION=\"1.4.0\" -D__STDC_FORMAT_MACROS -std=c++11 -fPIE -I/mesos/build/include -I/mesos/build/include/mesos -I/mesos/build/src -I/mesos/src -isystem /mesos/build/3rdparty/protobuf-3.3.0/src/protobuf-3.3.0-lib/lib/include -isystem /mesos/3rdparty/libprocess/include -isystem /usr/include/apr-1.0 -isystem /mesos/build/3rdparty/boost-1.53.0/src/boost-1.53.0 -isystem /mesos/build/3rdparty/elfio-3.2/src/elfio-3.2 -isystem /mesos/build/3rdparty/glog-0.3.3/src/glog-0.3.3-lib/lib/include -isystem /mesos/build/3rdparty/nvml-352.79/src/nvml-352.79 -isystem /mesos/build/3rdparty/picojson-1.3.0/src/picojson-1.3.0 -isystem /usr/include/subversion-1 -isystem /mesos/3rdparty/stout/include -isystem /mesos/build/3rdparty/http_parser-2.6.2/src/http_parser-2.6.2 -isystem /mesos/build/3rdparty/concurrentqueue-1.0.0-beta/src/concurrentqueue-1.0.0-beta -isystem /mesos/build/3rdparty/libev-4.22/src/libev-4.22 -isystem /mesos/build/3rdparty/zookeeper-3.4.8/src/zookeeper-3.4.8/src/c/include -isystem /mesos/build/3rdparty/zookeeper-3.4.8/src/zookeeper-3.4.8/src/c/generated -isystem /mesos/build/3rdparty/leveldb-1.19/src/leveldb-1.19/include -I/mesos/include -isystem /mesos/build/3rdparty/googletest-1.8.0/src/googletest-1.8.0/googlemock/include -isystem /mesos/build/3rdparty/googletest-1.8.0/src/googletest-1.8.0/googletest/include    -o CMakeFiles/mesos-tests.dir/fault_tolerance_tests.cpp.o -c /mesos/src/tests/fault_tolerance_tests.cpp
/usr/bin/cmake -E cmake_progress_report /mesos/build/CMakeFiles 
[ 84%] Building CXX object src/tests/CMakeFiles/mesos-tests.dir/fetcher_tests.cpp.o
cd /mesos/build/src/tests && /usr/bin/clang++-3.5   -DBUILD_DIR=\"/mesos/build\" -DBUILD_FLAGS=\"\" -DBUILD_JAVA_JVM_LIBRARY=\"\" -DHAS_AUTHENTICATION=1 -DLIBDIR=\"/usr/local/libmesos\" -DPICOJSON_USE_INT64 -DPKGDATADIR=\"/usr/local/share/mesos\" -DPKGLIBEXECDIR=\"/usr/local/libexec/mesos\" -DPKGMODULEDIR=\"\" -DSBINDIR=\"\" -DSOURCE_DIR=\"/mesos\" -DTESTLIBEXECDIR=\"\" -DUSE_CMAKE_BUILD_CONFIG -DUSE_STATIC_LIB -DVERSION=\"1.4.0\" -D__STDC_FORMAT_MACROS -std=c++11 -fPIE -I/mesos/build/include -I/mesos/build/include/mesos -I/mesos/build/src -I/mesos/src -isystem /mesos/build/3rdparty/protobuf-3.3.0/src/protobuf-3.3.0-lib/lib/include -isystem /mesos/3rdparty/libprocess/include -isystem /usr/include/apr-1.0 -isystem /mesos/build/3rdparty/boost-1.53.0/src/boost-1.53.0 -isystem /mesos/build/3rdparty/elfio-3.2/src/elfio-3.2 -isystem /mesos/build/3rdparty/glog-0.3.3/src/glog-0.3.3-lib/lib/include -isystem /mesos/build/3rdparty/nvml-352.79/src/nvml-352.79 -isystem /mesos/build/3rdparty/picojson-1.3.0/src/picojson-1.3.0 -isystem /usr/include/subversion-1 -isystem /mesos/3rdparty/stout/include -isystem /mesos/build/3rdparty/http_parser-2.6.2/src/http_parser-2.6.2 -isystem /mesos/build/3rdparty/concurrentqueue-1.0.0-beta/src/concurrentqueue-1.0.0-beta -isystem /mesos/build/3rdparty/libev-4.22/src/libev-4.22 -isystem /mesos/build/3rdparty/zookeeper-3.4.8/src/zookeeper-3.4.8/src/c/include -isystem /mesos/build/3rdparty/zookeeper-3.4.8/src/zookeeper-3.4.8/src/c/generated -isystem /mesos/build/3rdparty/leveldb-1.19/src/leveldb-1.19/include -I/mesos/include -isystem /mesos/build/3rdparty/googletest-1.8.0/src/googletest-1.8.0/googlemock/include -isystem /mesos/build/3rdparty/googletest-1.8.0/src/googletest-1.8.0/googletest/include    -o CMakeFiles/mesos-tests.dir/fetcher_tests.cpp.o -c /mesos/src/tests/fetcher_tests.cpp
/usr/bin/cmake -E cmake_progress_report /mesos/build/CMakeFiles 
[ 84%] Building CXX object src/tests/CMakeFiles/mesos-tests.dir/files_tests.cpp.o
cd /mesos/build/src/tests && /usr/bin/clang++-3.5   -DBUILD_DIR=\"/mesos/build\" -DBUILD_FLAGS=\"\" -DBUILD_JAVA_JVM_LIBRARY=\"\" -DHAS_AUTHENTICATION=1 -DLIBDIR=\"/usr/local/libmesos\" -DPICOJSON_USE_INT64 -DPKGDATADIR=\"/usr/local/share/mesos\" -DPKGLIBEXECDIR=\"/usr/local/libexec/mesos\" -DPKGMODULEDIR=\"\" -DSBINDIR=\"\" -DSOURCE_DIR=\"/mesos\" -DTESTLIBEXECDIR=\"\" -DUSE_CMAKE_BUILD_CONFIG -DUSE_STATIC_LIB -DVERSION=\"1.4.0\" -D__STDC_FORMAT_MACROS -std=c++11 -fPIE -I/mesos/build/include -I/mesos/build/include/mesos -I/mesos/build/src -I/mesos/src -isystem /mesos/build/3rdparty/protobuf-3.3.0/src/protobuf-3.3.0-lib/lib/include -isystem /mesos/3rdparty/libprocess/include -isystem /usr/include/apr-1.0 -isystem /mesos/build/3rdparty/boost-1.53.0/src/boost-1.53.0 -isystem /mesos/build/3rdparty/elfio-3.2/src/elfio-3.2 -isystem /mesos/build/3rdparty/glog-0.3.3/src/glog-0.3.3-lib/lib/include -isystem /mesos/build/3rdparty/nvml-352.79/src/nvml-352.79 -isystem /mesos/build/3rdparty/picojson-1.3.0/src/picojson-1.3.0 -isystem /usr/include/subversion-1 -isystem /mesos/3rdparty/stout/include -isystem /mesos/build/3rdparty/http_parser-2.6.2/src/http_parser-2.6.2 -isystem /mesos/build/3rdparty/concurrentqueue-1.0.0-beta/src/concurrentqueue-1.0.0-beta -isystem /mesos/build/3rdparty/libev-4.22/src/libev-4.22 -isystem /mesos/build/3rdparty/zookeeper-3.4.8/src/zookeeper-3.4.8/src/c/include -isystem /mesos/build/3rdparty/zookeeper-3.4.8/src/zookeeper-3.4.8/src/c/generated -isystem /mesos/build/3rdparty/leveldb-1.19/src/leveldb-1.19/include -I/mesos/include -isystem /mesos/build/3rdparty/googletest-1.8.0/src/googletest-1.8.0/googlemock/include -isystem /mesos/build/3rdparty/googletest-1.8.0/src/googletest-1.8.0/googletest/include    -o CMakeFiles/mesos-tests.dir/files_tests.cpp.o -c /mesos/src/tests/files_tests.cpp
/usr/bin/cmake -E cmake_progress_report /mesos/build/CMakeFiles 
[ 84%] Building CXX object src/tests/CMakeFiles/mesos-tests.dir/gc_tests.cpp.o
cd /mesos/build/src/tests && /usr/bin/clang++-3.5   -DBUILD_DIR=\"/mesos/build\" -DBUILD_FLAGS=\"\" -DBUILD_JAVA_JVM_LIBRARY=\"\" -DHAS_AUTHENTICATION=1 -DLIBDIR=\"/usr/local/libmesos\" -DPICOJSON_USE_INT64 -DPKGDATADIR=\"/usr/local/share/mesos\" -DPKGLIBEXECDIR=\"/usr/local/libexec/mesos\" -DPKGMODULEDIR=\"\" -DSBINDIR=\"\" -DSOURCE_DIR=\"/mesos\" -DTESTLIBEXECDIR=\"\" -DUSE_CMAKE_BUILD_CONFIG -DUSE_STATIC_LIB -DVERSION=\"1.4.0\" -D__STDC_FORMAT_MACROS -std=c++11 -fPIE -I/mesos/build/include -I/mesos/build/include/mesos -I/mesos/build/src -I/mesos/src -isystem /mesos/build/3rdparty/protobuf-3.3.0/src/protobuf-3.3.0-lib/lib/include -isystem /mesos/3rdparty/libprocess/include -isystem /usr/include/apr-1.0 -isystem /mesos/build/3rdparty/boost-1.53.0/src/boost-1.53.0 -isystem /mesos/build/3rdparty/elfio-3.2/src/elfio-3.2 -isystem /mesos/build/3rdparty/glog-0.3.3/src/glog-0.3.3-lib/lib/include -isystem /mesos/build/3rdparty/nvml-352.79/src/nvml-352.79 -isystem /mesos/build/3rdparty/picojson-1.3.0/src/picojson-1.3.0 -isystem /usr/include/subversion-1 -isystem /mesos/3rdparty/stout/include -isystem /mesos/build/3rdparty/http_parser-2.6.2/src/http_parser-2.6.2 -isystem /mesos/build/3rdparty/concurrentqueue-1.0.0-beta/src/concurrentqueue-1.0.0-beta -isystem /mesos/build/3rdparty/libev-4.22/src/libev-4.22 -isystem /mesos/build/3rdparty/zookeeper-3.4.8/src/zookeeper-3.4.8/src/c/include -isystem /mesos/build/3rdparty/zookeeper-3.4.8/src/zookeeper-3.4.8/src/c/generated -isystem /mesos/build/3rdparty/leveldb-1.19/src/leveldb-1.19/include -I/mesos/include -isystem /mesos/build/3rdparty/googletest-1.8.0/src/googletest-1.8.0/googlemock/include -isystem /mesos/build/3rdparty/googletest-1.8.0/src/googletest-1.8.0/googletest/include    -o CMakeFiles/mesos-tests.dir/gc_tests.cpp.o -c /mesos/src/tests/gc_tests.cpp
/usr/bin/cmake -E cmake_progress_report /mesos/build/CMakeFiles 
[ 84%] Building CXX object src/tests/CMakeFiles/mesos-tests.dir/health_check_tests.cpp.o
cd /mesos/build/src/tests && /usr/bin/clang++-3.5   -DBUILD_DIR=\"/mesos/build\" -DBUILD_FLAGS=\"\" -DBUILD_JAVA_JVM_LIBRARY=\"\" -DHAS_AUTHENTICATION=1 -DLIBDIR=\"/usr/local/libmesos\" -DPICOJSON_USE_INT64 -DPKGDATADIR=\"/usr/local/share/mesos\" -DPKGLIBEXECDIR=\"/usr/local/libexec/mesos\" -DPKGMODULEDIR=\"\" -DSBINDIR=\"\" -DSOURCE_DIR=\"/mesos\" -DTESTLIBEXECDIR=\"\" -DUSE_CMAKE_BUILD_CONFIG -DUSE_STATIC_LIB -DVERSION=\"1.4.0\" -D__STDC_FORMAT_MACROS -std=c++11 -fPIE -I/mesos/build/include -I/mesos/build/include/mesos -I/mesos/build/src -I/mesos/src -isystem /mesos/build/3rdparty/protobuf-3.3.0/src/protobuf-3.3.0-lib/lib/include -isystem /mesos/3rdparty/libprocess/include -isystem /usr/include/apr-1.0 -isystem /mesos/build/3rdparty/boost-1.53.0/src/boost-1.53.0 -isystem /mesos/build/3rdparty/elfio-3.2/src/elfio-3.2 -isystem /mesos/build/3rdparty/glog-0.3.3/src/glog-0.3.3-lib/lib/include -isystem /mesos/build/3rdparty/nvml-352.79/src/nvml-352.79 -isystem /mesos/build/3rdparty/picojson-1.3.0/src/picojson-1.3.0 -isystem /usr/include/subversion-1 -isystem /mesos/3rdparty/stout/include -isystem /mesos/build/3rdparty/http_parser-2.6.2/src/http_parser-2.6.2 -isystem /mesos/build/3rdparty/concurrentqueue-1.0.0-beta/src/concurrentqueue-1.0.0-beta -isystem /mesos/build/3rdparty/libev-4.22/src/libev-4.22 -isystem /mesos/build/3rdparty/zookeeper-3.4.8/src/zookeeper-3.4.8/src/c/include -isystem /mesos/build/3rdparty/zookeeper-3.4.8/src/zookeeper-3.4.8/src/c/generated -isystem /mesos/build/3rdparty/leveldb-1.19/src/leveldb-1.19/include -I/mesos/include -isystem /mesos/build/3rdparty/googletest-1.8.0/src/googletest-1.8.0/googlemock/include -isystem /mesos/build/3rdparty/googletest-1.8.0/src/googletest-1.8.0/googletest/include    -o CMakeFiles/mesos-tests.dir/health_check_tests.cpp.o -c /mesos/src/tests/health_check_tests.cpp
/usr/bin/cmake -E cmake_progress_report /mesos/build/CMakeFiles 
[ 84%] Building CXX object src/tests/CMakeFiles/mesos-tests.dir/hierarchical_allocator_tests.cpp.o
cd /mesos/build/src/tests && /usr/bin/clang++-3.5   -DBUILD_DIR=\"/mesos/build\" -DBUILD_FLAGS=\"\" -DBUILD_JAVA_JVM_LIBRARY=\"\" -DHAS_AUTHENTICATION=1 -DLIBDIR=\"/usr/local/libmesos\" -DPICOJSON_USE_INT64 -DPKGDATADIR=\"/usr/local/share/mesos\" -DPKGLIBEXECDIR=\"/usr/local/libexec/mesos\" -DPKGMODULEDIR=\"\" -DSBINDIR=\"\" -DSOURCE_DIR=\"/mesos\" -DTESTLIBEXECDIR=\"\" -DUSE_CMAKE_BUILD_CONFIG -DUSE_STATIC_LIB -DVERSION=\"1.4.0\" -D__STDC_FORMAT_MACROS -std=c++11 -fPIE -I/mesos/build/include -I/mesos/build/include/mesos -I/mesos/build/src -I/mesos/src -isystem /mesos/build/3rdparty/protobuf-3.3.0/src/protobuf-3.3.0-lib/lib/include -isystem /mesos/3rdparty/libprocess/include -isystem /usr/include/apr-1.0 -isystem /mesos/build/3rdparty/boost-1.53.0/src/boost-1.53.0 -isystem /mesos/build/3rdparty/elfio-3.2/src/elfio-3.2 -isystem /mesos/build/3rdparty/glog-0.3.3/src/glog-0.3.3-lib/lib/include -isystem /mesos/build/3rdparty/nvml-352.79/src/nvml-352.79 -isystem /mesos/build/3rdparty/picojson-1.3.0/src/picojson-1.3.0 -isystem /usr/include/subversion-1 -isystem /mesos/3rdparty/stout/include -isystem /mesos/build/3rdparty/http_parser-2.6.2/src/http_parser-2.6.2 -isystem /mesos/build/3rdparty/concurrentqueue-1.0.0-beta/src/concurrentqueue-1.0.0-beta -isystem /mesos/build/3rdparty/libev-4.22/src/libev-4.22 -isystem /mesos/build/3rdparty/zookeeper-3.4.8/src/zookeeper-3.4.8/src/c/include -isystem /mesos/build/3rdparty/zookeeper-3.4.8/src/zookeeper-3.4.8/src/c/generated -isystem /mesos/build/3rdparty/leveldb-1.19/src/leveldb-1.19/include -I/mesos/include -isystem /mesos/build/3rdparty/googletest-1.8.0/src/googletest-1.8.0/googlemock/include -isystem /mesos/build/3rdparty/googletest-1.8.0/src/googletest-1.8.0/googletest/include    -o CMakeFiles/mesos-tests.dir/hierarchical_allocator_tests.cpp.o -c /mesos/src/tests/hierarchical_allocator_tests.cpp
/usr/bin/cmake -E cmake_progress_report /mesos/build/CMakeFiles 65
[ 85%] Building CXX object src/tests/CMakeFiles/mesos-tests.dir/hook_tests.cpp.o
cd /mesos/build/src/tests && /usr/bin/clang++-3.5   -DBUILD_DIR=\"/mesos/build\" -DBUILD_FLAGS=\"\" -DBUILD_JAVA_JVM_LIBRARY=\"\" -DHAS_AUTHENTICATION=1 -DLIBDIR=\"/usr/local/libmesos\" -DPICOJSON_USE_INT64 -DPKGDATADIR=\"/usr/local/share/mesos\" -DPKGLIBEXECDIR=\"/usr/local/libexec/mesos\" -DPKGMODULEDIR=\"\" -DSBINDIR=\"\" -DSOURCE_DIR=\"/mesos\" -DTESTLIBEXECDIR=\"\" -DUSE_CMAKE_BUILD_CONFIG -DUSE_STATIC_LIB -DVERSION=\"1.4.0\" -D__STDC_FORMAT_MACROS -std=c++11 -fPIE -I/mesos/build/include -I/mesos/build/include/mesos -I/mesos/build/src -I/mesos/src -isystem /mesos/build/3rdparty/protobuf-3.3.0/src/protobuf-3.3.0-lib/lib/include -isystem /mesos/3rdparty/libprocess/include -isystem /usr/include/apr-1.0 -isystem /mesos/build/3rdparty/boost-1.53.0/src/boost-1.53.0 -isystem /mesos/build/3rdparty/elfio-3.2/src/elfio-3.2 -isystem /mesos/build/3rdparty/glog-0.3.3/src/glog-0.3.3-lib/lib/include -isystem /mesos/build/3rdparty/nvml-352.79/src/nvml-352.79 -isystem /mesos/build/3rdparty/picojson-1.3.0/src/picojson-1.3.0 -isystem /usr/include/subversion-1 -isystem /mesos/3rdparty/stout/include -isystem /mesos/build/3rdparty/http_parser-2.6.2/src/http_parser-2.6.2 -isystem /mesos/build/3rdparty/concurrentqueue-1.0.0-beta/src/concurrentqueue-1.0.0-beta -isystem /mesos/build/3rdparty/libev-4.22/src/libev-4.22 -isystem /mesos/build/3rdparty/zookeeper-3.4.8/src/zookeeper-3.4.8/src/c/include -isystem /mesos/build/3rdparty/zookeeper-3.4.8/src/zookeeper-3.4.8/src/c/generated -isystem /mesos/build/3rdparty/leveldb-1.19/src/leveldb-1.19/include -I/mesos/include -isystem /mesos/build/3rdparty/googletest-1.8.0/src/googletest-1.8.0/googlemock/include -isystem /mesos/build/3rdparty/googletest-1.8.0/src/googletest-1.8.0/googletest/include    -o CMakeFiles/mesos-tests.dir/hook_tests.cpp.o -c /mesos/src/tests/hook_tests.cpp
/usr/bin/cmake -E cmake_progress_report /mesos/build/CMakeFiles 
[ 85%] Building CXX object src/tests/CMakeFiles/mesos-tests.dir/http_authentication_tests.cpp.o
cd /mesos/build/src/tests && /usr/bin/clang++-3.5   -DBUILD_DIR=\"/mesos/build\" -DBUILD_FLAGS=\"\" -DBUILD_JAVA_JVM_LIBRARY=\"\" -DHAS_AUTHENTICATION=1 -DLIBDIR=\"/usr/local/libmesos\" -DPICOJSON_USE_INT64 -DPKGDATADIR=\"/usr/local/share/mesos\" -DPKGLIBEXECDIR=\"/usr/local/libexec/mesos\" -DPKGMODULEDIR=\"\" -DSBINDIR=\"\" -DSOURCE_DIR=\"/mesos\" -DTESTLIBEXECDIR=\"\" -DUSE_CMAKE_BUILD_CONFIG -DUSE_STATIC_LIB -DVERSION=\"1.4.0\" -D__STDC_FORMAT_MACROS -std=c++11 -fPIE -I/mesos/build/include -I/mesos/build/include/mesos -I/mesos/build/src -I/mesos/src -isystem /mesos/build/3rdparty/protobuf-3.3.0/src/protobuf-3.3.0-lib/lib/include -isystem /mesos/3rdparty/libprocess/include -isystem /usr/include/apr-1.0 -isystem /mesos/build/3rdparty/boost-1.53.0/src/boost-1.53.0 -isystem /mesos/build/3rdparty/elfio-3.2/src/elfio-3.2 -isystem /mesos/build/3rdparty/glog-0.3.3/src/glog-0.3.3-lib/lib/include -isystem /mesos/build/3rdparty/nvml-352.79/src/nvml-352.79 -isystem /mesos/build/3rdparty/picojson-1.3.0/src/picojson-1.3.0 -isystem /usr/include/subversion-1 -isystem /mesos/3rdparty/stout/include -isystem /mesos/build/3rdparty/http_parser-2.6.2/src/http_parser-2.6.2 -isystem /mesos/build/3rdparty/concurrentqueue-1.0.0-beta/src/concurrentqueue-1.0.0-beta -isystem /mesos/build/3rdparty/libev-4.22/src/libev-4.22 -isystem /mesos/build/3rdparty/zookeeper-3.4.8/src/zookeeper-3.4.8/src/c/include -isystem /mesos/build/3rdparty/zookeeper-3.4.8/src/zookeeper-3.4.8/src/c/generated -isystem /mesos/build/3rdparty/leveldb-1.19/src/leveldb-1.19/include -I/mesos/include -isystem /mesos/build/3rdparty/googletest-1.8.0/src/googletest-1.8.0/googlemock/include -isystem /mesos/build/3rdparty/googletest-1.8.0/src/googletest-1.8.0/googletest/include    -o CMakeFiles/mesos-tests.dir/http_authentication_tests.cpp.o -c /mesos/src/tests/http_authentication_tests.cpp
/usr/bin/cmake -E cmake_progress_report /mesos/build/CMakeFiles 
[ 85%] Building CXX object src/tests/CMakeFiles/mesos-tests.dir/http_fault_tolerance_tests.cpp.o
cd /mesos/build/src/tests && /usr/bin/clang++-3.5   -DBUILD_DIR=\"/mesos/build\" -DBUILD_FLAGS=\"\" -DBUILD_JAVA_JVM_LIBRARY=\"\" -DHAS_AUTHENTICATION=1 -DLIBDIR=\"/usr/local/libmesos\" -DPICOJSON_USE_INT64 -DPKGDATADIR=\"/usr/local/share/mesos\" -DPKGLIBEXECDIR=\"/usr/local/libexec/mesos\" -DPKGMODULEDIR=\"\" -DSBINDIR=\"\" -DSOURCE_DIR=\"/mesos\" -DTESTLIBEXECDIR=\"\" -DUSE_CMAKE_BUILD_CONFIG -DUSE_STATIC_LIB -DVERSION=\"1.4.0\" -D__STDC_FORMAT_MACROS -std=c++11 -fPIE -I/mesos/build/include -I/mesos/build/include/mesos -I/mesos/build/src -I/mesos/src -isystem /mesos/build/3rdparty/protobuf-3.3.0/src/protobuf-3.3.0-lib/lib/include -isystem /mesos/3rdparty/libprocess/include -isystem /usr/include/apr-1.0 -isystem /mesos/build/3rdparty/boost-1.53.0/src/boost-1.53.0 -isystem /mesos/build/3rdparty/elfio-3.2/src/elfio-3.2 -isystem /mesos/build/3rdparty/glog-0.3.3/src/glog-0.3.3-lib/lib/include -isystem /mesos/build/3rdparty/nvml-352.79/src/nvml-352.79 -isystem /mesos/build/3rdparty/picojson-1.3.0/src/picojson-1.3.0 -isystem /usr/include/subversion-1 -isystem /mesos/3rdparty/stout/include -isystem /mesos/build/3rdparty/http_parser-2.6.2/src/http_parser-2.6.2 -isystem /mesos/build/3rdparty/concurrentqueue-1.0.0-beta/src/concurrentqueue-1.0.0-beta -isystem /mesos/build/3rdparty/libev-4.22/src/libev-4.22 -isystem /mesos/build/3rdparty/zookeeper-3.4.8/src/zookeeper-3.4.8/src/c/include -isystem /mesos/build/3rdparty/zookeeper-3.4.8/src/zookeeper-3.4.8/src/c/generated -isystem /mesos/build/3rdparty/leveldb-1.19/src/leveldb-1.19/include -I/mesos/include -isystem /mesos/build/3rdparty/googletest-1.8.0/src/googletest-1.8.0/googlemock/include -isystem /mesos/build/3rdparty/googletest-1.8.0/src/googletest-1.8.0/googletest/include    -o CMakeFiles/mesos-tests.dir/http_fault_tolerance_tests.cpp.o -c /mesos/src/tests/http_fault_tolerance_tests.cpp
/usr/bin/cmake -E cmake_progress_report /mesos/build/CMakeFiles 
[ 85%] Building CXX object src/tests/CMakeFiles/mesos-tests.dir/master_maintenance_tests.cpp.o
cd /mesos/build/src/tests && /usr/bin/clang++-3.5   -DBUILD_DIR=\"/mesos/build\" -DBUILD_FLAGS=\"\" -DBUILD_JAVA_JVM_LIBRARY=\"\" -DHAS_AUTHENTICATION=1 -DLIBDIR=\"/usr/local/libmesos\" -DPICOJSON_USE_INT64 -DPKGDATADIR=\"/usr/local/share/mesos\" -DPKGLIBEXECDIR=\"/usr/local/libexec/mesos\" -DPKGMODULEDIR=\"\" -DSBINDIR=\"\" -DSOURCE_DIR=\"/mesos\" -DTESTLIBEXECDIR=\"\" -DUSE_CMAKE_BUILD_CONFIG -DUSE_STATIC_LIB -DVERSION=\"1.4.0\" -D__STDC_FORMAT_MACROS -std=c++11 -fPIE -I/mesos/build/include -I/mesos/build/include/mesos -I/mesos/build/src -I/mesos/src -isystem /mesos/build/3rdparty/protobuf-3.3.0/src/protobuf-3.3.0-lib/lib/include -isystem /mesos/3rdparty/libprocess/include -isystem /usr/include/apr-1.0 -isystem /mesos/build/3rdparty/boost-1.53.0/src/boost-1.53.0 -isystem /mesos/build/3rdparty/elfio-3.2/src/elfio-3.2 -isystem /mesos/build/3rdparty/glog-0.3.3/src/glog-0.3.3-lib/lib/include -isystem /mesos/build/3rdparty/nvml-352.79/src/nvml-352.79 -isystem /mesos/build/3rdparty/picojson-1.3.0/src/picojson-1.3.0 -isystem /usr/include/subversion-1 -isystem /mesos/3rdparty/stout/include -isystem /mesos/build/3rdparty/http_parser-2.6.2/src/http_parser-2.6.2 -isystem /mesos/build/3rdparty/concurrentqueue-1.0.0-beta/src/concurrentqueue-1.0.0-beta -isystem /mesos/build/3rdparty/libev-4.22/src/libev-4.22 -isystem /mesos/build/3rdparty/zookeeper-3.4.8/src/zookeeper-3.4.8/src/c/include -isystem /mesos/build/3rdparty/zookeeper-3.4.8/src/zookeeper-3.4.8/src/c/generated -isystem /mesos/build/3rdparty/leveldb-1.19/src/leveldb-1.19/include -I/mesos/include -isystem /mesos/build/3rdparty/googletest-1.8.0/src/googletest-1.8.0/googlemock/include -isystem /mesos/build/3rdparty/googletest-1.8.0/src/googletest-1.8.0/googletest/include    -o CMakeFiles/mesos-tests.dir/master_maintenance_tests.cpp.o -c /mesos/src/tests/master_maintenance_tests.cpp
/usr/bin/cmake -E cmake_progress_report /mesos/build/CMakeFiles 
[ 85%] Building CXX object src/tests/CMakeFiles/mesos-tests.dir/master_slave_reconciliation_tests.cpp.o
cd /mesos/build/src/tests && /usr/bin/clang++-3.5   -DBUILD_DIR=\"/mesos/build\" -DBUILD_FLAGS=\"\" -DBUILD_JAVA_JVM_LIBRARY=\"\" -DHAS_AUTHENTICATION=1 -DLIBDIR=\"/usr/local/libmesos\" -DPICOJSON_USE_INT64 -DPKGDATADIR=\"/usr/local/share/mesos\" -DPKGLIBEXECDIR=\"/usr/local/libexec/mesos\" -DPKGMODULEDIR=\"\" -DSBINDIR=\"\" -DSOURCE_DIR=\"/mesos\" -DTESTLIBEXECDIR=\"\" -DUSE_CMAKE_BUILD_CONFIG -DUSE_STATIC_LIB -DVERSION=\"1.4.0\" -D__STDC_FORMAT_MACROS -std=c++11 -fPIE -I/mesos/build/include -I/mesos/build/include/mesos -I/mesos/build/src -I/mesos/src -isystem /mesos/build/3rdparty/protobuf-3.3.0/src/protobuf-3.3.0-lib/lib/include -isystem /mesos/3rdparty/libprocess/include -isystem /usr/include/apr-1.0 -isystem /mesos/build/3rdparty/boost-1.53.0/src/boost-1.53.0 -isystem /mesos/build/3rdparty/elfio-3.2/src/elfio-3.2 -isystem /mesos/build/3rdparty/glog-0.3.3/src/glog-0.3.3-lib/lib/include -isystem /mesos/build/3rdparty/nvml-352.79/src/nvml-352.79 -isystem /mesos/build/3rdparty/picojson-1.3.0/src/picojson-1.3.0 -isystem /usr/include/subversion-1 -isystem /mesos/3rdparty/stout/include -isystem /mesos/build/3rdparty/http_parser-2.6.2/src/http_parser-2.6.2 -isystem /mesos/build/3rdparty/concurrentqueue-1.0.0-beta/src/concurrentqueue-1.0.0-beta -isystem /mesos/build/3rdparty/libev-4.22/src/libev-4.22 -isystem /mesos/build/3rdparty/zookeeper-3.4.8/src/zookeeper-3.4.8/src/c/include -isystem /mesos/build/3rdparty/zookeeper-3.4.8/src/zookeeper-3.4.8/src/c/generated -isystem /mesos/build/3rdparty/leveldb-1.19/src/leveldb-1.19/include -I/mesos/include -isystem /mesos/build/3rdparty/googletest-1.8.0/src/googletest-1.8.0/googlemock/include -isystem /mesos/build/3rdparty/googletest-1.8.0/src/googletest-1.8.0/googletest/include    -o CMakeFiles/mesos-tests.dir/master_slave_reconciliation_tests.cpp.o -c /mesos/src/tests/master_slave_reconciliation_tests.cpp
/usr/bin/cmake -E cmake_progress_report /mesos/build/CMakeFiles 
[ 85%] Building CXX object src/tests/CMakeFiles/mesos-tests.dir/partition_tests.cpp.o
cd /mesos/build/src/tests && /usr/bin/clang++-3.5   -DBUILD_DIR=\"/mesos/build\" -DBUILD_FLAGS=\"\" -DBUILD_JAVA_JVM_LIBRARY=\"\" -DHAS_AUTHENTICATION=1 -DLIBDIR=\"/usr/local/libmesos\" -DPICOJSON_USE_INT64 -DPKGDATADIR=\"/usr/local/share/mesos\" -DPKGLIBEXECDIR=\"/usr/local/libexec/mesos\" -DPKGMODULEDIR=\"\" -DSBINDIR=\"\" -DSOURCE_DIR=\"/mesos\" -DTESTLIBEXECDIR=\"\" -DUSE_CMAKE_BUILD_CONFIG -DUSE_STATIC_LIB -DVERSION=\"1.4.0\" -D__STDC_FORMAT_MACROS -std=c++11 -fPIE -I/mesos/build/include -I/mesos/build/include/mesos -I/mesos/build/src -I/mesos/src -isystem /mesos/build/3rdparty/protobuf-3.3.0/src/protobuf-3.3.0-lib/lib/include -isystem /mesos/3rdparty/libprocess/include -isystem /usr/include/apr-1.0 -isystem /mesos/build/3rdparty/boost-1.53.0/src/boost-1.53.0 -isystem /mesos/build/3rdparty/elfio-3.2/src/elfio-3.2 -isystem /mesos/build/3rdparty/glog-0.3.3/src/glog-0.3.3-lib/lib/include -isystem /mesos/build/3rdparty/nvml-352.79/src/nvml-352.79 -isystem /mesos/build/3rdparty/picojson-1.3.0/src/picojson-1.3.0 -isystem /usr/include/subversion-1 -isystem /mesos/3rdparty/stout/include -isystem /mesos/build/3rdparty/http_parser-2.6.2/src/http_parser-2.6.2 -isystem /mesos/build/3rdparty/concurrentqueue-1.0.0-beta/src/concurrentqueue-1.0.0-beta -isystem /mesos/build/3rdparty/libev-4.22/src/libev-4.22 -isystem /mesos/build/3rdparty/zookeeper-3.4.8/src/zookeeper-3.4.8/src/c/include -isystem /mesos/build/3rdparty/zookeeper-3.4.8/src/zookeeper-3.4.8/src/c/generated -isystem /mesos/build/3rdparty/leveldb-1.19/src/leveldb-1.19/include -I/mesos/include -isystem /mesos/build/3rdparty/googletest-1.8.0/src/googletest-1.8.0/googlemock/include -isystem /mesos/build/3rdparty/googletest-1.8.0/src/googletest-1.8.0/googletest/include    -o CMakeFiles/mesos-tests.dir/partition_tests.cpp.o -c /mesos/src/tests/partition_tests.cpp
/usr/bin/cmake -E cmake_progress_report /mesos/build/CMakeFiles 
[ 85%] Building CXX object src/tests/CMakeFiles/mesos-tests.dir/paths_tests.cpp.o
cd /mesos/build/src/tests && /usr/bin/clang++-3.5   -DBUILD_DIR=\"/mesos/build\" -DBUILD_FLAGS=\"\" -DBUILD_JAVA_JVM_LIBRARY=\"\" -DHAS_AUTHENTICATION=1 -DLIBDIR=\"/usr/local/libmesos\" -DPICOJSON_USE_INT64 -DPKGDATADIR=\"/usr/local/share/mesos\" -DPKGLIBEXECDIR=\"/usr/local/libexec/mesos\" -DPKGMODULEDIR=\"\" -DSBINDIR=\"\" -DSOURCE_DIR=\"/mesos\" -DTESTLIBEXECDIR=\"\" -DUSE_CMAKE_BUILD_CONFIG -DUSE_STATIC_LIB -DVERSION=\"1.4.0\" -D__STDC_FORMAT_MACROS -std=c++11 -fPIE -I/mesos/build/include -I/mesos/build/include/mesos -I/mesos/build/src -I/mesos/src -isystem /mesos/build/3rdparty/protobuf-3.3.0/src/protobuf-3.3.0-lib/lib/include -isystem /mesos/3rdparty/libprocess/include -isystem /usr/include/apr-1.0 -isystem /mesos/build/3rdparty/boost-1.53.0/src/boost-1.53.0 -isystem /mesos/build/3rdparty/elfio-3.2/src/elfio-3.2 -isystem /mesos/build/3rdparty/glog-0.3.3/src/glog-0.3.3-lib/lib/include -isystem /mesos/build/3rdparty/nvml-352.79/src/nvml-352.79 -isystem /mesos/build/3rdparty/picojson-1.3.0/src/picojson-1.3.0 -isystem /usr/include/subversion-1 -isystem /mesos/3rdparty/stout/include -isystem /mesos/build/3rdparty/http_parser-2.6.2/src/http_parser-2.6.2 -isystem /mesos/build/3rdparty/concurrentqueue-1.0.0-beta/src/concurrentqueue-1.0.0-beta -isystem /mesos/build/3rdparty/libev-4.22/src/libev-4.22 -isystem /mesos/build/3rdparty/zookeeper-3.4.8/src/zookeeper-3.4.8/src/c/include -isystem /mesos/build/3rdparty/zookeeper-3.4.8/src/zookeeper-3.4.8/src/c/generated -isystem /mesos/build/3rdparty/leveldb-1.19/src/leveldb-1.19/include -I/mesos/include -isystem /mesos/build/3rdparty/googletest-1.8.0/src/googletest-1.8.0/googlemock/include -isystem /mesos/build/3rdparty/googletest-1.8.0/src/googletest-1.8.0/googletest/include    -o CMakeFiles/mesos-tests.dir/paths_tests.cpp.o -c /mesos/src/tests/paths_tests.cpp
/usr/bin/cmake -E cmake_progress_report /mesos/build/CMakeFiles 66
[ 86%] Building CXX object src/tests/CMakeFiles/mesos-tests.dir/protobuf_io_tests.cpp.o
cd /mesos/build/src/tests && /usr/bin/clang++-3.5   -DBUILD_DIR=\"/mesos/build\" -DBUILD_FLAGS=\"\" -DBUILD_JAVA_JVM_LIBRARY=\"\" -DHAS_AUTHENTICATION=1 -DLIBDIR=\"/usr/local/libmesos\" -DPICOJSON_USE_INT64 -DPKGDATADIR=\"/usr/local/share/mesos\" -DPKGLIBEXECDIR=\"/usr/local/libexec/mesos\" -DPKGMODULEDIR=\"\" -DSBINDIR=\"\" -DSOURCE_DIR=\"/mesos\" -DTESTLIBEXECDIR=\"\" -DUSE_CMAKE_BUILD_CONFIG -DUSE_STATIC_LIB -DVERSION=\"1.4.0\" -D__STDC_FORMAT_MACROS -std=c++11 -fPIE -I/mesos/build/include -I/mesos/build/include/mesos -I/mesos/build/src -I/mesos/src -isystem /mesos/build/3rdparty/protobuf-3.3.0/src/protobuf-3.3.0-lib/lib/include -isystem /mesos/3rdparty/libprocess/include -isystem /usr/include/apr-1.0 -isystem /mesos/build/3rdparty/boost-1.53.0/src/boost-1.53.0 -isystem /mesos/build/3rdparty/elfio-3.2/src/elfio-3.2 -isystem /mesos/build/3rdparty/glog-0.3.3/src/glog-0.3.3-lib/lib/include -isystem /mesos/build/3rdparty/nvml-352.79/src/nvml-352.79 -isystem /mesos/build/3rdparty/picojson-1.3.0/src/picojson-1.3.0 -isystem /usr/include/subversion-1 -isystem /mesos/3rdparty/stout/include -isystem /mesos/build/3rdparty/http_parser-2.6.2/src/http_parser-2.6.2 -isystem /mesos/build/3rdparty/concurrentqueue-1.0.0-beta/src/concurrentqueue-1.0.0-beta -isystem /mesos/build/3rdparty/libev-4.22/src/libev-4.22 -isystem /mesos/build/3rdparty/zookeeper-3.4.8/src/zookeeper-3.4.8/src/c/include -isystem /mesos/build/3rdparty/zookeeper-3.4.8/src/zookeeper-3.4.8/src/c/generated -isystem /mesos/build/3rdparty/leveldb-1.19/src/leveldb-1.19/include -I/mesos/include -isystem /mesos/build/3rdparty/googletest-1.8.0/src/googletest-1.8.0/googlemock/include -isystem /mesos/build/3rdparty/googletest-1.8.0/src/googletest-1.8.0/googletest/include    -o CMakeFiles/mesos-tests.dir/protobuf_io_tests.cpp.o -c /mesos/src/tests/protobuf_io_tests.cpp
/usr/bin/cmake -E cmake_progress_report /mesos/build/CMakeFiles 
[ 86%] Building CXX object src/tests/CMakeFiles/mesos-tests.dir/rate_limiting_tests.cpp.o
cd /mesos/build/src/tests && /usr/bin/clang++-3.5   -DBUILD_DIR=\"/mesos/build\" -DBUILD_FLAGS=\"\" -DBUILD_JAVA_JVM_LIBRARY=\"\" -DHAS_AUTHENTICATION=1 -DLIBDIR=\"/usr/local/libmesos\" -DPICOJSON_USE_INT64 -DPKGDATADIR=\"/usr/local/share/mesos\" -DPKGLIBEXECDIR=\"/usr/local/libexec/mesos\" -DPKGMODULEDIR=\"\" -DSBINDIR=\"\" -DSOURCE_DIR=\"/mesos\" -DTESTLIBEXECDIR=\"\" -DUSE_CMAKE_BUILD_CONFIG -DUSE_STATIC_LIB -DVERSION=\"1.4.0\" -D__STDC_FORMAT_MACROS -std=c++11 -fPIE -I/mesos/build/include -I/mesos/build/include/mesos -I/mesos/build/src -I/mesos/src -isystem /mesos/build/3rdparty/protobuf-3.3.0/src/protobuf-3.3.0-lib/lib/include -isystem /mesos/3rdparty/libprocess/include -isystem /usr/include/apr-1.0 -isystem /mesos/build/3rdparty/boost-1.53.0/src/boost-1.53.0 -isystem /mesos/build/3rdparty/elfio-3.2/src/elfio-3.2 -isystem /mesos/build/3rdparty/glog-0.3.3/src/glog-0.3.3-lib/lib/include -isystem /mesos/build/3rdparty/nvml-352.79/src/nvml-352.79 -isystem /mesos/build/3rdparty/picojson-1.3.0/src/picojson-1.3.0 -isystem /usr/include/subversion-1 -isystem /mesos/3rdparty/stout/include -isystem /mesos/build/3rdparty/http_parser-2.6.2/src/http_parser-2.6.2 -isystem /mesos/build/3rdparty/concurrentqueue-1.0.0-beta/src/concurrentqueue-1.0.0-beta -isystem /mesos/build/3rdparty/libev-4.22/src/libev-4.22 -isystem /mesos/build/3rdparty/zookeeper-3.4.8/src/zookeeper-3.4.8/src/c/include -isystem /mesos/build/3rdparty/zookeeper-3.4.8/src/zookeeper-3.4.8/src/c/generated -isystem /mesos/build/3rdparty/leveldb-1.19/src/leveldb-1.19/include -I/mesos/include -isystem /mesos/build/3rdparty/googletest-1.8.0/src/googletest-1.8.0/googlemock/include -isystem /mesos/build/3rdparty/googletest-1.8.0/src/googletest-1.8.0/googletest/include    -o CMakeFiles/mesos-tests.dir/rate_limiting_tests.cpp.o -c /mesos/src/tests/rate_limiting_tests.cpp
/usr/bin/cmake -E cmake_progress_report /mesos/build/CMakeFiles 
[ 86%] Building CXX object src/tests/CMakeFiles/mesos-tests.dir/resource_offers_tests.cpp.o
cd /mesos/build/src/tests && /usr/bin/clang++-3.5   -DBUILD_DIR=\"/mesos/build\" -DBUILD_FLAGS=\"\" -DBUILD_JAVA_JVM_LIBRARY=\"\" -DHAS_AUTHENTICATION=1 -DLIBDIR=\"/usr/local/libmesos\" -DPICOJSON_USE_INT64 -DPKGDATADIR=\"/usr/local/share/mesos\" -DPKGLIBEXECDIR=\"/usr/local/libexec/mesos\" -DPKGMODULEDIR=\"\" -DSBINDIR=\"\" -DSOURCE_DIR=\"/mesos\" -DTESTLIBEXECDIR=\"\" -DUSE_CMAKE_BUILD_CONFIG -DUSE_STATIC_LIB -DVERSION=\"1.4.0\" -D__STDC_FORMAT_MACROS -std=c++11 -fPIE -I/mesos/build/include -I/mesos/build/include/mesos -I/mesos/build/src -I/mesos/src -isystem /mesos/build/3rdparty/protobuf-3.3.0/src/protobuf-3.3.0-lib/lib/include -isystem /mesos/3rdparty/libprocess/include -isystem /usr/include/apr-1.0 -isystem /mesos/build/3rdparty/boost-1.53.0/src/boost-1.53.0 -isystem /mesos/build/3rdparty/elfio-3.2/src/elfio-3.2 -isystem /mesos/build/3rdparty/glog-0.3.3/src/glog-0.3.3-lib/lib/include -isystem /mesos/build/3rdparty/nvml-352.79/src/nvml-352.79 -isystem /mesos/build/3rdparty/picojson-1.3.0/src/picojson-1.3.0 -isystem /usr/include/subversion-1 -isystem /mesos/3rdparty/stout/include -isystem /mesos/build/3rdparty/http_parser-2.6.2/src/http_parser-2.6.2 -isystem /mesos/build/3rdparty/concurrentqueue-1.0.0-beta/src/concurrentqueue-1.0.0-beta -isystem /mesos/build/3rdparty/libev-4.22/src/libev-4.22 -isystem /mesos/build/3rdparty/zookeeper-3.4.8/src/zookeeper-3.4.8/src/c/include -isystem /mesos/build/3rdparty/zookeeper-3.4.8/src/zookeeper-3.4.8/src/c/generated -isystem /mesos/build/3rdparty/leveldb-1.19/src/leveldb-1.19/include -I/mesos/include -isystem /mesos/build/3rdparty/googletest-1.8.0/src/googletest-1.8.0/googlemock/include -isystem /mesos/build/3rdparty/googletest-1.8.0/src/googletest-1.8.0/googletest/include    -o CMakeFiles/mesos-tests.dir/resource_offers_tests.cpp.o -c /mesos/src/tests/resource_offers_tests.cpp
/usr/bin/cmake -E cmake_progress_report /mesos/build/CMakeFiles 
[ 86%] Building CXX object src/tests/CMakeFiles/mesos-tests.dir/resource_provider_http_api_tests.cpp.o
cd /mesos/build/src/tests && /usr/bin/clang++-3.5   -DBUILD_DIR=\"/mesos/build\" -DBUILD_FLAGS=\"\" -DBUILD_JAVA_JVM_LIBRARY=\"\" -DHAS_AUTHENTICATION=1 -DLIBDIR=\"/usr/local/libmesos\" -DPICOJSON_USE_INT64 -DPKGDATADIR=\"/usr/local/share/mesos\" -DPKGLIBEXECDIR=\"/usr/local/libexec/mesos\" -DPKGMODULEDIR=\"\" -DSBINDIR=\"\" -DSOURCE_DIR=\"/mesos\" -DTESTLIBEXECDIR=\"\" -DUSE_CMAKE_BUILD_CONFIG -DUSE_STATIC_LIB -DVERSION=\"1.4.0\" -D__STDC_FORMAT_MACROS -std=c++11 -fPIE -I/mesos/build/include -I/mesos/build/include/mesos -I/mesos/build/src -I/mesos/src -isystem /mesos/build/3rdparty/protobuf-3.3.0/src/protobuf-3.3.0-lib/lib/include -isystem /mesos/3rdparty/libprocess/include -isystem /usr/include/apr-1.0 -isystem /mesos/build/3rdparty/boost-1.53.0/src/boost-1.53.0 -isystem /mesos/build/3rdparty/elfio-3.2/src/elfio-3.2 -isystem /mesos/build/3rdparty/glog-0.3.3/src/glog-0.3.3-lib/lib/include -isystem /mesos/build/3rdparty/nvml-352.79/src/nvml-352.79 -isystem /mesos/build/3rdparty/picojson-1.3.0/src/picojson-1.3.0 -isystem /usr/include/subversion-1 -isystem /mesos/3rdparty/stout/include -isystem /mesos/build/3rdparty/http_parser-2.6.2/src/http_parser-2.6.2 -isystem /mesos/build/3rdparty/concurrentqueue-1.0.0-beta/src/concurrentqueue-1.0.0-beta -isystem /mesos/build/3rdparty/libev-4.22/src/libev-4.22 -isystem /mesos/build/3rdparty/zookeeper-3.4.8/src/zookeeper-3.4.8/src/c/include -isystem /mesos/build/3rdparty/zookeeper-3.4.8/src/zookeeper-3.4.8/src/c/generated -isystem /mesos/build/3rdparty/leveldb-1.19/src/leveldb-1.19/include -I/mesos/include -isystem /mesos/build/3rdparty/googletest-1.8.0/src/googletest-1.8.0/googlemock/include -isystem /mesos/build/3rdparty/googletest-1.8.0/src/googletest-1.8.0/googletest/include    -o CMakeFiles/mesos-tests.dir/resource_provider_http_api_tests.cpp.o -c /mesos/src/tests/resource_provider_http_api_tests.cpp
/usr/bin/cmake -E cmake_progress_report /mesos/build/CMakeFiles 
[ 86%] Building CXX object src/tests/CMakeFiles/mesos-tests.dir/resource_provider_validation_tests.cpp.o
cd /mesos/build/src/tests && /usr/bin/clang++-3.5   -DBUILD_DIR=\"/mesos/build\" -DBUILD_FLAGS=\"\" -DBUILD_JAVA_JVM_LIBRARY=\"\" -DHAS_AUTHENTICATION=1 -DLIBDIR=\"/usr/local/libmesos\" -DPICOJSON_USE_INT64 -DPKGDATADIR=\"/usr/local/share/mesos\" -DPKGLIBEXECDIR=\"/usr/local/libexec/mesos\" -DPKGMODULEDIR=\"\" -DSBINDIR=\"\" -DSOURCE_DIR=\"/mesos\" -DTESTLIBEXECDIR=\"\" -DUSE_CMAKE_BUILD_CONFIG -DUSE_STATIC_LIB -DVERSION=\"1.4.0\" -D__STDC_FORMAT_MACROS -std=c++11 -fPIE -I/mesos/build/include -I/mesos/build/include/mesos -I/mesos/build/src -I/mesos/src -isystem /mesos/build/3rdparty/protobuf-3.3.0/src/protobuf-3.3.0-lib/lib/include -isystem /mesos/3rdparty/libprocess/include -isystem /usr/include/apr-1.0 -isystem /mesos/build/3rdparty/boost-1.53.0/src/boost-1.53.0 -isystem /mesos/build/3rdparty/elfio-3.2/src/elfio-3.2 -isystem /mesos/build/3rdparty/glog-0.3.3/src/glog-0.3.3-lib/lib/include -isystem /mesos/build/3rdparty/nvml-352.79/src/nvml-352.79 -isystem /mesos/build/3rdparty/picojson-1.3.0/src/picojson-1.3.0 -isystem /usr/include/subversion-1 -isystem /mesos/3rdparty/stout/include -isystem /mesos/build/3rdparty/http_parser-2.6.2/src/http_parser-2.6.2 -isystem /mesos/build/3rdparty/concurrentqueue-1.0.0-beta/src/concurrentqueue-1.0.0-beta -isystem /mesos/build/3rdparty/libev-4.22/src/libev-4.22 -isystem /mesos/build/3rdparty/zookeeper-3.4.8/src/zookeeper-3.4.8/src/c/include -isystem /mesos/build/3rdparty/zookeeper-3.4.8/src/zookeeper-3.4.8/src/c/generated -isystem /mesos/build/3rdparty/leveldb-1.19/src/leveldb-1.19/include -I/mesos/include -isystem /mesos/build/3rdparty/googletest-1.8.0/src/googletest-1.8.0/googlemock/include -isystem /mesos/build/3rdparty/googletest-1.8.0/src/googletest-1.8.0/googletest/include    -o CMakeFiles/mesos-tests.dir/resource_provider_validation_tests.cpp.o -c /mesos/src/tests/resource_provider_validation_tests.cpp
/usr/bin/cmake -E cmake_progress_report /mesos/build/CMakeFiles 
[ 86%] Building CXX object src/tests/CMakeFiles/mesos-tests.dir/resources_tests.cpp.o
cd /mesos/build/src/tests && /usr/bin/clang++-3.5   -DBUILD_DIR=\"/mesos/build\" -DBUILD_FLAGS=\"\" -DBUILD_JAVA_JVM_LIBRARY=\"\" -DHAS_AUTHENTICATION=1 -DLIBDIR=\"/usr/local/libmesos\" -DPICOJSON_USE_INT64 -DPKGDATADIR=\"/usr/local/share/mesos\" -DPKGLIBEXECDIR=\"/usr/local/libexec/mesos\" -DPKGMODULEDIR=\"\" -DSBINDIR=\"\" -DSOURCE_DIR=\"/mesos\" -DTESTLIBEXECDIR=\"\" -DUSE_CMAKE_BUILD_CONFIG -DUSE_STATIC_LIB -DVERSION=\"1.4.0\" -D__STDC_FORMAT_MACROS -std=c++11 -fPIE -I/mesos/build/include -I/mesos/build/include/mesos -I/mesos/build/src -I/mesos/src -isystem /mesos/build/3rdparty/protobuf-3.3.0/src/protobuf-3.3.0-lib/lib/include -isystem /mesos/3rdparty/libprocess/include -isystem /usr/include/apr-1.0 -isystem /mesos/build/3rdparty/boost-1.53.0/src/boost-1.53.0 -isystem /mesos/build/3rdparty/elfio-3.2/src/elfio-3.2 -isystem /mesos/build/3rdparty/glog-0.3.3/src/glog-0.3.3-lib/lib/include -isystem /mesos/build/3rdparty/nvml-352.79/src/nvml-352.79 -isystem /mesos/build/3rdparty/picojson-1.3.0/src/picojson-1.3.0 -isystem /usr/include/subversion-1 -isystem /mesos/3rdparty/stout/include -isystem /mesos/build/3rdparty/http_parser-2.6.2/src/http_parser-2.6.2 -isystem /mesos/build/3rdparty/concurrentqueue-1.0.0-beta/src/concurrentqueue-1.0.0-beta -isystem /mesos/build/3rdparty/libev-4.22/src/libev-4.22 -isystem /mesos/build/3rdparty/zookeeper-3.4.8/src/zookeeper-3.4.8/src/c/include -isystem /mesos/build/3rdparty/zookeeper-3.4.8/src/zookeeper-3.4.8/src/c/generated -isystem /mesos/build/3rdparty/leveldb-1.19/src/leveldb-1.19/include -I/mesos/include -isystem /mesos/build/3rdparty/googletest-1.8.0/src/googletest-1.8.0/googlemock/include -isystem /mesos/build/3rdparty/googletest-1.8.0/src/googletest-1.8.0/googletest/include    -o CMakeFiles/mesos-tests.dir/resources_tests.cpp.o -c /mesos/src/tests/resources_tests.cpp
/usr/bin/cmake -E cmake_progress_report /mesos/build/CMakeFiles 
[ 86%] Building CXX object src/tests/CMakeFiles/mesos-tests.dir/role_tests.cpp.o
cd /mesos/build/src/tests && /usr/bin/clang++-3.5   -DBUILD_DIR=\"/mesos/build\" -DBUILD_FLAGS=\"\" -DBUILD_JAVA_JVM_LIBRARY=\"\" -DHAS_AUTHENTICATION=1 -DLIBDIR=\"/usr/local/libmesos\" -DPICOJSON_USE_INT64 -DPKGDATADIR=\"/usr/local/share/mesos\" -DPKGLIBEXECDIR=\"/usr/local/libexec/mesos\" -DPKGMODULEDIR=\"\" -DSBINDIR=\"\" -DSOURCE_DIR=\"/mesos\" -DTESTLIBEXECDIR=\"\" -DUSE_CMAKE_BUILD_CONFIG -DUSE_STATIC_LIB -DVERSION=\"1.4.0\" -D__STDC_FORMAT_MACROS -std=c++11 -fPIE -I/mesos/build/include -I/mesos/build/include/mesos -I/mesos/build/src -I/mesos/src -isystem /mesos/build/3rdparty/protobuf-3.3.0/src/protobuf-3.3.0-lib/lib/include -isystem /mesos/3rdparty/libprocess/include -isystem /usr/include/apr-1.0 -isystem /mesos/build/3rdparty/boost-1.53.0/src/boost-1.53.0 -isystem /mesos/build/3rdparty/elfio-3.2/src/elfio-3.2 -isystem /mesos/build/3rdparty/glog-0.3.3/src/glog-0.3.3-lib/lib/include -isystem /mesos/build/3rdparty/nvml-352.79/src/nvml-352.79 -isystem /mesos/build/3rdparty/picojson-1.3.0/src/picojson-1.3.0 -isystem /usr/include/subversion-1 -isystem /mesos/3rdparty/stout/include -isystem /mesos/build/3rdparty/http_parser-2.6.2/src/http_parser-2.6.2 -isystem /mesos/build/3rdparty/concurrentqueue-1.0.0-beta/src/concurrentqueue-1.0.0-beta -isystem /mesos/build/3rdparty/libev-4.22/src/libev-4.22 -isystem /mesos/build/3rdparty/zookeeper-3.4.8/src/zookeeper-3.4.8/src/c/include -isystem /mesos/build/3rdparty/zookeeper-3.4.8/src/zookeeper-3.4.8/src/c/generated -isystem /mesos/build/3rdparty/leveldb-1.19/src/leveldb-1.19/include -I/mesos/include -isystem /mesos/build/3rdparty/googletest-1.8.0/src/googletest-1.8.0/googlemock/include -isystem /mesos/build/3rdparty/googletest-1.8.0/src/googletest-1.8.0/googletest/include    -o CMakeFiles/mesos-tests.dir/role_tests.cpp.o -c /mesos/src/tests/role_tests.cpp
/usr/bin/cmake -E cmake_progress_report /mesos/build/CMakeFiles 67
[ 87%] Building CXX object src/tests/CMakeFiles/mesos-tests.dir/scheduler_driver_tests.cpp.o
cd /mesos/build/src/tests && /usr/bin/clang++-3.5   -DBUILD_DIR=\"/mesos/build\" -DBUILD_FLAGS=\"\" -DBUILD_JAVA_JVM_LIBRARY=\"\" -DHAS_AUTHENTICATION=1 -DLIBDIR=\"/usr/local/libmesos\" -DPICOJSON_USE_INT64 -DPKGDATADIR=\"/usr/local/share/mesos\" -DPKGLIBEXECDIR=\"/usr/local/libexec/mesos\" -DPKGMODULEDIR=\"\" -DSBINDIR=\"\" -DSOURCE_DIR=\"/mesos\" -DTESTLIBEXECDIR=\"\" -DUSE_CMAKE_BUILD_CONFIG -DUSE_STATIC_LIB -DVERSION=\"1.4.0\" -D__STDC_FORMAT_MACROS -std=c++11 -fPIE -I/mesos/build/include -I/mesos/build/include/mesos -I/mesos/build/src -I/mesos/src -isystem /mesos/build/3rdparty/protobuf-3.3.0/src/protobuf-3.3.0-lib/lib/include -isystem /mesos/3rdparty/libprocess/include -isystem /usr/include/apr-1.0 -isystem /mesos/build/3rdparty/boost-1.53.0/src/boost-1.53.0 -isystem /mesos/build/3rdparty/elfio-3.2/src/elfio-3.2 -isystem /mesos/build/3rdparty/glog-0.3.3/src/glog-0.3.3-lib/lib/include -isystem /mesos/build/3rdparty/nvml-352.79/src/nvml-352.79 -isystem /mesos/build/3rdparty/picojson-1.3.0/src/picojson-1.3.0 -isystem /usr/include/subversion-1 -isystem /mesos/3rdparty/stout/include -isystem /mesos/build/3rdparty/http_parser-2.6.2/src/http_parser-2.6.2 -isystem /mesos/build/3rdparty/concurrentqueue-1.0.0-beta/src/concurrentqueue-1.0.0-beta -isystem /mesos/build/3rdparty/libev-4.22/src/libev-4.22 -isystem /mesos/build/3rdparty/zookeeper-3.4.8/src/zookeeper-3.4.8/src/c/include -isystem /mesos/build/3rdparty/zookeeper-3.4.8/src/zookeeper-3.4.8/src/c/generated -isystem /mesos/build/3rdparty/leveldb-1.19/src/leveldb-1.19/include -I/mesos/include -isystem /mesos/build/3rdparty/googletest-1.8.0/src/googletest-1.8.0/googlemock/include -isystem /mesos/build/3rdparty/googletest-1.8.0/src/googletest-1.8.0/googletest/include    -o CMakeFiles/mesos-tests.dir/scheduler_driver_tests.cpp.o -c /mesos/src/tests/scheduler_driver_tests.cpp
fatal error: error in backend: IO failure on output stream.
make[3]: *** [src/tests/CMakeFiles/mesos-tests.dir/rate_limiting_tests.cpp.o] Error 1
make[3]: *** Waiting for unfinished jobs....
fatal error: error in backend: IO failure on output stream.
make[3]: *** [src/tests/CMakeFiles/mesos-tests.dir/resource_offers_tests.cpp.o] Error 1
fatal error: error in backend: IO failure on output stream.
make[3]: *** [src/tests/CMakeFiles/mesos-tests.dir/resource_provider_http_api_tests.cpp.o] Error 1
fatal error: error in backend: IO failure on output stream.
make[3]: *** [src/tests/CMakeFiles/mesos-tests.dir/resources_tests.cpp.o] Error 1
fatal error: error in backend: IO failure on output stream.
make[3]: *** [src/tests/CMakeFiles/mesos-tests.dir/scheduler_driver_tests.cpp.o] Error 1
fatal error: error in backend: IO failure on output stream.
make[3]: *** [src/tests/CMakeFiles/mesos-tests.dir/role_tests.cpp.o] Error 1
make[3]: Leaving directory `/mesos/build'
make[2]: *** [src/tests/CMakeFiles/mesos-tests.dir/all] Error 2
make[2]: Leaving directory `/mesos/build'
make[1]: *** [CMakeFiles/check.dir/rule] Error 2
make[1]: Leaving directory `/mesos/build'
make: *** [check] Error 2
+ docker rmi mesos-1501815024-19694
Untagged: mesos-1501815024-19694:latest
Deleted: sha256:7193fd2c7885e53b51ae31cc4d2322a1a4c1d329a35201c0c01787006546aeb3
Deleted: sha256:a10b10df6e783e14af9992584f0136373b07ed130e343cd3c05ef1aad72ffb07
Deleted: sha256:aec6428ed0e5221f5b7481e91b213431d46ec61e2ca983986b423d296fcf753d
Deleted: sha256:1ee8e7ac028e81b20c9844190736a44e2eb9f91240782a01eb4518ca506ac706
Deleted: sha256:e380ef43c5c0c66598b0e9088f48df9948b7e64368805c41ebd3fc9b6a977989
Deleted: sha256:031299ae28038f6fbeca2d7cd8a409270381a686f9f1ad3873f6af44a2f95198
Deleted: sha256:274cd4ffee2ec550ffed59b1a07b291cbfe216c3174240b4a12adcfc8861ff94
Deleted: sha256:3bad79cca5caf6d40486ca0700a68c4bdc6d32a5b55a1ebda1983f472179d448
Deleted: sha256:ab4ae5ce9c455d691fd86ed3e640408bdb5d7f431e1c342080484ae411251831
Deleted: sha256:e4010c5c5977bbe86563e7129e9ce984da59a987582587e4e8a068cde393074c
Deleted: sha256:4915426e95f6f78cf86409cb581c2f07b5bffecfae534b27bc4ea91b03f8e8d4
Deleted: sha256:0ecceb520a4ee6b5feaff7ac21d6f641f52e62d31af93995843c6ff16a1fcff6
Deleted: sha256:cff151355512097618fa5d522aff90f1dc075015dc887da610565651f1848c4b
Deleted: sha256:336f995883a9bba9a1eff161fcf94e8aac1b247b572d9e7f55efdc8621945b78
Deleted: sha256:168b30f66f682f91213345f712aac6d18397ed9c6b74088ff2c12d082fabf6c6
Deleted: sha256:d3a68eb6574d7d7f4e0959e2f4096d27c49f1ff067cdb4a919e31d45a21e457e
Deleted: sha256:60301427f11b90d487a23c671471c8e10225d31949c305fa68a6c2c21a060fad
Deleted: sha256:12efa7137cc03258b749764eec7a0b43321f828015043489611b3ba9e1e39e85
Deleted: sha256:2ee099c63cf5fcbb3530d36059ae44a796ae2d76b366d541505719e90e7b6a93
Deleted: sha256:2fb31b7290acc7e890c20b91bcbd7b079bd16a17c6d883fa475c6a43c1e1e2d4
Deleted: sha256:e030e6fa118c9b4421f5ecce35debf37a028b323f1f4f73b9d9e3520eac1f2d3
Deleted: sha256:7f1285d39c9611215d97b0c6b4bce89e04f06f78a590789e90b4a5e1ad638186
Deleted: sha256:9456a877686d9dac04a778082331c0b41205d531e709fb25fcc7059f833b4db5
Deleted: sha256:d67aff39b848a42730eba60430bc5ff7dbf7e62e4c77c3fd79e036254996416e
Build step 'Execute shell' marked build as failure
Not sending mail to unregistered user zhq527725@gmail.com
Not sending mail to unregistered user songzihao1990@gmail.com
Not sending mail to unregistered user gregorywmann@gmail.com

Mime
View raw message