mesos-builds mailing list archives

Site index · List index
Message view « Date » · « Thread »
Top « Date » · « Thread »
From Apache Jenkins Server <jenk...@builds.apache.org>
Subject Build failed in Jenkins: Mesos-Reviewbot #19128
Date Wed, 30 Aug 2017 16:33:56 GMT
See <https://builds.apache.org/job/Mesos-Reviewbot/19128/display/redirect>

------------------------------------------
[...truncated 31.04 MB...]
I0830 16:33:50.701855  5809 slave.cpp:252] Mesos agent started on (806)@172.17.0.7:42477
I0830 16:33:50.701874  5809 slave.cpp:253] Flags at startup: --acls="" --appc_simple_discovery_uri_prefix="http://"
--appc_store_dir="/tmp/Endpoint_SlaveEndpointTest_AuthorizedRequest_2_3NRKOB/store/appc" --authenticate_http_readonly="true"
--authenticate_http_readwrite="true" --authenticatee="crammd5" --authentication_backoff_factor="1secs"
--authorizer="local" --cgroups_cpu_enable_pids_and_tids_count="false" --cgroups_enable_cfs="false"
--cgroups_hierarchy="/sys/fs/cgroup" --cgroups_limit_swap="false" --cgroups_root="mesos" --container_disk_watch_interval="15secs"
--containerizers="mesos" --credential="/tmp/Endpoint_SlaveEndpointTest_AuthorizedRequest_2_3NRKOB/credential"
--default_role="*" --disallow_sharing_agent_pid_namespace="false" --disk_watch_interval="1mins"
--docker="docker" --docker_kill_orphans="true" --docker_registry="https://registry-1.docker.io"
--docker_remove_delay="6hrs" --docker_socket="/var/run/docker.sock" --docker_stop_timeout="0ns"
--docker_store_dir="/tmp/Endpoint_SlaveEndpointTest_AuthorizedRequest_2_3NRKOB/store/docker"
--docker_volume_checkpoint_dir="/var/run/mesos/isolators/docker/volume" --enforce_container_disk_quota="false"
--executor_registration_timeout="1mins" --executor_reregistration_timeout="2secs" --executor_shutdown_grace_period="5secs"
--fetcher_cache_dir="/tmp/Endpoint_SlaveEndpointTest_AuthorizedRequest_2_3NRKOB/fetch" --fetcher_cache_size="2GB"
--frameworks_home="" --gc_delay="1weeks" --gc_disk_headroom="0.1" --hadoop_home="" --help="false"
--hostname_lookup="true" --http_command_executor="false" --http_credentials="/tmp/Endpoint_SlaveEndpointTest_AuthorizedRequest_2_3NRKOB/http_credentials"
--http_heartbeat_interval="30secs" --initialize_driver_logging="true" --isolation="posix/cpu,posix/mem"
--launcher="posix" --launcher_dir="/mesos/mesos-1.5.0/_build/src" --logbufsecs="0" --logging_level="INFO"
--max_completed_executors_per_framework="150" --oversubscribed_resources_interval="15secs"
--perf_duration="10secs" --perf_interval="1mins" --port="5051" --qos_correction_interval_min="0ns"
--quiet="false" --recover="reconnect" --recovery_timeout="15mins" --registration_backoff_factor="10ms"
--resources="cpus:2;gpus:0;mem:1024;disk:1024;ports:[31000-32000]" --revocable_cpu_low_priority="true"
--runtime_dir="/tmp/Endpoint_SlaveEndpointTest_AuthorizedRequest_2_3NRKOB" --sandbox_directory="/mnt/mesos/sandbox"
--strict="true" --switch_user="true" --systemd_enable_support="true" --systemd_runtime_directory="/run/systemd/system"
--version="false" --work_dir="/tmp/Endpoint_SlaveEndpointTest_AuthorizedRequest_2_FqEcwE"
--zk_session_timeout="10secs"
I0830 16:33:50.702208  5809 credentials.hpp:86] Loading credential for authentication from
'/tmp/Endpoint_SlaveEndpointTest_AuthorizedRequest_2_3NRKOB/credential'
I0830 16:33:50.702329  5809 slave.cpp:285] Agent using credential for: test-principal
I0830 16:33:50.702347  5809 credentials.hpp:37] Loading credentials for authentication from
'/tmp/Endpoint_SlaveEndpointTest_AuthorizedRequest_2_3NRKOB/http_credentials'
I0830 16:33:50.702540  5809 http.cpp:1045] Creating default 'basic' HTTP authenticator for
realm 'mesos-agent-readonly'
I0830 16:33:50.702669  5809 http.cpp:1045] Creating default 'basic' HTTP authenticator for
realm 'mesos-agent-readwrite'
I0830 16:33:50.703773  5809 slave.cpp:581] Agent resources: [{"name":"cpus","scalar":{"value":2.0},"type":"SCALAR"},{"name":"mem","scalar":{"value":1024.0},"type":"SCALAR"},{"name":"disk","scalar":{"value":1024.0},"type":"SCALAR"},{"name":"ports","ranges":{"range":[{"begin":31000,"end":32000}]},"type":"RANGES"}]
I0830 16:33:50.703966  5809 slave.cpp:589] Agent attributes: [  ]
I0830 16:33:50.703979  5809 slave.cpp:598] Agent hostname: c19d62ca30f0
I0830 16:33:50.704075  5798 status_update_manager.cpp:177] Pausing sending status updates
I0830 16:33:50.705199  5802 state.cpp:64] Recovering state from '/tmp/Endpoint_SlaveEndpointTest_AuthorizedRequest_2_FqEcwE/meta'
I0830 16:33:50.705440  5797 status_update_manager.cpp:203] Recovering status update manager
I0830 16:33:50.705598  5800 containerizer.cpp:646] Recovering containerizer
I0830 16:33:50.706709  5813 provisioner.cpp:416] Provisioner recovery complete
I0830 16:33:50.706984  5809 slave.cpp:6296] Finished recovery
I0830 16:33:50.707334  5809 slave.cpp:6478] Querying resource estimator for oversubscribable
resources
I0830 16:33:50.707592  5796 slave.cpp:6492] Received oversubscribable resources {} from the
resource estimator
I0830 16:33:50.710235  5801 process.cpp:3956] Handling HTTP event for process 'slave(806)'
with path: '/slave(806)/containers'
I0830 16:33:50.711145  5805 http.cpp:1185] HTTP GET for /slave(806)/containers from 172.17.0.7:36824
I0830 16:33:50.711199  5805 http.cpp:976] Authorizing principal 'test-principal' to GET the
'/containers' endpoint
I0830 16:33:50.714154  5794 slave.cpp:859] Agent terminating
[       OK ] Endpoint/SlaveEndpointTest.AuthorizedRequest/2 (26 ms)
[ RUN      ] Endpoint/SlaveEndpointTest.UnauthorizedRequest/0
I0830 16:33:50.724913  5772 containerizer.cpp:290] Using isolation { environment_secret, posix/cpu,
posix/mem, filesystem/posix, network/cni }
W0830 16:33:50.725450  5772 backend.cpp:76] Failed to create 'aufs' backend: AufsBackend requires
root privileges
W0830 16:33:50.725558  5772 backend.cpp:76] Failed to create 'bind' backend: BindBackend requires
root privileges
I0830 16:33:50.725599  5772 provisioner.cpp:255] Using default backend 'copy'
I0830 16:33:50.730095  5796 slave.cpp:252] Mesos agent started on (807)@172.17.0.7:42477
I0830 16:33:50.730126  5796 slave.cpp:253] Flags at startup: --acls="" --appc_simple_discovery_uri_prefix="http://"
--appc_store_dir="/tmp/Endpoint_SlaveEndpointTest_UnauthorizedRequest_0_ZhLier/store/appc"
--authenticate_http_readonly="true" --authenticate_http_readwrite="true" --authenticatee="crammd5"
--authentication_backoff_factor="1secs" --authorizer="local" --cgroups_cpu_enable_pids_and_tids_count="false"
--cgroups_enable_cfs="false" --cgroups_hierarchy="/sys/fs/cgroup" --cgroups_limit_swap="false"
--cgroups_root="mesos" --container_disk_watch_interval="15secs" --containerizers="mesos" --credential="/tmp/Endpoint_SlaveEndpointTest_UnauthorizedRequest_0_ZhLier/credential"
--default_role="*" --disallow_sharing_agent_pid_namespace="false" --disk_watch_interval="1mins"
--docker="docker" --docker_kill_orphans="true" --docker_registry="https://registry-1.docker.io"
--docker_remove_delay="6hrs" --docker_socket="/var/run/docker.sock" --docker_stop_timeout="0ns"
--docker_store_dir="/tmp/Endpoint_SlaveEndpointTest_UnauthorizedRequest_0_ZhLier/store/docker"
--docker_volume_checkpoint_dir="/var/run/mesos/isolators/docker/volume" --enforce_container_disk_quota="false"
--executor_registration_timeout="1mins" --executor_reregistration_timeout="2secs" --executor_shutdown_grace_period="5secs"
--fetcher_cache_dir="/tmp/Endpoint_SlaveEndpointTest_UnauthorizedRequest_0_ZhLier/fetch" --fetcher_cache_size="2GB"
--frameworks_home="" --gc_delay="1weeks" --gc_disk_headroom="0.1" --hadoop_home="" --help="false"
--hostname_lookup="true" --http_command_executor="false" --http_credentials="/tmp/Endpoint_SlaveEndpointTest_UnauthorizedRequest_0_ZhLier/http_credentials"
--http_heartbeat_interval="30secs" --initialize_driver_logging="true" --isolation="posix/cpu,posix/mem"
--launcher="posix" --launcher_dir="/mesos/mesos-1.5.0/_build/src" --logbufsecs="0" --logging_level="INFO"
--max_completed_executors_per_framework="150" --oversubscribed_resources_interval="15secs"
--perf_duration="10secs" --perf_interval="1mins" --port="5051" --qos_correction_interval_min="0ns"
--quiet="false" --recover="reconnect" --recovery_timeout="15mins" --registration_backoff_factor="10ms"
--resources="cpus:2;gpus:0;mem:1024;disk:1024;ports:[31000-32000]" --revocable_cpu_low_priority="true"
--runtime_dir="/tmp/Endpoint_SlaveEndpointTest_UnauthorizedRequest_0_ZhLier" --sandbox_directory="/mnt/mesos/sandbox"
--strict="true" --switch_user="true" --systemd_enable_support="true" --systemd_runtime_directory="/run/systemd/system"
--version="false" --work_dir="/tmp/Endpoint_SlaveEndpointTest_UnauthorizedRequest_0_2snLRt"
--zk_session_timeout="10secs"
I0830 16:33:50.730629  5796 credentials.hpp:86] Loading credential for authentication from
'/tmp/Endpoint_SlaveEndpointTest_UnauthorizedRequest_0_ZhLier/credential'
I0830 16:33:50.730803  5796 slave.cpp:285] Agent using credential for: test-principal
I0830 16:33:50.730823  5796 credentials.hpp:37] Loading credentials for authentication from
'/tmp/Endpoint_SlaveEndpointTest_UnauthorizedRequest_0_ZhLier/http_credentials'
I0830 16:33:50.731065  5796 http.cpp:1045] Creating default 'basic' HTTP authenticator for
realm 'mesos-agent-readonly'
I0830 16:33:50.731241  5796 http.cpp:1045] Creating default 'basic' HTTP authenticator for
realm 'mesos-agent-readwrite'
I0830 16:33:50.732506  5796 slave.cpp:581] Agent resources: [{"name":"cpus","scalar":{"value":2.0},"type":"SCALAR"},{"name":"mem","scalar":{"value":1024.0},"type":"SCALAR"},{"name":"disk","scalar":{"value":1024.0},"type":"SCALAR"},{"name":"ports","ranges":{"range":[{"begin":31000,"end":32000}]},"type":"RANGES"}]
I0830 16:33:50.732722  5796 slave.cpp:589] Agent attributes: [  ]
I0830 16:33:50.732740  5796 slave.cpp:598] Agent hostname: c19d62ca30f0
I0830 16:33:50.732853  5802 status_update_manager.cpp:177] Pausing sending status updates
I0830 16:33:50.734305  5810 state.cpp:64] Recovering state from '/tmp/Endpoint_SlaveEndpointTest_UnauthorizedRequest_0_2snLRt/meta'
I0830 16:33:50.734578  5793 status_update_manager.cpp:203] Recovering status update manager
I0830 16:33:50.734768  5808 containerizer.cpp:646] Recovering containerizer
I0830 16:33:50.735841  5809 provisioner.cpp:416] Provisioner recovery complete
I0830 16:33:50.736095  5795 slave.cpp:6296] Finished recovery
I0830 16:33:50.736404  5795 slave.cpp:6478] Querying resource estimator for oversubscribable
resources
I0830 16:33:50.736630  5801 slave.cpp:6492] Received oversubscribable resources {} from the
resource estimator
I0830 16:33:50.739039  5792 process.cpp:3956] Handling HTTP event for process 'slave(807)'
with path: '/slave(807)/monitor/statistics'
I0830 16:33:50.740082  5811 http.cpp:1185] HTTP GET for /slave(807)/monitor/statistics from
172.17.0.7:36830
I0830 16:33:50.740150  5811 http.cpp:976] Authorizing principal 'test-principal' to GET the
'/monitor/statistics' endpoint
I0830 16:33:50.741852  5793 slave.cpp:859] Agent terminating
[       OK ] Endpoint/SlaveEndpointTest.UnauthorizedRequest/0 (27 ms)
[ RUN      ] Endpoint/SlaveEndpointTest.UnauthorizedRequest/1
I0830 16:33:50.752164  5772 containerizer.cpp:290] Using isolation { environment_secret, posix/cpu,
posix/mem, filesystem/posix, network/cni }
W0830 16:33:50.752622  5772 backend.cpp:76] Failed to create 'aufs' backend: AufsBackend requires
root privileges
W0830 16:33:50.752730  5772 backend.cpp:76] Failed to create 'bind' backend: BindBackend requires
root privileges
I0830 16:33:50.752761  5772 provisioner.cpp:255] Using default backend 'copy'
I0830 16:33:50.756192  5796 slave.cpp:252] Mesos agent started on (808)@172.17.0.7:42477
I0830 16:33:50.756218  5796 slave.cpp:253] Flags at startup: --acls="" --appc_simple_discovery_uri_prefix="http://"
--appc_store_dir="/tmp/Endpoint_SlaveEndpointTest_UnauthorizedRequest_1_Sw3pUg/store/appc"
--authenticate_http_readonly="true" --authenticate_http_readwrite="true" --authenticatee="crammd5"
--authentication_backoff_factor="1secs" --authorizer="local" --cgroups_cpu_enable_pids_and_tids_count="false"
--cgroups_enable_cfs="false" --cgroups_hierarchy="/sys/fs/cgroup" --cgroups_limit_swap="false"
--cgroups_root="mesos" --container_disk_watch_interval="15secs" --containerizers="mesos" --credential="/tmp/Endpoint_SlaveEndpointTest_UnauthorizedRequest_1_Sw3pUg/credential"
--default_role="*" --disallow_sharing_agent_pid_namespace="false" --disk_watch_interval="1mins"
--docker="docker" --docker_kill_orphans="true" --docker_registry="https://registry-1.docker.io"
--docker_remove_delay="6hrs" --docker_socket="/var/run/docker.sock" --docker_stop_timeout="0ns"
--docker_store_dir="/tmp/Endpoint_SlaveEndpointTest_UnauthorizedRequest_1_Sw3pUg/store/docker"
--docker_volume_checkpoint_dir="/var/run/mesos/isolators/docker/volume" --enforce_container_disk_quota="false"
--executor_registration_timeout="1mins" --executor_reregistration_timeout="2secs" --executor_shutdown_grace_period="5secs"
--fetcher_cache_dir="/tmp/Endpoint_SlaveEndpointTest_UnauthorizedRequest_1_Sw3pUg/fetch" --fetcher_cache_size="2GB"
--frameworks_home="" --gc_delay="1weeks" --gc_disk_headroom="0.1" --hadoop_home="" --help="false"
--hostname_lookup="true" --http_command_executor="false" --http_credentials="/tmp/Endpoint_SlaveEndpointTest_UnauthorizedRequest_1_Sw3pUg/http_credentials"
--http_heartbeat_interval="30secs" --initialize_driver_logging="true" --isolation="posix/cpu,posix/mem"
--launcher="posix" --launcher_dir="/mesos/mesos-1.5.0/_build/src" --logbufsecs="0" --logging_level="INFO"
--max_completed_executors_per_framework="150" --oversubscribed_resources_interval="15secs"
--perf_duration="10secs" --perf_interval="1mins" --port="5051" --qos_correction_interval_min="0ns"
--quiet="false" --recover="reconnect" --recovery_timeout="15mins" --registration_backoff_factor="10ms"
--resources="cpus:2;gpus:0;mem:1024;disk:1024;ports:[31000-32000]" --revocable_cpu_low_priority="true"
--runtime_dir="/tmp/Endpoint_SlaveEndpointTest_UnauthorizedRequest_1_Sw3pUg" --sandbox_directory="/mnt/mesos/sandbox"
--strict="true" --switch_user="true" --systemd_enable_support="true" --systemd_runtime_directory="/run/systemd/system"
--version="false" --work_dir="/tmp/Endpoint_SlaveEndpointTest_UnauthorizedRequest_1_S7LOtj"
--zk_session_timeout="10secs"
I0830 16:33:50.756618  5796 credentials.hpp:86] Loading credential for authentication from
'/tmp/Endpoint_SlaveEndpointTest_UnauthorizedRequest_1_Sw3pUg/credential'
I0830 16:33:50.756777  5796 slave.cpp:285] Agent using credential for: test-principal
I0830 16:33:50.756799  5796 credentials.hpp:37] Loading credentials for authentication from
'/tmp/Endpoint_SlaveEndpointTest_UnauthorizedRequest_1_Sw3pUg/http_credentials'
I0830 16:33:50.757036  5796 http.cpp:1045] Creating default 'basic' HTTP authenticator for
realm 'mesos-agent-readonly'
I0830 16:33:50.757199  5796 http.cpp:1045] Creating default 'basic' HTTP authenticator for
realm 'mesos-agent-readwrite'
I0830 16:33:50.758435  5796 slave.cpp:581] Agent resources: [{"name":"cpus","scalar":{"value":2.0},"type":"SCALAR"},{"name":"mem","scalar":{"value":1024.0},"type":"SCALAR"},{"name":"disk","scalar":{"value":1024.0},"type":"SCALAR"},{"name":"ports","ranges":{"range":[{"begin":31000,"end":32000}]},"type":"RANGES"}]
I0830 16:33:50.758654  5796 slave.cpp:589] Agent attributes: [  ]
I0830 16:33:50.758672  5796 slave.cpp:598] Agent hostname: c19d62ca30f0
I0830 16:33:50.758808  5791 status_update_manager.cpp:177] Pausing sending status updates
I0830 16:33:50.760190  5795 state.cpp:64] Recovering state from '/tmp/Endpoint_SlaveEndpointTest_UnauthorizedRequest_1_S7LOtj/meta'
I0830 16:33:50.760398  5792 status_update_manager.cpp:203] Recovering status update manager
I0830 16:33:50.760557  5798 containerizer.cpp:646] Recovering containerizer
I0830 16:33:50.761804  5804 provisioner.cpp:416] Provisioner recovery complete
I0830 16:33:50.762084  5807 slave.cpp:6296] Finished recovery
I0830 16:33:50.762466  5807 slave.cpp:6478] Querying resource estimator for oversubscribable
resources
I0830 16:33:50.762661  5812 slave.cpp:6492] Received oversubscribable resources {} from the
resource estimator
I0830 16:33:50.765056  5793 process.cpp:3956] Handling HTTP event for process 'slave(808)'
with path: '/slave(808)/monitor/statistics.json'
I0830 16:33:50.766214  5795 http.cpp:1185] HTTP GET for /slave(808)/monitor/statistics.json
from 172.17.0.7:36832
I0830 16:33:50.766270  5795 http.cpp:976] Authorizing principal 'test-principal' to GET the
'/monitor/statistics.json' endpoint
I0830 16:33:50.767851  5795 slave.cpp:859] Agent terminating
[       OK ] Endpoint/SlaveEndpointTest.UnauthorizedRequest/1 (26 ms)
[ RUN      ] Endpoint/SlaveEndpointTest.UnauthorizedRequest/2
I0830 16:33:50.777994  5772 containerizer.cpp:290] Using isolation { environment_secret, posix/cpu,
posix/mem, filesystem/posix, network/cni }
W0830 16:33:50.778451  5772 backend.cpp:76] Failed to create 'aufs' backend: AufsBackend requires
root privileges
W0830 16:33:50.778554  5772 backend.cpp:76] Failed to create 'bind' backend: BindBackend requires
root privileges
I0830 16:33:50.778585  5772 provisioner.cpp:255] Using default backend 'copy'
I0830 16:33:50.782485  5805 slave.cpp:252] Mesos agent started on (809)@172.17.0.7:42477
I0830 16:33:50.782510  5805 slave.cpp:253] Flags at startup: --acls="" --appc_simple_discovery_uri_prefix="http://"
--appc_store_dir="/tmp/Endpoint_SlaveEndpointTest_UnauthorizedRequest_2_Q0e0P6/store/appc"
--authenticate_http_readonly="true" --authenticate_http_readwrite="true" --authenticatee="crammd5"
--authentication_backoff_factor="1secs" --authorizer="local" --cgroups_cpu_enable_pids_and_tids_count="false"
--cgroups_enable_cfs="false" --cgroups_hierarchy="/sys/fs/cgroup" --cgroups_limit_swap="false"
--cgroups_root="mesos" --container_disk_watch_interval="15secs" --containerizers="mesos" --credential="/tmp/Endpoint_SlaveEndpointTest_UnauthorizedRequest_2_Q0e0P6/credential"
--default_role="*" --disallow_sharing_agent_pid_namespace="false" --disk_watch_interval="1mins"
--docker="docker" --docker_kill_orphans="true" --docker_registry="https://registry-1.docker.io"
--docker_remove_delay="6hrs" --docker_socket="/var/run/docker.sock" --docker_stop_timeout="0ns"
--docker_store_dir="/tmp/Endpoint_SlaveEndpointTest_UnauthorizedRequest_2_Q0e0P6/store/docker"
--docker_volume_checkpoint_dir="/var/run/mesos/isolators/docker/volume" --enforce_container_disk_quota="false"
--executor_registration_timeout="1mins" --executor_reregistration_timeout="2secs" --executor_shutdown_grace_period="5secs"
--fetcher_cache_dir="/tmp/Endpoint_SlaveEndpointTest_UnauthorizedRequest_2_Q0e0P6/fetch" --fetcher_cache_size="2GB"
--frameworks_home="" --gc_delay="1weeks" --gc_disk_headroom="0.1" --hadoop_home="" --help="false"
--hostname_lookup="true" --http_command_executor="false" --http_credentials="/tmp/Endpoint_SlaveEndpointTest_UnauthorizedRequest_2_Q0e0P6/http_credentials"
--http_heartbeat_interval="30secs" --initialize_driver_logging="true" --isolation="posix/cpu,posix/mem"
--launcher="posix" --launcher_dir="/mesos/mesos-1.5.0/_build/src" --logbufsecs="0" --logging_level="INFO"
--max_completed_executors_per_framework="150" --oversubscribed_resources_interval="15secs"
--perf_duration="10secs" --perf_interval="1mins" --port="5051" --qos_correction_interval_min="0ns"
--quiet="false" --recover="reconnect" --recovery_timeout="15mins" --registration_backoff_factor="10ms"
--resources="cpus:2;gpus:0;mem:1024;disk:1024;ports:[31000-32000]" --revocable_cpu_low_priority="true"
--runtime_dir="/tmp/Endpoint_SlaveEndpointTest_UnauthorizedRequest_2_Q0e0P6" --sandbox_directory="/mnt/mesos/sandbox"
--strict="true" --switch_user="true" --systemd_enable_support="true" --systemd_runtime_directory="/run/systemd/system"
--version="false" --work_dir="/tmp/Endpoint_SlaveEndpointTest_UnauthorizedRequest_2_Rcvxl9"
--zk_session_timeout="10secs"
I0830 16:33:50.782984  5805 credentials.hpp:86] Loading credential for authentication from
'/tmp/Endpoint_SlaveEndpointTest_UnauthorizedRequest_2_Q0e0P6/credential'
I0830 16:33:50.783205  5805 slave.cpp:285] Agent using credential for: test-principal
I0830 16:33:50.783229  5805 credentials.hpp:37] Loading credentials for authentication from
'/tmp/Endpoint_SlaveEndpointTest_UnauthorizedRequest_2_Q0e0P6/http_credentials'
I0830 16:33:50.783484  5805 http.cpp:1045] Creating default 'basic' HTTP authenticator for
realm 'mesos-agent-readonly'
I0830 16:33:50.783673  5805 http.cpp:1045] Creating default 'basic' HTTP authenticator for
realm 'mesos-agent-readwrite'
I0830 16:33:50.785004  5805 slave.cpp:581] Agent resources: [{"name":"cpus","scalar":{"value":2.0},"type":"SCALAR"},{"name":"mem","scalar":{"value":1024.0},"type":"SCALAR"},{"name":"disk","scalar":{"value":1024.0},"type":"SCALAR"},{"name":"ports","ranges":{"range":[{"begin":31000,"end":32000}]},"type":"RANGES"}]
I0830 16:33:50.785214  5805 slave.cpp:589] Agent attributes: [  ]
I0830 16:33:50.785225  5805 slave.cpp:598] Agent hostname: c19d62ca30f0
I0830 16:33:50.785348  5794 status_update_manager.cpp:177] Pausing sending status updates
I0830 16:33:50.786777  5792 state.cpp:64] Recovering state from '/tmp/Endpoint_SlaveEndpointTest_UnauthorizedRequest_2_Rcvxl9/meta'
I0830 16:33:50.787076  5802 status_update_manager.cpp:203] Recovering status update manager
I0830 16:33:50.787237  5804 containerizer.cpp:646] Recovering containerizer
I0830 16:33:50.788393  5812 provisioner.cpp:416] Provisioner recovery complete
I0830 16:33:50.788710  5811 slave.cpp:6296] Finished recovery
I0830 16:33:50.789204  5811 slave.cpp:6478] Querying resource estimator for oversubscribable
resources
I0830 16:33:50.789420  5798 slave.cpp:6492] Received oversubscribable resources {} from the
resource estimator
I0830 16:33:50.791692  5796 process.cpp:3956] Handling HTTP event for process 'slave(809)'
with path: '/slave(809)/containers'
I0830 16:33:50.792739  5792 http.cpp:1185] HTTP GET for /slave(809)/containers from 172.17.0.7:36836
I0830 16:33:50.792810  5792 http.cpp:976] Authorizing principal 'test-principal' to GET the
'/containers' endpoint
I0830 16:33:50.794430  5792 slave.cpp:859] Agent terminating
[       OK ] Endpoint/SlaveEndpointTest.UnauthorizedRequest/2 (26 ms)
[ RUN      ] Endpoint/SlaveEndpointTest.NoAuthorizer/0
I0830 16:33:50.804811  5772 containerizer.cpp:290] Using isolation { environment_secret, posix/cpu,
posix/mem, filesystem/posix, network/cni }
W0830 16:33:50.805274  5772 backend.cpp:76] Failed to create 'aufs' backend: AufsBackend requires
root privileges
W0830 16:33:50.805387  5772 backend.cpp:76] Failed to create 'bind' backend: BindBackend requires
root privileges
I0830 16:33:50.805423  5772 provisioner.cpp:255] Using default backend 'copy'
I0830 16:33:50.807025  5772 cluster.cpp:448] Creating default 'local' authorizer
I0830 16:33:50.808840  5794 slave.cpp:252] Mesos agent started on (810)@172.17.0.7:42477
I0830 16:33:50.808861  5794 slave.cpp:253] Flags at startup: --acls="" --appc_simple_discovery_uri_prefix="http://"
--appc_store_dir="/tmp/Endpoint_SlaveEndpointTest_NoAuthorizer_0_TGHk1W/store/appc" --authenticate_http_readonly="true"
--authenticate_http_readwrite="true" --authenticatee="crammd5" --authentication_backoff_factor="1secs"
--authorizer="local" --cgroups_cpu_enable_pids_and_tids_count="false" --cgroups_enable_cfs="false"
--cgroups_hierarchy="/sys/fs/cgroup" --cgroups_limit_swap="false" --cgroups_root="mesos" --container_disk_watch_interval="15secs"
--containerizers="mesos" --credential="/tmp/Endpoint_SlaveEndpointTest_NoAuthorizer_0_TGHk1W/credential"
--default_role="*" --disallow_sharing_agent_pid_namespace="false" --disk_watch_interval="1mins"
--docker="docker" --docker_kill_orphans="true" --docker_registry="https://registry-1.docker.io"
--docker_remove_delay="6hrs" --docker_socket="/var/run/docker.sock" --docker_stop_timeout="0ns"
--docker_store_dir="/tmp/Endpoint_SlaveEndpointTest_NoAuthorizer_0_TGHk1W/store/docker" --docker_volume_checkpoint_dir="/var/run/mesos/isolators/docker/volume"
--enforce_container_disk_quota="false" --executor_registration_timeout="1mins" --executor_reregistration_timeout="2secs"
--executor_shutdown_grace_period="5secs" --fetcher_cache_dir="/tmp/Endpoint_SlaveEndpointTest_NoAuthorizer_0_TGHk1W/fetch"
--fetcher_cache_size="2GB" --frameworks_home="" --gc_delay="1weeks" --gc_disk_headroom="0.1"
--hadoop_home="" --help="false" --hostname_lookup="true" --http_command_executor="false" --http_credentials="/tmp/Endpoint_SlaveEndpointTest_NoAuthorizer_0_TGHk1W/http_credentials"
--http_heartbeat_interval="30secs" --initialize_driver_logging="true" --isolation="posix/cpu,posix/mem"
--launcher="posix" --launcher_dir="/mesos/mesos-1.5.0/_build/src" --logbufsecs="0" --logging_level="INFO"
--max_completed_executors_per_framework="150" --oversubscribed_resources_interval="15secs"
--perf_duration="10secs" --perf_interval="1mins" --port="5051" --qos_correction_interval_min="0ns"
--quiet="false" --recover="reconnect" --recovery_timeout="15mins" --registration_backoff_factor="10ms"
--resources="cpus:2;gpus:0;mem:1024;disk:1024;ports:[31000-32000]" --revocable_cpu_low_priority="true"
--runtime_dir="/tmp/Endpoint_SlaveEndpointTest_NoAuthorizer_0_TGHk1W" --sandbox_directory="/mnt/mesos/sandbox"
--strict="true" --switch_user="true" --systemd_enable_support="true" --systemd_runtime_directory="/run/systemd/system"
--version="false" --work_dir="/tmp/Endpoint_SlaveEndpointTest_NoAuthorizer_0_v2zWsZ" --zk_session_timeout="10secs"
I0830 16:33:50.809319  5794 credentials.hpp:86] Loading credential for authentication from
'/tmp/Endpoint_SlaveEndpointTest_NoAuthorizer_0_TGHk1W/credential'
I0830 16:33:50.809469  5794 slave.cpp:285] Agent using credential for: test-principal
I0830 16:33:50.809487  5794 credentials.hpp:37] Loading credentials for authentication from
'/tmp/Endpoint_SlaveEndpointTest_NoAuthorizer_0_TGHk1W/http_credentials'
I0830 16:33:50.809689  5794 http.cpp:1045] Creating default 'basic' HTTP authenticator for
realm 'mesos-agent-readonly'
I0830 16:33:50.809821  5794 http.cpp:1045] Creating default 'basic' HTTP authenticator for
realm 'mesos-agent-readwrite'
I0830 16:33:50.811192  5794 slave.cpp:581] Agent resources: [{"name":"cpus","scalar":{"value":2.0},"type":"SCALAR"},{"name":"mem","scalar":{"value":1024.0},"type":"SCALAR"},{"name":"disk","scalar":{"value":1024.0},"type":"SCALAR"},{"name":"ports","ranges":{"range":[{"begin":31000,"end":32000}]},"type":"RANGES"}]
I0830 16:33:50.811408  5794 slave.cpp:589] Agent attributes: [  ]
I0830 16:33:50.811421  5794 slave.cpp:598] Agent hostname: c19d62ca30f0
I0830 16:33:50.811535  5792 status_update_manager.cpp:177] Pausing sending status updates
I0830 16:33:50.812897  5811 state.cpp:64] Recovering state from '/tmp/Endpoint_SlaveEndpointTest_NoAuthorizer_0_v2zWsZ/meta'
I0830 16:33:50.813170  5803 status_update_manager.cpp:203] Recovering status update manager
I0830 16:33:50.813347  5808 containerizer.cpp:646] Recovering containerizer
I0830 16:33:50.814504  5791 provisioner.cpp:416] Provisioner recovery complete
I0830 16:33:50.814760  5802 slave.cpp:6296] Finished recovery
I0830 16:33:50.815204  5802 slave.cpp:6478] Querying resource estimator for oversubscribable
resources
I0830 16:33:50.815403  5807 slave.cpp:6492] Received oversubscribable resources {} from the
resource estimator
I0830 16:33:50.817270  5805 process.cpp:3956] Handling HTTP event for process 'slave(810)'
with path: '/slave(810)/monitor/statistics'
I0830 16:33:50.818296  5793 http.cpp:1185] HTTP GET for /slave(810)/monitor/statistics from
172.17.0.7:36838
I0830 16:33:50.818366  5793 http.cpp:976] Authorizing principal 'test-principal' to GET the
'/monitor/statistics' endpoint
I0830 16:33:50.820912  5772 slave.cpp:859] Agent terminating
[       OK ] Endpoint/SlaveEndpointTest.NoAuthorizer/0 (27 ms)
[ RUN      ] Endpoint/SlaveEndpointTest.NoAuthorizer/1
I0830 16:33:50.832305  5772 containerizer.cpp:290] Using isolation { environment_secret, posix/cpu,
posix/mem, filesystem/posix, network/cni }
W0830 16:33:50.832998  5772 backend.cpp:76] Failed to create 'aufs' backend: AufsBackend requires
root privileges
W0830 16:33:50.833147  5772 backend.cpp:76] Failed to create 'bind' backend: BindBackend requires
root privileges
I0830 16:33:50.833194  5772 provisioner.cpp:255] Using default backend 'copy'
I0830 16:33:50.835696  5772 cluster.cpp:448] Creating default 'local' authorizer
I0830 16:33:50.838778  5791 slave.cpp:252] Mesos agent started on (811)@172.17.0.7:42477
I0830 16:33:50.838804  5791 slave.cpp:253] Flags at startup: --acls="" --appc_simple_discovery_uri_prefix="http://"
--appc_store_dir="/tmp/Endpoint_SlaveEndpointTest_NoAuthorizer_1_OmEzsN/store/appc" --authenticate_http_readonly="true"
--authenticate_http_readwrite="true" --authenticatee="crammd5" --authentication_backoff_factor="1secs"
--authorizer="local" --cgroups_cpu_enable_pids_and_tids_count="false" --cgroups_enable_cfs="false"
--cgroups_hierarchy="/sys/fs/cgroup" --cgroups_limit_swap="false" --cgroups_root="mesos" --container_disk_watch_interval="15secs"
--containerizers="mesos" --credential="/tmp/Endpoint_SlaveEndpointTest_NoAuthorizer_1_OmEzsN/credential"
--default_role="*" --disallow_sharing_agent_pid_namespace="false" --disk_watch_interval="1mins"
--docker="docker" --docker_kill_orphans="true" --docker_registry="https://registry-1.docker.io"
--docker_remove_delay="6hrs" --docker_socket="/var/run/docker.sock" --docker_stop_timeout="0ns"
--docker_store_dir="/tmp/Endpoint_SlaveEndpointTest_NoAuthorizer_1_OmEzsN/store/docker" --docker_volume_checkpoint_dir="/var/run/mesos/isolators/docker/volume"
--enforce_container_disk_quota="false" --executor_registration_timeout="1mins" --executor_reregistration_timeout="2secs"
--executor_shutdown_grace_period="5secs" --fetcher_cache_dir="/tmp/Endpoint_SlaveEndpointTest_NoAuthorizer_1_OmEzsN/fetch"
--fetcher_cache_size="2GB" --frameworks_home="" --gc_delay="1weeks" --gc_disk_headroom="0.1"
--hadoop_home="" --help="false" --hostname_lookup="true" --http_command_executor="false" --http_credentials="/tmp/Endpoint_SlaveEndpointTest_NoAuthorizer_1_OmEzsN/http_credentials"
--http_heartbeat_interval="30secs" --initialize_driver_logging="true" --isolation="posix/cpu,posix/mem"
--launcher="posix" --launcher_dir="/mesos/mesos-1.5.0/_build/src" --logbufsecs="0" --logging_level="INFO"
--max_completed_executors_per_framework="150" --oversubscribed_resources_interval="15secs"
--perf_duration="10secs" --perf_interval="1mins" --port="5051" --qos_correction_interval_min="0ns"
--quiet="false" --recover="reconnect" --recovery_timeout="15mins" --registration_backoff_factor="10ms"
--resources="cpus:2;gpus:0;mem:1024;disk:1024;ports:[31000-32000]" --revocable_cpu_low_priority="true"
--runtime_dir="/tmp/Endpoint_SlaveEndpointTest_NoAuthorizer_1_OmEzsN" --sandbox_directory="/mnt/mesos/sandbox"
--strict="true" --switch_user="true" --systemd_enable_support="true" --systemd_runtime_directory="/run/systemd/system"
--version="false" --work_dir="/tmp/Endpoint_SlaveEndpointTest_NoAuthorizer_1_F2gaQP" --zk_session_timeout="10secs"
I0830 16:33:50.839241  5791 credentials.hpp:86] Loading credential for authentication from
'/tmp/Endpoint_SlaveEndpointTest_NoAuthorizer_1_OmEzsN/credential'
I0830 16:33:50.839488  5791 slave.cpp:285] Agent using credential for: test-principal
I0830 16:33:50.839516  5791 credentials.hpp:37] Loading credentials for authentication from
'/tmp/Endpoint_SlaveEndpointTest_NoAuthorizer_1_OmEzsN/http_credentials'
I0830 16:33:50.839825  5791 http.cpp:1045] Creating default 'basic' HTTP authenticator for
realm 'mesos-agent-readonly'
I0830 16:33:50.840024  5791 http.cpp:1045] Creating default 'basic' HTTP authenticator for
realm 'mesos-agent-readwrite'
I0830 16:33:50.841338  5791 slave.cpp:581] Agent resources: [{"name":"cpus","scalar":{"value":2.0},"type":"SCALAR"},{"name":"mem","scalar":{"value":1024.0},"type":"SCALAR"},{"name":"disk","scalar":{"value":1024.0},"type":"SCALAR"},{"name":"ports","ranges":{"range":[{"begin":31000,"end":32000}]},"type":"RANGES"}]
I0830 16:33:50.841553  5791 slave.cpp:589] Agent attributes: [  ]
I0830 16:33:50.841575  5791 slave.cpp:598] Agent hostname: c19d62ca30f0
I0830 16:33:50.841719  5813 status_update_manager.cpp:177] Pausing sending status updates
I0830 16:33:50.843230  5809 state.cpp:64] Recovering state from '/tmp/Endpoint_SlaveEndpointTest_NoAuthorizer_1_F2gaQP/meta'
I0830 16:33:50.843519  5793 status_update_manager.cpp:203] Recovering status update manager
I0830 16:33:50.843693  5810 containerizer.cpp:646] Recovering containerizer
I0830 16:33:50.844899  5796 provisioner.cpp:416] Provisioner recovery complete
I0830 16:33:50.845203  5801 slave.cpp:6296] Finished recovery
I0830 16:33:50.845708  5801 slave.cpp:6478] Querying resource estimator for oversubscribable
resources
I0830 16:33:50.845939  5795 slave.cpp:6492] Received oversubscribable resources {} from the
resource estimator
I0830 16:33:50.847777  5799 process.cpp:3956] Handling HTTP event for process 'slave(811)'
with path: '/slave(811)/monitor/statistics.json'
I0830 16:33:50.848820  5794 http.cpp:1185] HTTP GET for /slave(811)/monitor/statistics.json
from 172.17.0.7:36842
I0830 16:33:50.848922  5794 http.cpp:976] Authorizing principal 'test-principal' to GET the
'/monitor/statistics.json' endpoint
I0830 16:33:50.851711  5798 slave.cpp:859] Agent terminating
[       OK ] Endpoint/SlaveEndpointTest.NoAuthorizer/1 (31 ms)
[ RUN      ] Endpoint/SlaveEndpointTest.NoAuthorizer/2
I0830 16:33:50.862977  5772 containerizer.cpp:290] Using isolation { environment_secret, posix/cpu,
posix/mem, filesystem/posix, network/cni }
W0830 16:33:50.863420  5772 backend.cpp:76] Failed to create 'aufs' backend: AufsBackend requires
root privileges
W0830 16:33:50.863517  5772 backend.cpp:76] Failed to create 'bind' backend: BindBackend requires
root privileges
I0830 16:33:50.863559  5772 provisioner.cpp:255] Using default backend 'copy'
I0830 16:33:50.865104  5772 cluster.cpp:448] Creating default 'local' authorizer
I0830 16:33:50.866976  5792 slave.cpp:252] Mesos agent started on (812)@172.17.0.7:42477
I0830 16:33:50.867024  5792 slave.cpp:253] Flags at startup: --acls="" --appc_simple_discovery_uri_prefix="http://"
--appc_store_dir="/tmp/Endpoint_SlaveEndpointTest_NoAuthorizer_2_EhEncE/store/appc" --authenticate_http_readonly="true"
--authenticate_http_readwrite="true" --authenticatee="crammd5" --authentication_backoff_factor="1secs"
--authorizer="local" --cgroups_cpu_enable_pids_and_tids_count="false" --cgroups_enable_cfs="false"
--cgroups_hierarchy="/sys/fs/cgroup" --cgroups_limit_swap="false" --cgroups_root="mesos" --container_disk_watch_interval="15secs"
--containerizers="mesos" --credential="/tmp/Endpoint_SlaveEndpointTest_NoAuthorizer_2_EhEncE/credential"
--default_role="*" --disallow_sharing_agent_pid_namespace="false" --disk_watch_interval="1mins"
--docker="docker" --docker_kill_orphans="true" --docker_registry="https://registry-1.docker.io"
--docker_remove_delay="6hrs" --docker_socket="/var/run/docker.sock" --docker_stop_timeout="0ns"
--docker_store_dir="/tmp/Endpoint_SlaveEndpointTest_NoAuthorizer_2_EhEncE/store/docker" --docker_volume_checkpoint_dir="/var/run/mesos/isolators/docker/volume"
--enforce_container_disk_quota="false" --executor_registration_timeout="1mins" --executor_reregistration_timeout="2secs"
--executor_shutdown_grace_period="5secs" --fetcher_cache_dir="/tmp/Endpoint_SlaveEndpointTest_NoAuthorizer_2_EhEncE/fetch"
--fetcher_cache_size="2GB" --frameworks_home="" --gc_delay="1weeks" --gc_disk_headroom="0.1"
--hadoop_home="" --help="false" --hostname_lookup="true" --http_command_executor="false" --http_credentials="/tmp/Endpoint_SlaveEndpointTest_NoAuthorizer_2_EhEncE/http_credentials"
--http_heartbeat_interval="30secs" --initialize_driver_logging="true" --isolation="posix/cpu,posix/mem"
--launcher="posix" --launcher_dir="/mesos/mesos-1.5.0/_build/src" --logbufsecs="0" --logging_level="INFO"
--max_completed_executors_per_framework="150" --oversubscribed_resources_interval="15secs"
--perf_duration="10secs" --perf_interval="1mins" --port="5051" --qos_correction_interval_min="0ns"
--quiet="false" --recover="reconnect" --recovery_timeout="15mins" --registration_backoff_factor="10ms"
--resources="cpus:2;gpus:0;mem:1024;disk:1024;ports:[31000-32000]" --revocable_cpu_low_priority="true"
--runtime_dir="/tmp/Endpoint_SlaveEndpointTest_NoAuthorizer_2_EhEncE" --sandbox_directory="/mnt/mesos/sandbox"
--strict="true" --switch_user="true" --systemd_enable_support="true" --systemd_runtime_directory="/run/systemd/system"
--version="false" --work_dir="/tmp/Endpoint_SlaveEndpointTest_NoAuthorizer_2_XQ4ivG" --zk_session_timeout="10secs"
I0830 16:33:50.867482  5792 credentials.hpp:86] Loading credential for authentication from
'/tmp/Endpoint_SlaveEndpointTest_NoAuthorizer_2_EhEncE/credential'
I0830 16:33:50.867730  5792 slave.cpp:285] Agent using credential for: test-principal
I0830 16:33:50.867750  5792 credentials.hpp:37] Loading credentials for authentication from
'/tmp/Endpoint_SlaveEndpointTest_NoAuthorizer_2_EhEncE/http_credentials'
I0830 16:33:50.867977  5792 http.cpp:1045] Creating default 'basic' HTTP authenticator for
realm 'mesos-agent-readonly'
I0830 16:33:50.868191  5792 http.cpp:1045] Creating default 'basic' HTTP authenticator for
realm 'mesos-agent-readwrite'
I0830 16:33:50.870211  5792 slave.cpp:581] Agent resources: [{"name":"cpus","scalar":{"value":2.0},"type":"SCALAR"},{"name":"mem","scalar":{"value":1024.0},"type":"SCALAR"},{"name":"disk","scalar":{"value":1024.0},"type":"SCALAR"},{"name":"ports","ranges":{"range":[{"begin":31000,"end":32000}]},"type":"RANGES"}]
I0830 16:33:50.870551  5792 slave.cpp:589] Agent attributes: [  ]
I0830 16:33:50.870574  5792 slave.cpp:598] Agent hostname: c19d62ca30f0
I0830 16:33:50.870728  5810 status_update_manager.cpp:177] Pausing sending status updates
I0830 16:33:50.872618  5806 state.cpp:64] Recovering state from '/tmp/Endpoint_SlaveEndpointTest_NoAuthorizer_2_XQ4ivG/meta'
I0830 16:33:50.872975  5809 status_update_manager.cpp:203] Recovering status update manager
I0830 16:33:50.873185  5794 containerizer.cpp:646] Recovering containerizer
I0830 16:33:50.874503  5796 provisioner.cpp:416] Provisioner recovery complete
I0830 16:33:50.874833  5803 slave.cpp:6296] Finished recovery
I0830 16:33:50.875427  5803 slave.cpp:6478] Querying resource estimator for oversubscribable
resources
I0830 16:33:50.875725  5805 slave.cpp:6492] Received oversubscribable resources {} from the
resource estimator
I0830 16:33:50.877878  5797 process.cpp:3956] Handling HTTP event for process 'slave(812)'
with path: '/slave(812)/containers'
I0830 16:33:50.879082  5793 http.cpp:1185] HTTP GET for /slave(812)/containers from 172.17.0.7:36846
I0830 16:33:50.879174  5793 http.cpp:976] Authorizing principal 'test-principal' to GET the
'/containers' endpoint
I0830 16:33:50.882230  5807 slave.cpp:859] Agent terminating
[       OK ] Endpoint/SlaveEndpointTest.NoAuthorizer/2 (29 ms)
[----------] 9 tests from Endpoint/SlaveEndpointTest (249 ms total)

[----------] 2 tests from ContainerizerType/DefaultContainerDNSFlagTest
[ RUN      ] ContainerizerType/DefaultContainerDNSFlagTest.ValidateFlag/0
[       OK ] ContainerizerType/DefaultContainerDNSFlagTest.ValidateFlag/0 (11 ms)
[ RUN      ] ContainerizerType/DefaultContainerDNSFlagTest.ValidateFlag/1
[       OK ] ContainerizerType/DefaultContainerDNSFlagTest.ValidateFlag/1 (12 ms)
[----------] 2 tests from ContainerizerType/DefaultContainerDNSFlagTest (23 ms total)

[----------] Global test environment tear-down
[==========] 1663 tests from 183 test cases ran. (504874 ms total)
[  PASSED  ] 1662 tests.
[  FAILED  ] 1 test, listed below:
[  FAILED  ] ExamplesTest.TestHTTPFramework

 1 FAILED TEST
  YOU HAVE 20 DISABLED TESTS

I0830 16:33:50.969910  5815 process.cpp:1072] Failed to accept socket: future discarded
make[4]: *** [check-local] Error 1
make[4]: Leaving directory `/mesos/mesos-1.5.0/_build/src'
make[3]: *** [check-am] Error 2
make[3]: Leaving directory `/mesos/mesos-1.5.0/_build/src'
make[2]: *** [check] Error 2
make[2]: Leaving directory `/mesos/mesos-1.5.0/_build/src'
make[1]: *** [check-recursive] Error 1
make[1]: Leaving directory `/mesos/mesos-1.5.0/_build'
make: *** [distcheck] Error 1
+ docker rmi mesos-1504107111-11879
Untagged: mesos-1504107111-11879:latest
Deleted: sha256:9eb1075862cb80ab3769245ae2beaf84654db6821259958a4d04a87b8c3f191e
Deleted: sha256:8ca7b84c79137fec801300fdc022a9df71d42662d2a4c4ee7c9d8d627aa3d885
Deleted: sha256:955c1d69d3f8f5c21d81d85526253516dc0c85dc197e55c5310d406e79453e63
Deleted: sha256:434ec6a3233a4fc6b3f8b21ff37f1beda937b7f3c1f4e4aba5b3749d526a4402
Deleted: sha256:e7c2a0ac3256f3d5b280563405d97fb2ca19f1fdf0fef9194bc1fe450cd5b10e
Deleted: sha256:de5ef1c89738f6b9a4d7146110d7923be3952f686c7dcae5c095b058c35df1b8
Deleted: sha256:266dffd1d39341fbf2cf62d23763fc72bb2ff9cd4f089a156c2e34d6edc2fce0
Deleted: sha256:5ceddd37a38318f9cb8cc12babdbd9b0b546b736b6f0e09d6514f5a96e3532fd
Deleted: sha256:57a8137a233115cbcbdb2b70ed96a0e625f085265f8fd8a14c9e878ebf143d37
Deleted: sha256:51ac353a46d3efe9a52837c44155217410dd07cbcc0c9a0aa7525b6aac7fa7b7
Deleted: sha256:dc1c986fbd117da1c663e1f3f263d47da4d514673ce795ddddac4040ec6af4dc
Deleted: sha256:0000941eead07e29d8a6fc4e068e871bea5be4be93b61220fbcf1a73d7af0187
Deleted: sha256:0f7856a741cc6172c4430f9706fbb1a250f3aa705780ab454516768c02accfdf
Deleted: sha256:321e7fd219451f793f1f3c8d3f51158ba3d490f33dd1958709556b6f1e8ba1aa
Deleted: sha256:a921649baeddd076bf7b304c1b51f33a86d91aa8b8f2e8a566a98e36f78ca260
Deleted: sha256:77f966c3ed6e066ef9f8752cd782aba4701dca5d67503e015d0be3470db293af
Deleted: sha256:46254531afc701707c3421033c2be932242701455f49d5ea013facca1189caba
Deleted: sha256:3f9ad37a2ed1590a61e260c7fe712220908c5537359425fd78b09b1acf2b0196
Deleted: sha256:3c8b63832dae44df65175e7b3939d26241040ca6f662dad1f228e20c75f74418
Deleted: sha256:dda0c332f185f56360efb6cc84af45b10400421f7aded220e421d7112a232b65
Deleted: sha256:eed8a223f07d0a14b54d07749582237fabe40fa43ae28cac227910444f0d8875
Deleted: sha256:dffed61ec2cfbef246486468e3a7e5c934dfe489cdbcd6f4d42fe8351cce0500
Deleted: sha256:fafcfb8bdc2220559c7f2ed9f38d7a32d1a9f78d6e22a14551fa46615a6b787e
Deleted: sha256:d5ca0185f8b753bfdeca5c0973117b6ffaa8143958bb560a0bcdcd4154a40087
Build step 'Execute shell' marked build as failure

Mime
View raw message