mesos-builds mailing list archives

Site index · List index
Message view « Date » · « Thread »
Top « Date » · « Thread »
From Apache Jenkins Server <jenk...@builds.apache.org>
Subject Build failed in Jenkins: Mesos-Buildbot » autotools,gcc,--verbose,GLOG_v=1 MESOS_VERBOSE=1,centos:7,(ubuntu)&&(!ubuntu-us1)&&(!ubuntu-eu2) #4064
Date Fri, 04 Aug 2017 03:28:54 GMT
See <https://builds.apache.org/job/Mesos-Buildbot/BUILDTOOL=autotools,COMPILER=gcc,CONFIGURATION=--verbose,ENVIRONMENT=GLOG_v=1%20MESOS_VERBOSE=1,OS=centos%3A7,label_exp=(ubuntu)&&(!ubuntu-us1)&&(!ubuntu-eu2)/4064/display/redirect?page=changes>

Changes:

[bmahler] Remove support for omitting 202 responses to old libprocess clients.

------------------------------------------
[...truncated 30.53 MB...]
I0804 03:28:29.474540  6448 http.cpp:1026] Creating default 'basic' HTTP authenticator for
realm 'mesos-agent-readwrite'
I0804 03:28:29.475822  6448 slave.cpp:565] Agent resources: [{"name":"cpus","scalar":{"value":2.0},"type":"SCALAR"},{"name":"mem","scalar":{"value":1024.0},"type":"SCALAR"},{"name":"disk","scalar":{"value":1024.0},"type":"SCALAR"},{"name":"ports","ranges":{"range":[{"begin":31000,"end":32000}]},"type":"RANGES"}]
I0804 03:28:29.476055  6448 slave.cpp:573] Agent attributes: [  ]
I0804 03:28:29.476073  6448 slave.cpp:582] Agent hostname: 8756f5199364
I0804 03:28:29.476182  6459 status_update_manager.cpp:177] Pausing sending status updates
I0804 03:28:29.477602  6456 state.cpp:64] Recovering state from '/tmp/Endpoint_SlaveEndpointTest_AuthorizedRequest_2_OBPMN2/meta'
I0804 03:28:29.477865  6454 status_update_manager.cpp:203] Recovering status update manager
I0804 03:28:29.478042  6445 containerizer.cpp:598] Recovering containerizer
I0804 03:28:29.479276  6446 provisioner.cpp:416] Provisioner recovery complete
I0804 03:28:29.479583  6447 slave.cpp:6207] Finished recovery
I0804 03:28:29.479985  6447 slave.cpp:6389] Querying resource estimator for oversubscribable
resources
I0804 03:28:29.480182  6461 slave.cpp:6403] Received oversubscribable resources {} from the
resource estimator
I0804 03:28:29.482450  6449 process.cpp:3933] Handling HTTP event for process 'slave(794)'
with path: '/slave(794)/containers'
I0804 03:28:29.483717  6441 http.cpp:1166] HTTP GET for /slave(794)/containers from 172.17.0.3:43876
I0804 03:28:29.483796  6441 http.cpp:957] Authorizing principal 'test-principal' to GET the
'/containers' endpoint
I0804 03:28:29.486979  6441 slave.cpp:843] Agent terminating
[       OK ] Endpoint/SlaveEndpointTest.AuthorizedRequest/2 (28 ms)
[ RUN      ] Endpoint/SlaveEndpointTest.UnauthorizedRequest/0
I0804 03:28:29.497443  6422 containerizer.cpp:246] Using isolation: posix/cpu,posix/mem,filesystem/posix,network/cni,environment_secret
W0804 03:28:29.497957  6422 backend.cpp:76] Failed to create 'aufs' backend: AufsBackend requires
root privileges
W0804 03:28:29.498061  6422 backend.cpp:76] Failed to create 'bind' backend: BindBackend requires
root privileges
I0804 03:28:29.498093  6422 provisioner.cpp:255] Using default backend 'copy'
I0804 03:28:29.501476  6453 slave.cpp:250] Mesos agent started on (795)@172.17.0.3:45209
I0804 03:28:29.501503  6453 slave.cpp:251] Flags at startup: --acls="" --appc_simple_discovery_uri_prefix="http://"
--appc_store_dir="/tmp/Endpoint_SlaveEndpointTest_UnauthorizedRequest_0_8LAnPf/store/appc"
--authenticate_http_readonly="true" --authenticate_http_readwrite="true" --authenticatee="crammd5"
--authentication_backoff_factor="1secs" --authorizer="local" --cgroups_cpu_enable_pids_and_tids_count="false"
--cgroups_enable_cfs="false" --cgroups_hierarchy="/sys/fs/cgroup" --cgroups_limit_swap="false"
--cgroups_root="mesos" --container_disk_watch_interval="15secs" --containerizers="mesos" --credential="/tmp/Endpoint_SlaveEndpointTest_UnauthorizedRequest_0_8LAnPf/credential"
--default_role="*" --disk_watch_interval="1mins" --docker="docker" --docker_kill_orphans="true"
--docker_registry="https://registry-1.docker.io" --docker_remove_delay="6hrs" --docker_socket="/var/run/docker.sock"
--docker_stop_timeout="0ns" --docker_store_dir="/tmp/Endpoint_SlaveEndpointTest_UnauthorizedRequest_0_8LAnPf/store/docker"
--docker_volume_checkpoint_dir="/var/run/mesos/isolators/docker/volume" --enforce_container_disk_quota="false"
--executor_registration_timeout="1mins" --executor_reregistration_timeout="2secs" --executor_shutdown_grace_period="5secs"
--fetcher_cache_dir="/tmp/Endpoint_SlaveEndpointTest_UnauthorizedRequest_0_8LAnPf/fetch" --fetcher_cache_size="2GB"
--frameworks_home="" --gc_delay="1weeks" --gc_disk_headroom="0.1" --hadoop_home="" --help="false"
--hostname_lookup="true" --http_command_executor="false" --http_credentials="/tmp/Endpoint_SlaveEndpointTest_UnauthorizedRequest_0_8LAnPf/http_credentials"
--http_heartbeat_interval="30secs" --initialize_driver_logging="true" --isolation="posix/cpu,posix/mem"
--launcher="posix" --launcher_dir="/mesos/mesos-1.4.0/_build/src" --logbufsecs="0" --logging_level="INFO"
--max_completed_executors_per_framework="150" --oversubscribed_resources_interval="15secs"
--perf_duration="10secs" --perf_interval="1mins" --port="5051" --qos_correction_interval_min="0ns"
--quiet="false" --recover="reconnect" --recovery_timeout="15mins" --registration_backoff_factor="10ms"
--resources="cpus:2;gpus:0;mem:1024;disk:1024;ports:[31000-32000]" --revocable_cpu_low_priority="true"
--runtime_dir="/tmp/Endpoint_SlaveEndpointTest_UnauthorizedRequest_0_8LAnPf" --sandbox_directory="/mnt/mesos/sandbox"
--strict="true" --switch_user="true" --systemd_enable_support="true" --systemd_runtime_directory="/run/systemd/system"
--version="false" --work_dir="/tmp/Endpoint_SlaveEndpointTest_UnauthorizedRequest_0_wSm7ZB"
I0804 03:28:29.501997  6453 credentials.hpp:86] Loading credential for authentication from
'/tmp/Endpoint_SlaveEndpointTest_UnauthorizedRequest_0_8LAnPf/credential'
I0804 03:28:29.502131  6453 slave.cpp:283] Agent using credential for: test-principal
I0804 03:28:29.502154  6453 credentials.hpp:37] Loading credentials for authentication from
'/tmp/Endpoint_SlaveEndpointTest_UnauthorizedRequest_0_8LAnPf/http_credentials'
I0804 03:28:29.502377  6453 http.cpp:1026] Creating default 'basic' HTTP authenticator for
realm 'mesos-agent-readonly'
I0804 03:28:29.502532  6453 http.cpp:1026] Creating default 'basic' HTTP authenticator for
realm 'mesos-agent-readwrite'
I0804 03:28:29.503803  6453 slave.cpp:565] Agent resources: [{"name":"cpus","scalar":{"value":2.0},"type":"SCALAR"},{"name":"mem","scalar":{"value":1024.0},"type":"SCALAR"},{"name":"disk","scalar":{"value":1024.0},"type":"SCALAR"},{"name":"ports","ranges":{"range":[{"begin":31000,"end":32000}]},"type":"RANGES"}]
I0804 03:28:29.504027  6453 slave.cpp:573] Agent attributes: [  ]
I0804 03:28:29.504042  6453 slave.cpp:582] Agent hostname: 8756f5199364
I0804 03:28:29.504173  6450 status_update_manager.cpp:177] Pausing sending status updates
I0804 03:28:29.505578  6449 state.cpp:64] Recovering state from '/tmp/Endpoint_SlaveEndpointTest_UnauthorizedRequest_0_wSm7ZB/meta'
I0804 03:28:29.505858  6446 status_update_manager.cpp:203] Recovering status update manager
I0804 03:28:29.506050  6462 containerizer.cpp:598] Recovering containerizer
I0804 03:28:29.507386  6441 provisioner.cpp:416] Provisioner recovery complete
I0804 03:28:29.507689  6445 slave.cpp:6207] Finished recovery
I0804 03:28:29.508074  6445 slave.cpp:6389] Querying resource estimator for oversubscribable
resources
I0804 03:28:29.508303  6451 slave.cpp:6403] Received oversubscribable resources {} from the
resource estimator
I0804 03:28:29.510613  6450 process.cpp:3933] Handling HTTP event for process 'slave(795)'
with path: '/slave(795)/monitor/statistics'
I0804 03:28:29.511757  6452 http.cpp:1166] HTTP GET for /slave(795)/monitor/statistics from
172.17.0.3:43878
I0804 03:28:29.511922  6452 http.cpp:957] Authorizing principal 'test-principal' to GET the
'/monitor/statistics' endpoint
I0804 03:28:29.514073  6452 slave.cpp:843] Agent terminating
[       OK ] Endpoint/SlaveEndpointTest.UnauthorizedRequest/0 (27 ms)
[ RUN      ] Endpoint/SlaveEndpointTest.UnauthorizedRequest/1
I0804 03:28:29.524715  6422 containerizer.cpp:246] Using isolation: posix/cpu,posix/mem,filesystem/posix,network/cni,environment_secret
W0804 03:28:29.525204  6422 backend.cpp:76] Failed to create 'aufs' backend: AufsBackend requires
root privileges
W0804 03:28:29.525313  6422 backend.cpp:76] Failed to create 'bind' backend: BindBackend requires
root privileges
I0804 03:28:29.525351  6422 provisioner.cpp:255] Using default backend 'copy'
I0804 03:28:29.528740  6463 slave.cpp:250] Mesos agent started on (796)@172.17.0.3:45209
I0804 03:28:29.528772  6463 slave.cpp:251] Flags at startup: --acls="" --appc_simple_discovery_uri_prefix="http://"
--appc_store_dir="/tmp/Endpoint_SlaveEndpointTest_UnauthorizedRequest_1_eKOdmP/store/appc"
--authenticate_http_readonly="true" --authenticate_http_readwrite="true" --authenticatee="crammd5"
--authentication_backoff_factor="1secs" --authorizer="local" --cgroups_cpu_enable_pids_and_tids_count="false"
--cgroups_enable_cfs="false" --cgroups_hierarchy="/sys/fs/cgroup" --cgroups_limit_swap="false"
--cgroups_root="mesos" --container_disk_watch_interval="15secs" --containerizers="mesos" --credential="/tmp/Endpoint_SlaveEndpointTest_UnauthorizedRequest_1_eKOdmP/credential"
--default_role="*" --disk_watch_interval="1mins" --docker="docker" --docker_kill_orphans="true"
--docker_registry="https://registry-1.docker.io" --docker_remove_delay="6hrs" --docker_socket="/var/run/docker.sock"
--docker_stop_timeout="0ns" --docker_store_dir="/tmp/Endpoint_SlaveEndpointTest_UnauthorizedRequest_1_eKOdmP/store/docker"
--docker_volume_checkpoint_dir="/var/run/mesos/isolators/docker/volume" --enforce_container_disk_quota="false"
--executor_registration_timeout="1mins" --executor_reregistration_timeout="2secs" --executor_shutdown_grace_period="5secs"
--fetcher_cache_dir="/tmp/Endpoint_SlaveEndpointTest_UnauthorizedRequest_1_eKOdmP/fetch" --fetcher_cache_size="2GB"
--frameworks_home="" --gc_delay="1weeks" --gc_disk_headroom="0.1" --hadoop_home="" --help="false"
--hostname_lookup="true" --http_command_executor="false" --http_credentials="/tmp/Endpoint_SlaveEndpointTest_UnauthorizedRequest_1_eKOdmP/http_credentials"
--http_heartbeat_interval="30secs" --initialize_driver_logging="true" --isolation="posix/cpu,posix/mem"
--launcher="posix" --launcher_dir="/mesos/mesos-1.4.0/_build/src" --logbufsecs="0" --logging_level="INFO"
--max_completed_executors_per_framework="150" --oversubscribed_resources_interval="15secs"
--perf_duration="10secs" --perf_interval="1mins" --port="5051" --qos_correction_interval_min="0ns"
--quiet="false" --recover="reconnect" --recovery_timeout="15mins" --registration_backoff_factor="10ms"
--resources="cpus:2;gpus:0;mem:1024;disk:1024;ports:[31000-32000]" --revocable_cpu_low_priority="true"
--runtime_dir="/tmp/Endpoint_SlaveEndpointTest_UnauthorizedRequest_1_eKOdmP" --sandbox_directory="/mnt/mesos/sandbox"
--strict="true" --switch_user="true" --systemd_enable_support="true" --systemd_runtime_directory="/run/systemd/system"
--version="false" --work_dir="/tmp/Endpoint_SlaveEndpointTest_UnauthorizedRequest_1_QLnUsb"
I0804 03:28:29.529283  6463 credentials.hpp:86] Loading credential for authentication from
'/tmp/Endpoint_SlaveEndpointTest_UnauthorizedRequest_1_eKOdmP/credential'
I0804 03:28:29.529422  6463 slave.cpp:283] Agent using credential for: test-principal
I0804 03:28:29.529449  6463 credentials.hpp:37] Loading credentials for authentication from
'/tmp/Endpoint_SlaveEndpointTest_UnauthorizedRequest_1_eKOdmP/http_credentials'
I0804 03:28:29.529687  6463 http.cpp:1026] Creating default 'basic' HTTP authenticator for
realm 'mesos-agent-readonly'
I0804 03:28:29.529844  6463 http.cpp:1026] Creating default 'basic' HTTP authenticator for
realm 'mesos-agent-readwrite'
I0804 03:28:29.531141  6463 slave.cpp:565] Agent resources: [{"name":"cpus","scalar":{"value":2.0},"type":"SCALAR"},{"name":"mem","scalar":{"value":1024.0},"type":"SCALAR"},{"name":"disk","scalar":{"value":1024.0},"type":"SCALAR"},{"name":"ports","ranges":{"range":[{"begin":31000,"end":32000}]},"type":"RANGES"}]
I0804 03:28:29.531374  6463 slave.cpp:573] Agent attributes: [  ]
I0804 03:28:29.531394  6463 slave.cpp:582] Agent hostname: 8756f5199364
I0804 03:28:29.531538  6447 status_update_manager.cpp:177] Pausing sending status updates
I0804 03:28:29.533087  6453 state.cpp:64] Recovering state from '/tmp/Endpoint_SlaveEndpointTest_UnauthorizedRequest_1_QLnUsb/meta'
I0804 03:28:29.533360  6451 status_update_manager.cpp:203] Recovering status update manager
I0804 03:28:29.533571  6444 containerizer.cpp:598] Recovering containerizer
I0804 03:28:29.534966  6460 provisioner.cpp:416] Provisioner recovery complete
I0804 03:28:29.535333  6463 slave.cpp:6207] Finished recovery
I0804 03:28:29.535809  6463 slave.cpp:6389] Querying resource estimator for oversubscribable
resources
I0804 03:28:29.536039  6454 slave.cpp:6403] Received oversubscribable resources {} from the
resource estimator
I0804 03:28:29.538810  6455 process.cpp:3933] Handling HTTP event for process 'slave(796)'
with path: '/slave(796)/monitor/statistics.json'
I0804 03:28:29.540041  6456 http.cpp:1166] HTTP GET for /slave(796)/monitor/statistics.json
from 172.17.0.3:43882
I0804 03:28:29.540112  6456 http.cpp:957] Authorizing principal 'test-principal' to GET the
'/monitor/statistics.json' endpoint
I0804 03:28:29.542135  6451 slave.cpp:843] Agent terminating
[       OK ] Endpoint/SlaveEndpointTest.UnauthorizedRequest/1 (28 ms)
[ RUN      ] Endpoint/SlaveEndpointTest.UnauthorizedRequest/2
I0804 03:28:29.554422  6422 containerizer.cpp:246] Using isolation: posix/cpu,posix/mem,filesystem/posix,network/cni,environment_secret
W0804 03:28:29.555001  6422 backend.cpp:76] Failed to create 'aufs' backend: AufsBackend requires
root privileges
W0804 03:28:29.555132  6422 backend.cpp:76] Failed to create 'bind' backend: BindBackend requires
root privileges
I0804 03:28:29.555172  6422 provisioner.cpp:255] Using default backend 'copy'
I0804 03:28:29.559442  6451 slave.cpp:250] Mesos agent started on (797)@172.17.0.3:45209
I0804 03:28:29.559465  6451 slave.cpp:251] Flags at startup: --acls="" --appc_simple_discovery_uri_prefix="http://"
--appc_store_dir="/tmp/Endpoint_SlaveEndpointTest_UnauthorizedRequest_2_sCmY9o/store/appc"
--authenticate_http_readonly="true" --authenticate_http_readwrite="true" --authenticatee="crammd5"
--authentication_backoff_factor="1secs" --authorizer="local" --cgroups_cpu_enable_pids_and_tids_count="false"
--cgroups_enable_cfs="false" --cgroups_hierarchy="/sys/fs/cgroup" --cgroups_limit_swap="false"
--cgroups_root="mesos" --container_disk_watch_interval="15secs" --containerizers="mesos" --credential="/tmp/Endpoint_SlaveEndpointTest_UnauthorizedRequest_2_sCmY9o/credential"
--default_role="*" --disk_watch_interval="1mins" --docker="docker" --docker_kill_orphans="true"
--docker_registry="https://registry-1.docker.io" --docker_remove_delay="6hrs" --docker_socket="/var/run/docker.sock"
--docker_stop_timeout="0ns" --docker_store_dir="/tmp/Endpoint_SlaveEndpointTest_UnauthorizedRequest_2_sCmY9o/store/docker"
--docker_volume_checkpoint_dir="/var/run/mesos/isolators/docker/volume" --enforce_container_disk_quota="false"
--executor_registration_timeout="1mins" --executor_reregistration_timeout="2secs" --executor_shutdown_grace_period="5secs"
--fetcher_cache_dir="/tmp/Endpoint_SlaveEndpointTest_UnauthorizedRequest_2_sCmY9o/fetch" --fetcher_cache_size="2GB"
--frameworks_home="" --gc_delay="1weeks" --gc_disk_headroom="0.1" --hadoop_home="" --help="false"
--hostname_lookup="true" --http_command_executor="false" --http_credentials="/tmp/Endpoint_SlaveEndpointTest_UnauthorizedRequest_2_sCmY9o/http_credentials"
--http_heartbeat_interval="30secs" --initialize_driver_logging="true" --isolation="posix/cpu,posix/mem"
--launcher="posix" --launcher_dir="/mesos/mesos-1.4.0/_build/src" --logbufsecs="0" --logging_level="INFO"
--max_completed_executors_per_framework="150" --oversubscribed_resources_interval="15secs"
--perf_duration="10secs" --perf_interval="1mins" --port="5051" --qos_correction_interval_min="0ns"
--quiet="false" --recover="reconnect" --recovery_timeout="15mins" --registration_backoff_factor="10ms"
--resources="cpus:2;gpus:0;mem:1024;disk:1024;ports:[31000-32000]" --revocable_cpu_low_priority="true"
--runtime_dir="/tmp/Endpoint_SlaveEndpointTest_UnauthorizedRequest_2_sCmY9o" --sandbox_directory="/mnt/mesos/sandbox"
--strict="true" --switch_user="true" --systemd_enable_support="true" --systemd_runtime_directory="/run/systemd/system"
--version="false" --work_dir="/tmp/Endpoint_SlaveEndpointTest_UnauthorizedRequest_2_2LcmcL"
I0804 03:28:29.559950  6451 credentials.hpp:86] Loading credential for authentication from
'/tmp/Endpoint_SlaveEndpointTest_UnauthorizedRequest_2_sCmY9o/credential'
I0804 03:28:29.560143  6451 slave.cpp:283] Agent using credential for: test-principal
I0804 03:28:29.560166  6451 credentials.hpp:37] Loading credentials for authentication from
'/tmp/Endpoint_SlaveEndpointTest_UnauthorizedRequest_2_sCmY9o/http_credentials'
I0804 03:28:29.560446  6451 http.cpp:1026] Creating default 'basic' HTTP authenticator for
realm 'mesos-agent-readonly'
I0804 03:28:29.560638  6451 http.cpp:1026] Creating default 'basic' HTTP authenticator for
realm 'mesos-agent-readwrite'
I0804 03:28:29.562427  6451 slave.cpp:565] Agent resources: [{"name":"cpus","scalar":{"value":2.0},"type":"SCALAR"},{"name":"mem","scalar":{"value":1024.0},"type":"SCALAR"},{"name":"disk","scalar":{"value":1024.0},"type":"SCALAR"},{"name":"ports","ranges":{"range":[{"begin":31000,"end":32000}]},"type":"RANGES"}]
I0804 03:28:29.562744  6451 slave.cpp:573] Agent attributes: [  ]
I0804 03:28:29.562769  6451 slave.cpp:582] Agent hostname: 8756f5199364
I0804 03:28:29.562918  6448 status_update_manager.cpp:177] Pausing sending status updates
I0804 03:28:29.564525  6454 state.cpp:64] Recovering state from '/tmp/Endpoint_SlaveEndpointTest_UnauthorizedRequest_2_2LcmcL/meta'
I0804 03:28:29.564870  6443 status_update_manager.cpp:203] Recovering status update manager
I0804 03:28:29.565062  6450 containerizer.cpp:598] Recovering containerizer
I0804 03:28:29.566480  6445 provisioner.cpp:416] Provisioner recovery complete
I0804 03:28:29.566797  6453 slave.cpp:6207] Finished recovery
I0804 03:28:29.567248  6453 slave.cpp:6389] Querying resource estimator for oversubscribable
resources
I0804 03:28:29.567486  6464 slave.cpp:6403] Received oversubscribable resources {} from the
resource estimator
I0804 03:28:29.570026  6461 process.cpp:3933] Handling HTTP event for process 'slave(797)'
with path: '/slave(797)/containers'
I0804 03:28:29.571264  6451 http.cpp:1166] HTTP GET for /slave(797)/containers from 172.17.0.3:43884
I0804 03:28:29.571360  6451 http.cpp:957] Authorizing principal 'test-principal' to GET the
'/containers' endpoint
I0804 03:28:29.573452  6462 slave.cpp:843] Agent terminating
[       OK ] Endpoint/SlaveEndpointTest.UnauthorizedRequest/2 (31 ms)
[ RUN      ] Endpoint/SlaveEndpointTest.NoAuthorizer/0
I0804 03:28:29.584327  6422 containerizer.cpp:246] Using isolation: posix/cpu,posix/mem,filesystem/posix,network/cni,environment_secret
W0804 03:28:29.584832  6422 backend.cpp:76] Failed to create 'aufs' backend: AufsBackend requires
root privileges
W0804 03:28:29.584941  6422 backend.cpp:76] Failed to create 'bind' backend: BindBackend requires
root privileges
I0804 03:28:29.584977  6422 provisioner.cpp:255] Using default backend 'copy'
I0804 03:28:29.586776  6422 cluster.cpp:448] Creating default 'local' authorizer
I0804 03:28:29.588567  6456 slave.cpp:250] Mesos agent started on (798)@172.17.0.3:45209
I0804 03:28:29.588595  6456 slave.cpp:251] Flags at startup: --acls="" --appc_simple_discovery_uri_prefix="http://"
--appc_store_dir="/tmp/Endpoint_SlaveEndpointTest_NoAuthorizer_0_ySIWfZ/store/appc" --authenticate_http_readonly="true"
--authenticate_http_readwrite="true" --authenticatee="crammd5" --authentication_backoff_factor="1secs"
--authorizer="local" --cgroups_cpu_enable_pids_and_tids_count="false" --cgroups_enable_cfs="false"
--cgroups_hierarchy="/sys/fs/cgroup" --cgroups_limit_swap="false" --cgroups_root="mesos" --container_disk_watch_interval="15secs"
--containerizers="mesos" --credential="/tmp/Endpoint_SlaveEndpointTest_NoAuthorizer_0_ySIWfZ/credential"
--default_role="*" --disk_watch_interval="1mins" --docker="docker" --docker_kill_orphans="true"
--docker_registry="https://registry-1.docker.io" --docker_remove_delay="6hrs" --docker_socket="/var/run/docker.sock"
--docker_stop_timeout="0ns" --docker_store_dir="/tmp/Endpoint_SlaveEndpointTest_NoAuthorizer_0_ySIWfZ/store/docker"
--docker_volume_checkpoint_dir="/var/run/mesos/isolators/docker/volume" --enforce_container_disk_quota="false"
--executor_registration_timeout="1mins" --executor_reregistration_timeout="2secs" --executor_shutdown_grace_period="5secs"
--fetcher_cache_dir="/tmp/Endpoint_SlaveEndpointTest_NoAuthorizer_0_ySIWfZ/fetch" --fetcher_cache_size="2GB"
--frameworks_home="" --gc_delay="1weeks" --gc_disk_headroom="0.1" --hadoop_home="" --help="false"
--hostname_lookup="true" --http_command_executor="false" --http_credentials="/tmp/Endpoint_SlaveEndpointTest_NoAuthorizer_0_ySIWfZ/http_credentials"
--http_heartbeat_interval="30secs" --initialize_driver_logging="true" --isolation="posix/cpu,posix/mem"
--launcher="posix" --launcher_dir="/mesos/mesos-1.4.0/_build/src" --logbufsecs="0" --logging_level="INFO"
--max_completed_executors_per_framework="150" --oversubscribed_resources_interval="15secs"
--perf_duration="10secs" --perf_interval="1mins" --port="5051" --qos_correction_interval_min="0ns"
--quiet="false" --recover="reconnect" --recovery_timeout="15mins" --registration_backoff_factor="10ms"
--resources="cpus:2;gpus:0;mem:1024;disk:1024;ports:[31000-32000]" --revocable_cpu_low_priority="true"
--runtime_dir="/tmp/Endpoint_SlaveEndpointTest_NoAuthorizer_0_ySIWfZ" --sandbox_directory="/mnt/mesos/sandbox"
--strict="true" --switch_user="true" --systemd_enable_support="true" --systemd_runtime_directory="/run/systemd/system"
--version="false" --work_dir="/tmp/Endpoint_SlaveEndpointTest_NoAuthorizer_0_supRdl"
I0804 03:28:29.589215  6456 credentials.hpp:86] Loading credential for authentication from
'/tmp/Endpoint_SlaveEndpointTest_NoAuthorizer_0_ySIWfZ/credential'
I0804 03:28:29.589413  6456 slave.cpp:283] Agent using credential for: test-principal
I0804 03:28:29.589445  6456 credentials.hpp:37] Loading credentials for authentication from
'/tmp/Endpoint_SlaveEndpointTest_NoAuthorizer_0_ySIWfZ/http_credentials'
I0804 03:28:29.589797  6456 http.cpp:1026] Creating default 'basic' HTTP authenticator for
realm 'mesos-agent-readonly'
I0804 03:28:29.589960  6456 http.cpp:1026] Creating default 'basic' HTTP authenticator for
realm 'mesos-agent-readwrite'
I0804 03:28:29.591264  6456 slave.cpp:565] Agent resources: [{"name":"cpus","scalar":{"value":2.0},"type":"SCALAR"},{"name":"mem","scalar":{"value":1024.0},"type":"SCALAR"},{"name":"disk","scalar":{"value":1024.0},"type":"SCALAR"},{"name":"ports","ranges":{"range":[{"begin":31000,"end":32000}]},"type":"RANGES"}]
I0804 03:28:29.591493  6456 slave.cpp:573] Agent attributes: [  ]
I0804 03:28:29.591508  6456 slave.cpp:582] Agent hostname: 8756f5199364
I0804 03:28:29.591637  6460 status_update_manager.cpp:177] Pausing sending status updates
I0804 03:28:29.593031  6462 state.cpp:64] Recovering state from '/tmp/Endpoint_SlaveEndpointTest_NoAuthorizer_0_supRdl/meta'
I0804 03:28:29.593307  6452 status_update_manager.cpp:203] Recovering status update manager
I0804 03:28:29.593474  6441 containerizer.cpp:598] Recovering containerizer
I0804 03:28:29.594779  6464 provisioner.cpp:416] Provisioner recovery complete
I0804 03:28:29.595070  6447 slave.cpp:6207] Finished recovery
I0804 03:28:29.595463  6447 slave.cpp:6389] Querying resource estimator for oversubscribable
resources
I0804 03:28:29.595705  6461 slave.cpp:6403] Received oversubscribable resources {} from the
resource estimator
I0804 03:28:29.598026  6460 process.cpp:3933] Handling HTTP event for process 'slave(798)'
with path: '/slave(798)/monitor/statistics'
I0804 03:28:29.599212  6452 http.cpp:1166] HTTP GET for /slave(798)/monitor/statistics from
172.17.0.3:43886
I0804 03:28:29.599295  6452 http.cpp:957] Authorizing principal 'test-principal' to GET the
'/monitor/statistics' endpoint
I0804 03:28:29.602607  6422 slave.cpp:843] Agent terminating
[       OK ] Endpoint/SlaveEndpointTest.NoAuthorizer/0 (29 ms)
[ RUN      ] Endpoint/SlaveEndpointTest.NoAuthorizer/1
I0804 03:28:29.613243  6422 containerizer.cpp:246] Using isolation: posix/cpu,posix/mem,filesystem/posix,network/cni,environment_secret
W0804 03:28:29.613721  6422 backend.cpp:76] Failed to create 'aufs' backend: AufsBackend requires
root privileges
W0804 03:28:29.613831  6422 backend.cpp:76] Failed to create 'bind' backend: BindBackend requires
root privileges
I0804 03:28:29.613862  6422 provisioner.cpp:255] Using default backend 'copy'
I0804 03:28:29.615597  6422 cluster.cpp:448] Creating default 'local' authorizer
I0804 03:28:29.617326  6460 slave.cpp:250] Mesos agent started on (799)@172.17.0.3:45209
I0804 03:28:29.617349  6460 slave.cpp:251] Flags at startup: --acls="" --appc_simple_discovery_uri_prefix="http://"
--appc_store_dir="/tmp/Endpoint_SlaveEndpointTest_NoAuthorizer_1_62icDz/store/appc" --authenticate_http_readonly="true"
--authenticate_http_readwrite="true" --authenticatee="crammd5" --authentication_backoff_factor="1secs"
--authorizer="local" --cgroups_cpu_enable_pids_and_tids_count="false" --cgroups_enable_cfs="false"
--cgroups_hierarchy="/sys/fs/cgroup" --cgroups_limit_swap="false" --cgroups_root="mesos" --container_disk_watch_interval="15secs"
--containerizers="mesos" --credential="/tmp/Endpoint_SlaveEndpointTest_NoAuthorizer_1_62icDz/credential"
--default_role="*" --disk_watch_interval="1mins" --docker="docker" --docker_kill_orphans="true"
--docker_registry="https://registry-1.docker.io" --docker_remove_delay="6hrs" --docker_socket="/var/run/docker.sock"
--docker_stop_timeout="0ns" --docker_store_dir="/tmp/Endpoint_SlaveEndpointTest_NoAuthorizer_1_62icDz/store/docker"
--docker_volume_checkpoint_dir="/var/run/mesos/isolators/docker/volume" --enforce_container_disk_quota="false"
--executor_registration_timeout="1mins" --executor_reregistration_timeout="2secs" --executor_shutdown_grace_period="5secs"
--fetcher_cache_dir="/tmp/Endpoint_SlaveEndpointTest_NoAuthorizer_1_62icDz/fetch" --fetcher_cache_size="2GB"
--frameworks_home="" --gc_delay="1weeks" --gc_disk_headroom="0.1" --hadoop_home="" --help="false"
--hostname_lookup="true" --http_command_executor="false" --http_credentials="/tmp/Endpoint_SlaveEndpointTest_NoAuthorizer_1_62icDz/http_credentials"
--http_heartbeat_interval="30secs" --initialize_driver_logging="true" --isolation="posix/cpu,posix/mem"
--launcher="posix" --launcher_dir="/mesos/mesos-1.4.0/_build/src" --logbufsecs="0" --logging_level="INFO"
--max_completed_executors_per_framework="150" --oversubscribed_resources_interval="15secs"
--perf_duration="10secs" --perf_interval="1mins" --port="5051" --qos_correction_interval_min="0ns"
--quiet="false" --recover="reconnect" --recovery_timeout="15mins" --registration_backoff_factor="10ms"
--resources="cpus:2;gpus:0;mem:1024;disk:1024;ports:[31000-32000]" --revocable_cpu_low_priority="true"
--runtime_dir="/tmp/Endpoint_SlaveEndpointTest_NoAuthorizer_1_62icDz" --sandbox_directory="/mnt/mesos/sandbox"
--strict="true" --switch_user="true" --systemd_enable_support="true" --systemd_runtime_directory="/run/systemd/system"
--version="false" --work_dir="/tmp/Endpoint_SlaveEndpointTest_NoAuthorizer_1_kSRKwV"
I0804 03:28:29.617743  6460 credentials.hpp:86] Loading credential for authentication from
'/tmp/Endpoint_SlaveEndpointTest_NoAuthorizer_1_62icDz/credential'
I0804 03:28:29.617911  6460 slave.cpp:283] Agent using credential for: test-principal
I0804 03:28:29.617936  6460 credentials.hpp:37] Loading credentials for authentication from
'/tmp/Endpoint_SlaveEndpointTest_NoAuthorizer_1_62icDz/http_credentials'
I0804 03:28:29.618196  6460 http.cpp:1026] Creating default 'basic' HTTP authenticator for
realm 'mesos-agent-readonly'
I0804 03:28:29.618365  6460 http.cpp:1026] Creating default 'basic' HTTP authenticator for
realm 'mesos-agent-readwrite'
I0804 03:28:29.619705  6460 slave.cpp:565] Agent resources: [{"name":"cpus","scalar":{"value":2.0},"type":"SCALAR"},{"name":"mem","scalar":{"value":1024.0},"type":"SCALAR"},{"name":"disk","scalar":{"value":1024.0},"type":"SCALAR"},{"name":"ports","ranges":{"range":[{"begin":31000,"end":32000}]},"type":"RANGES"}]
I0804 03:28:29.619940  6460 slave.cpp:573] Agent attributes: [  ]
I0804 03:28:29.619964  6460 slave.cpp:582] Agent hostname: 8756f5199364
I0804 03:28:29.620107  6446 status_update_manager.cpp:177] Pausing sending status updates
I0804 03:28:29.621565  6451 state.cpp:64] Recovering state from '/tmp/Endpoint_SlaveEndpointTest_NoAuthorizer_1_kSRKwV/meta'
I0804 03:28:29.621815  6444 status_update_manager.cpp:203] Recovering status update manager
I0804 03:28:29.621992  6459 containerizer.cpp:598] Recovering containerizer
I0804 03:28:29.623198  6445 provisioner.cpp:416] Provisioner recovery complete
I0804 03:28:29.623508  6460 slave.cpp:6207] Finished recovery
I0804 03:28:29.623905  6460 slave.cpp:6389] Querying resource estimator for oversubscribable
resources
I0804 03:28:29.624115  6452 slave.cpp:6403] Received oversubscribable resources {} from the
resource estimator
I0804 03:28:29.626379  6446 process.cpp:3933] Handling HTTP event for process 'slave(799)'
with path: '/slave(799)/monitor/statistics.json'
I0804 03:28:29.627763  6455 http.cpp:1166] HTTP GET for /slave(799)/monitor/statistics.json
from 172.17.0.3:43888
I0804 03:28:29.627832  6455 http.cpp:957] Authorizing principal 'test-principal' to GET the
'/monitor/statistics.json' endpoint
I0804 03:28:29.630524  6443 slave.cpp:843] Agent terminating
[       OK ] Endpoint/SlaveEndpointTest.NoAuthorizer/1 (27 ms)
[ RUN      ] Endpoint/SlaveEndpointTest.NoAuthorizer/2
I0804 03:28:29.641093  6422 containerizer.cpp:246] Using isolation: posix/cpu,posix/mem,filesystem/posix,network/cni,environment_secret
W0804 03:28:29.641587  6422 backend.cpp:76] Failed to create 'aufs' backend: AufsBackend requires
root privileges
W0804 03:28:29.641693  6422 backend.cpp:76] Failed to create 'bind' backend: BindBackend requires
root privileges
I0804 03:28:29.641736  6422 provisioner.cpp:255] Using default backend 'copy'
I0804 03:28:29.643512  6422 cluster.cpp:448] Creating default 'local' authorizer
I0804 03:28:29.645241  6442 slave.cpp:250] Mesos agent started on (800)@172.17.0.3:45209
I0804 03:28:29.645265  6442 slave.cpp:251] Flags at startup: --acls="" --appc_simple_discovery_uri_prefix="http://"
--appc_store_dir="/tmp/Endpoint_SlaveEndpointTest_NoAuthorizer_2_apqaha/store/appc" --authenticate_http_readonly="true"
--authenticate_http_readwrite="true" --authenticatee="crammd5" --authentication_backoff_factor="1secs"
--authorizer="local" --cgroups_cpu_enable_pids_and_tids_count="false" --cgroups_enable_cfs="false"
--cgroups_hierarchy="/sys/fs/cgroup" --cgroups_limit_swap="false" --cgroups_root="mesos" --container_disk_watch_interval="15secs"
--containerizers="mesos" --credential="/tmp/Endpoint_SlaveEndpointTest_NoAuthorizer_2_apqaha/credential"
--default_role="*" --disk_watch_interval="1mins" --docker="docker" --docker_kill_orphans="true"
--docker_registry="https://registry-1.docker.io" --docker_remove_delay="6hrs" --docker_socket="/var/run/docker.sock"
--docker_stop_timeout="0ns" --docker_store_dir="/tmp/Endpoint_SlaveEndpointTest_NoAuthorizer_2_apqaha/store/docker"
--docker_volume_checkpoint_dir="/var/run/mesos/isolators/docker/volume" --enforce_container_disk_quota="false"
--executor_registration_timeout="1mins" --executor_reregistration_timeout="2secs" --executor_shutdown_grace_period="5secs"
--fetcher_cache_dir="/tmp/Endpoint_SlaveEndpointTest_NoAuthorizer_2_apqaha/fetch" --fetcher_cache_size="2GB"
--frameworks_home="" --gc_delay="1weeks" --gc_disk_headroom="0.1" --hadoop_home="" --help="false"
--hostname_lookup="true" --http_command_executor="false" --http_credentials="/tmp/Endpoint_SlaveEndpointTest_NoAuthorizer_2_apqaha/http_credentials"
--http_heartbeat_interval="30secs" --initialize_driver_logging="true" --isolation="posix/cpu,posix/mem"
--launcher="posix" --launcher_dir="/mesos/mesos-1.4.0/_build/src" --logbufsecs="0" --logging_level="INFO"
--max_completed_executors_per_framework="150" --oversubscribed_resources_interval="15secs"
--perf_duration="10secs" --perf_interval="1mins" --port="5051" --qos_correction_interval_min="0ns"
--quiet="false" --recover="reconnect" --recovery_timeout="15mins" --registration_backoff_factor="10ms"
--resources="cpus:2;gpus:0;mem:1024;disk:1024;ports:[31000-32000]" --revocable_cpu_low_priority="true"
--runtime_dir="/tmp/Endpoint_SlaveEndpointTest_NoAuthorizer_2_apqaha" --sandbox_directory="/mnt/mesos/sandbox"
--strict="true" --switch_user="true" --systemd_enable_support="true" --systemd_runtime_directory="/run/systemd/system"
--version="false" --work_dir="/tmp/Endpoint_SlaveEndpointTest_NoAuthorizer_2_acWy6v"
I0804 03:28:29.645674  6442 credentials.hpp:86] Loading credential for authentication from
'/tmp/Endpoint_SlaveEndpointTest_NoAuthorizer_2_apqaha/credential'
I0804 03:28:29.645824  6442 slave.cpp:283] Agent using credential for: test-principal
I0804 03:28:29.645849  6442 credentials.hpp:37] Loading credentials for authentication from
'/tmp/Endpoint_SlaveEndpointTest_NoAuthorizer_2_apqaha/http_credentials'
I0804 03:28:29.646111  6442 http.cpp:1026] Creating default 'basic' HTTP authenticator for
realm 'mesos-agent-readonly'
I0804 03:28:29.646277  6442 http.cpp:1026] Creating default 'basic' HTTP authenticator for
realm 'mesos-agent-readwrite'
I0804 03:28:29.647603  6442 slave.cpp:565] Agent resources: [{"name":"cpus","scalar":{"value":2.0},"type":"SCALAR"},{"name":"mem","scalar":{"value":1024.0},"type":"SCALAR"},{"name":"disk","scalar":{"value":1024.0},"type":"SCALAR"},{"name":"ports","ranges":{"range":[{"begin":31000,"end":32000}]},"type":"RANGES"}]
I0804 03:28:29.647830  6442 slave.cpp:573] Agent attributes: [  ]
I0804 03:28:29.647846  6442 slave.cpp:582] Agent hostname: 8756f5199364
I0804 03:28:29.647977  6448 status_update_manager.cpp:177] Pausing sending status updates
I0804 03:28:29.649415  6445 state.cpp:64] Recovering state from '/tmp/Endpoint_SlaveEndpointTest_NoAuthorizer_2_acWy6v/meta'
I0804 03:28:29.649682  6463 status_update_manager.cpp:203] Recovering status update manager
I0804 03:28:29.649860  6455 containerizer.cpp:598] Recovering containerizer
I0804 03:28:29.651146  6459 provisioner.cpp:416] Provisioner recovery complete
I0804 03:28:29.651463  6450 slave.cpp:6207] Finished recovery
I0804 03:28:29.651880  6450 slave.cpp:6389] Querying resource estimator for oversubscribable
resources
I0804 03:28:29.652093  6441 slave.cpp:6403] Received oversubscribable resources {} from the
resource estimator
I0804 03:28:29.654347  6462 process.cpp:3933] Handling HTTP event for process 'slave(800)'
with path: '/slave(800)/containers'
I0804 03:28:29.655560  6457 http.cpp:1166] HTTP GET for /slave(800)/containers from 172.17.0.3:43890
I0804 03:28:29.655632  6457 http.cpp:957] Authorizing principal 'test-principal' to GET the
'/containers' endpoint
I0804 03:28:29.659144  6422 slave.cpp:843] Agent terminating
[       OK ] Endpoint/SlaveEndpointTest.NoAuthorizer/2 (28 ms)
[----------] 9 tests from Endpoint/SlaveEndpointTest (262 ms total)

[----------] 2 tests from ContainerizerType/DefaultContainerDNSFlagTest
[ RUN      ] ContainerizerType/DefaultContainerDNSFlagTest.ValidateFlag/0
[       OK ] ContainerizerType/DefaultContainerDNSFlagTest.ValidateFlag/0 (10 ms)
[ RUN      ] ContainerizerType/DefaultContainerDNSFlagTest.ValidateFlag/1
[       OK ] ContainerizerType/DefaultContainerDNSFlagTest.ValidateFlag/1 (10 ms)
[----------] 2 tests from ContainerizerType/DefaultContainerDNSFlagTest (20 ms total)

[----------] Global test environment tear-down
[==========] 1650 tests from 182 test cases ran. (554359 ms total)
[  PASSED  ] 1649 tests.
[  FAILED  ] 1 test, listed below:
[  FAILED  ] MasterTest.IgnoreOldAgentReregistration

 1 FAILED TEST
  YOU HAVE 20 DISABLED TESTS

I0804 03:28:29.746942  6465 process.cpp:1072] Failed to accept socket: future discarded
make[4]: *** [check-local] Error 1
make[4]: Leaving directory `/mesos/mesos-1.4.0/_build/src'
make[3]: *** [check-am] Error 2
make[3]: Leaving directory `/mesos/mesos-1.4.0/_build/src'
make[2]: *** [check] Error 2
make[2]: Leaving directory `/mesos/mesos-1.4.0/_build/src'
make[1]: *** [check-recursive] Error 1
make[1]: Leaving directory `/mesos/mesos-1.4.0/_build'
make: *** [distcheck] Error 1
+ docker rmi mesos-1501814804-5741
Untagged: mesos-1501814804-5741:latest
Deleted: sha256:fa5ffc1c4283956e59394fce08472b7faa5dbae919e8844ee6aa7948e5584204
Deleted: sha256:d6cf5c3345726b75548b5a6fa013fb05cdf00386c7426135681b8307acb74d61
Deleted: sha256:0def671bd05a9a338fa2f9dc6386179456c058845dab2faafe232ff5e5505e81
Deleted: sha256:855a0f560002df2c8c8f60137f6e4ac374b99850ecc20ee397d61022c871a8b6
Deleted: sha256:49beaa180ab923e62a5170c4863e1a8d26e73b9eb158b69df876d6e56251f8d0
Deleted: sha256:5ae3290cbceaa7cd1d48d580c0e259a9c50f72f126e68b76b24291040dddb6bd
Deleted: sha256:cbe2c9cb74cc43a18c207b317d5193502c16a334b8d03fb3d75cd07aabb1e4e9
Deleted: sha256:b4a8bcd6f055f6f54dfafc4cc7577bb6b2c1af54354d63b170aa380b3d542634
Deleted: sha256:60c1a892c8e36147084d0e7cf61243aa5a945ac62329acc39e98206fc2546593
Deleted: sha256:c3af9e61a7cbeaefb25b2b8e147de2871750503b9f856e6e83ce13df9e2740d2
Deleted: sha256:1a8aff0875fc7ef89f3ceca4935cb7d0bb036eb8ad63fd13bb9e81d44cec7200
Deleted: sha256:78dd01a1b6864e0e50bc576bc970993e00510d807265a6b3d271e2ec9f12bedc
Deleted: sha256:aa4ae53374d8ea8515153fe2137af3b21c79f1ea1e936e36ab74a6f5563cbb55
Deleted: sha256:07683ccff9871fd4b0e88fce4640c174179ec03ceaabd352632275462ff1f0ac
Deleted: sha256:9e3478b102dd379f5bfa82cf9ff81450bc554f5673563dada17a4489a1d174ba
Deleted: sha256:649fe083d14703d52eba0dfabddb4beeddba451fcf7a409959d6363261b36a5f
Deleted: sha256:920adf315c0873baf48de888a7b450b6f46fb7aa8a1d3323c53b568747710261
Deleted: sha256:5ba50c50f98cd8fec4ab76909f707361cd625669cf5a068a041ca4a99b1010d3
Deleted: sha256:268d36842f967dcd70c2bbde632f609fcad249598c086bb5f26f73bca3bf38ef
Deleted: sha256:83dfb407e2bae69e41085b946477ae0d00cd9bc66371ff9a7186004fd0f1e39a
Deleted: sha256:90877c89842a512de8f4a8d208a54a06245f800576cba9ab356a11e35dc94c84
Deleted: sha256:314f85435ab590aaed1bd0c71f66cc16c6db9f9aeb9ea9d78911e51a6d6da979
Deleted: sha256:a1685b2ee14f6f372a2313f5b96d00ec99fc59aca35e1812bfa8a64af65292bd
Deleted: sha256:38ccd7e4cf597e07ec97a137592ed645450dc27855a96424999fe0d8afecec7e
Deleted: sha256:11e62985845ae34208a181eae51e743ff62ce4fdeddfb84f16fd757be2f567d7
Build step 'Execute shell' marked build as failure
Not sending mail to unregistered user zhq527725@gmail.com
Not sending mail to unregistered user songzihao1990@gmail.com
Not sending mail to unregistered user gregorywmann@gmail.com
Not sending mail to unregistered user benjamin.hindman@gmail.com
Not sending mail to unregistered user xujyan@apple.com

Mime
View raw message