mesos-builds mailing list archives

Site index · List index
Message view « Date » · « Thread »
Top « Date » · « Thread »
From Apache Jenkins Server <jenk...@builds.apache.org>
Subject Build failed in Jenkins: Mesos-Buildbot » autotools,gcc,--verbose --enable-libevent --enable-ssl,GLOG_v=1 MESOS_VERBOSE=1,ubuntu:14.04,(ubuntu)&&(!ubuntu-us1)&&(!ubuntu-eu2) #4157
Date Fri, 25 Aug 2017 17:04:53 GMT
See <https://builds.apache.org/job/Mesos-Buildbot/BUILDTOOL=autotools,COMPILER=gcc,CONFIGURATION=--verbose%20--enable-libevent%20--enable-ssl,ENVIRONMENT=GLOG_v=1%20MESOS_VERBOSE=1,OS=ubuntu%3A14.04,label_exp=(ubuntu)&&(!ubuntu-us1)&&(!ubuntu-eu2)/4157/display/redirect>

------------------------------------------
[...truncated 32.27 MB...]
I0825 17:04:40.830377 29686 slave.cpp:252] Mesos agent started on (809)@172.17.0.7:45722
I0825 17:04:40.830404 29686 slave.cpp:253] Flags at startup: --acls="" --appc_simple_discovery_uri_prefix="http://"
--appc_store_dir="/tmp/Endpoint_SlaveEndpointTest_UnauthorizedRequest_0_lgHPYH/store/appc"
--authenticate_http_executors="true" --authenticate_http_readonly="true" --authenticate_http_readwrite="true"
--authenticatee="crammd5" --authentication_backoff_factor="1secs" --authorizer="local" --cgroups_cpu_enable_pids_and_tids_count="false"
--cgroups_enable_cfs="false" --cgroups_hierarchy="/sys/fs/cgroup" --cgroups_limit_swap="false"
--cgroups_root="mesos" --container_disk_watch_interval="15secs" --containerizers="mesos" --credential="/tmp/Endpoint_SlaveEndpointTest_UnauthorizedRequest_0_lgHPYH/credential"
--default_role="*" --disallow_sharing_agent_pid_namespace="false" --disk_watch_interval="1mins"
--docker="docker" --docker_kill_orphans="true" --docker_registry="https://registry-1.docker.io"
--docker_remove_delay="6hrs" --docker_socket="/var/run/docker.sock" --docker_stop_timeout="0ns"
--docker_store_dir="/tmp/Endpoint_SlaveEndpointTest_UnauthorizedRequest_0_lgHPYH/store/docker"
--docker_volume_checkpoint_dir="/var/run/mesos/isolators/docker/volume" --enforce_container_disk_quota="false"
--executor_registration_timeout="1mins" --executor_reregistration_timeout="2secs" --executor_secret_key="/tmp/Endpoint_SlaveEndpointTest_UnauthorizedRequest_0_lgHPYH/executor_secret_key"
--executor_shutdown_grace_period="5secs" --fetcher_cache_dir="/tmp/Endpoint_SlaveEndpointTest_UnauthorizedRequest_0_lgHPYH/fetch"
--fetcher_cache_size="2GB" --frameworks_home="" --gc_delay="1weeks" --gc_disk_headroom="0.1"
--hadoop_home="" --help="false" --hostname_lookup="true" --http_command_executor="false" --http_credentials="/tmp/Endpoint_SlaveEndpointTest_UnauthorizedRequest_0_lgHPYH/http_credentials"
--http_heartbeat_interval="30secs" --initialize_driver_logging="true" --isolation="posix/cpu,posix/mem"
--launcher="posix" --launcher_dir="/mesos/mesos-1.5.0/_build/src" --logbufsecs="0" --logging_level="INFO"
--max_completed_executors_per_framework="150" --oversubscribed_resources_interval="15secs"
--perf_duration="10secs" --perf_interval="1mins" --port="5051" --qos_correction_interval_min="0ns"
--quiet="false" --recover="reconnect" --recovery_timeout="15mins" --registration_backoff_factor="10ms"
--resources="cpus:2;gpus:0;mem:1024;disk:1024;ports:[31000-32000]" --revocable_cpu_low_priority="true"
--runtime_dir="/tmp/Endpoint_SlaveEndpointTest_UnauthorizedRequest_0_lgHPYH" --sandbox_directory="/mnt/mesos/sandbox"
--strict="true" --switch_user="true" --systemd_enable_support="true" --systemd_runtime_directory="/run/systemd/system"
--version="false" --work_dir="/tmp/Endpoint_SlaveEndpointTest_UnauthorizedRequest_0_QqwtBH"
I0825 17:04:40.830974 29686 credentials.hpp:86] Loading credential for authentication from
'/tmp/Endpoint_SlaveEndpointTest_UnauthorizedRequest_0_lgHPYH/credential'
I0825 17:04:40.831178 29686 slave.cpp:285] Agent using credential for: test-principal
I0825 17:04:40.831202 29686 credentials.hpp:37] Loading credentials for authentication from
'/tmp/Endpoint_SlaveEndpointTest_UnauthorizedRequest_0_lgHPYH/http_credentials'
I0825 17:04:40.831528 29686 http.cpp:1026] Creating default 'basic' HTTP authenticator for
realm 'mesos-agent-executor'
I0825 17:04:40.831687 29686 http.cpp:1047] Creating default 'jwt' HTTP authenticator for realm
'mesos-agent-executor'
I0825 17:04:40.831951 29686 http.cpp:1026] Creating default 'basic' HTTP authenticator for
realm 'mesos-agent-readonly'
I0825 17:04:40.832088 29686 http.cpp:1047] Creating default 'jwt' HTTP authenticator for realm
'mesos-agent-readonly'
I0825 17:04:40.832306 29686 http.cpp:1026] Creating default 'basic' HTTP authenticator for
realm 'mesos-agent-readwrite'
I0825 17:04:40.832407 29686 http.cpp:1047] Creating default 'jwt' HTTP authenticator for realm
'mesos-agent-readwrite'
I0825 17:04:40.833933 29686 slave.cpp:581] Agent resources: [{"name":"cpus","scalar":{"value":2.0},"type":"SCALAR"},{"name":"mem","scalar":{"value":1024.0},"type":"SCALAR"},{"name":"disk","scalar":{"value":1024.0},"type":"SCALAR"},{"name":"ports","ranges":{"range":[{"begin":31000,"end":32000}]},"type":"RANGES"}]
I0825 17:04:40.834167 29686 slave.cpp:589] Agent attributes: [  ]
I0825 17:04:40.834179 29686 slave.cpp:598] Agent hostname: 5723209b0262
I0825 17:04:40.834348 29695 status_update_manager.cpp:177] Pausing sending status updates
I0825 17:04:40.835842 29681 state.cpp:64] Recovering state from '/tmp/Endpoint_SlaveEndpointTest_UnauthorizedRequest_0_QqwtBH/meta'
I0825 17:04:40.836166 29691 status_update_manager.cpp:203] Recovering status update manager
I0825 17:04:40.836365 29689 containerizer.cpp:643] Recovering containerizer
I0825 17:04:40.837802 29682 provisioner.cpp:416] Provisioner recovery complete
I0825 17:04:40.838162 29700 slave.cpp:6264] Finished recovery
I0825 17:04:40.838606 29700 slave.cpp:6446] Querying resource estimator for oversubscribable
resources
I0825 17:04:40.838865 29684 slave.cpp:6460] Received oversubscribable resources {} from the
resource estimator
I0825 17:04:40.840955 29697 process.cpp:3933] Handling HTTP event for process 'slave(809)'
with path: '/slave(809)/monitor/statistics'
I0825 17:04:40.843192 29698 http.cpp:1166] HTTP GET for /slave(809)/monitor/statistics from
172.17.0.7:57766
I0825 17:04:40.843279 29698 http.cpp:957] Authorizing principal 'test-principal' to GET the
'/monitor/statistics' endpoint
I0825 17:04:40.846457 29693 slave.cpp:859] Agent terminating
[       OK ] Endpoint/SlaveEndpointTest.UnauthorizedRequest/0 (31 ms)
[ RUN      ] Endpoint/SlaveEndpointTest.UnauthorizedRequest/1
I0825 17:04:40.858350  8583 containerizer.cpp:288] Using isolation { environment_secret, posix/cpu,
posix/mem, filesystem/posix, network/cni }
W0825 17:04:40.858847  8583 backend.cpp:76] Failed to create 'aufs' backend: AufsBackend requires
root privileges
W0825 17:04:40.858952  8583 backend.cpp:76] Failed to create 'bind' backend: BindBackend requires
root privileges
I0825 17:04:40.858983  8583 provisioner.cpp:255] Using default backend 'copy'
I0825 17:04:40.863194 29692 slave.cpp:252] Mesos agent started on (810)@172.17.0.7:45722
I0825 17:04:40.863222 29692 slave.cpp:253] Flags at startup: --acls="" --appc_simple_discovery_uri_prefix="http://"
--appc_store_dir="/tmp/Endpoint_SlaveEndpointTest_UnauthorizedRequest_1_LYkxKJ/store/appc"
--authenticate_http_executors="true" --authenticate_http_readonly="true" --authenticate_http_readwrite="true"
--authenticatee="crammd5" --authentication_backoff_factor="1secs" --authorizer="local" --cgroups_cpu_enable_pids_and_tids_count="false"
--cgroups_enable_cfs="false" --cgroups_hierarchy="/sys/fs/cgroup" --cgroups_limit_swap="false"
--cgroups_root="mesos" --container_disk_watch_interval="15secs" --containerizers="mesos" --credential="/tmp/Endpoint_SlaveEndpointTest_UnauthorizedRequest_1_LYkxKJ/credential"
--default_role="*" --disallow_sharing_agent_pid_namespace="false" --disk_watch_interval="1mins"
--docker="docker" --docker_kill_orphans="true" --docker_registry="https://registry-1.docker.io"
--docker_remove_delay="6hrs" --docker_socket="/var/run/docker.sock" --docker_stop_timeout="0ns"
--docker_store_dir="/tmp/Endpoint_SlaveEndpointTest_UnauthorizedRequest_1_LYkxKJ/store/docker"
--docker_volume_checkpoint_dir="/var/run/mesos/isolators/docker/volume" --enforce_container_disk_quota="false"
--executor_registration_timeout="1mins" --executor_reregistration_timeout="2secs" --executor_secret_key="/tmp/Endpoint_SlaveEndpointTest_UnauthorizedRequest_1_LYkxKJ/executor_secret_key"
--executor_shutdown_grace_period="5secs" --fetcher_cache_dir="/tmp/Endpoint_SlaveEndpointTest_UnauthorizedRequest_1_LYkxKJ/fetch"
--fetcher_cache_size="2GB" --frameworks_home="" --gc_delay="1weeks" --gc_disk_headroom="0.1"
--hadoop_home="" --help="false" --hostname_lookup="true" --http_command_executor="false" --http_credentials="/tmp/Endpoint_SlaveEndpointTest_UnauthorizedRequest_1_LYkxKJ/http_credentials"
--http_heartbeat_interval="30secs" --initialize_driver_logging="true" --isolation="posix/cpu,posix/mem"
--launcher="posix" --launcher_dir="/mesos/mesos-1.5.0/_build/src" --logbufsecs="0" --logging_level="INFO"
--max_completed_executors_per_framework="150" --oversubscribed_resources_interval="15secs"
--perf_duration="10secs" --perf_interval="1mins" --port="5051" --qos_correction_interval_min="0ns"
--quiet="false" --recover="reconnect" --recovery_timeout="15mins" --registration_backoff_factor="10ms"
--resources="cpus:2;gpus:0;mem:1024;disk:1024;ports:[31000-32000]" --revocable_cpu_low_priority="true"
--runtime_dir="/tmp/Endpoint_SlaveEndpointTest_UnauthorizedRequest_1_LYkxKJ" --sandbox_directory="/mnt/mesos/sandbox"
--strict="true" --switch_user="true" --systemd_enable_support="true" --systemd_runtime_directory="/run/systemd/system"
--version="false" --work_dir="/tmp/Endpoint_SlaveEndpointTest_UnauthorizedRequest_1_OCIoiJ"
I0825 17:04:40.863726 29692 credentials.hpp:86] Loading credential for authentication from
'/tmp/Endpoint_SlaveEndpointTest_UnauthorizedRequest_1_LYkxKJ/credential'
I0825 17:04:40.863916 29692 slave.cpp:285] Agent using credential for: test-principal
I0825 17:04:40.863940 29692 credentials.hpp:37] Loading credentials for authentication from
'/tmp/Endpoint_SlaveEndpointTest_UnauthorizedRequest_1_LYkxKJ/http_credentials'
I0825 17:04:40.864217 29692 http.cpp:1026] Creating default 'basic' HTTP authenticator for
realm 'mesos-agent-executor'
I0825 17:04:40.864346 29692 http.cpp:1047] Creating default 'jwt' HTTP authenticator for realm
'mesos-agent-executor'
I0825 17:04:40.864547 29692 http.cpp:1026] Creating default 'basic' HTTP authenticator for
realm 'mesos-agent-readonly'
I0825 17:04:40.864645 29692 http.cpp:1047] Creating default 'jwt' HTTP authenticator for realm
'mesos-agent-readonly'
I0825 17:04:40.864828 29692 http.cpp:1026] Creating default 'basic' HTTP authenticator for
realm 'mesos-agent-readwrite'
I0825 17:04:40.864928 29692 http.cpp:1047] Creating default 'jwt' HTTP authenticator for realm
'mesos-agent-readwrite'
I0825 17:04:40.866354 29692 slave.cpp:581] Agent resources: [{"name":"cpus","scalar":{"value":2.0},"type":"SCALAR"},{"name":"mem","scalar":{"value":1024.0},"type":"SCALAR"},{"name":"disk","scalar":{"value":1024.0},"type":"SCALAR"},{"name":"ports","ranges":{"range":[{"begin":31000,"end":32000}]},"type":"RANGES"}]
I0825 17:04:40.866582 29692 slave.cpp:589] Agent attributes: [  ]
I0825 17:04:40.866596 29692 slave.cpp:598] Agent hostname: 5723209b0262
I0825 17:04:40.866747 29699 status_update_manager.cpp:177] Pausing sending status updates
I0825 17:04:40.868269 29690 state.cpp:64] Recovering state from '/tmp/Endpoint_SlaveEndpointTest_UnauthorizedRequest_1_OCIoiJ/meta'
I0825 17:04:40.868576 29700 status_update_manager.cpp:203] Recovering status update manager
I0825 17:04:40.868767 29703 containerizer.cpp:643] Recovering containerizer
I0825 17:04:40.870134 29682 provisioner.cpp:416] Provisioner recovery complete
I0825 17:04:40.870586 29698 slave.cpp:6264] Finished recovery
I0825 17:04:40.871016 29698 slave.cpp:6446] Querying resource estimator for oversubscribable
resources
I0825 17:04:40.871209 29693 slave.cpp:6460] Received oversubscribable resources {} from the
resource estimator
I0825 17:04:40.874064 29689 process.cpp:3933] Handling HTTP event for process 'slave(810)'
with path: '/slave(810)/monitor/statistics.json'
I0825 17:04:40.876310 29691 http.cpp:1166] HTTP GET for /slave(810)/monitor/statistics.json
from 172.17.0.7:57770
I0825 17:04:40.876392 29691 http.cpp:957] Authorizing principal 'test-principal' to GET the
'/monitor/statistics.json' endpoint
I0825 17:04:40.879631  8583 slave.cpp:859] Agent terminating
[       OK ] Endpoint/SlaveEndpointTest.UnauthorizedRequest/1 (33 ms)
[ RUN      ] Endpoint/SlaveEndpointTest.UnauthorizedRequest/2
I0825 17:04:40.892015  8583 containerizer.cpp:288] Using isolation { environment_secret, posix/cpu,
posix/mem, filesystem/posix, network/cni }
W0825 17:04:40.892539  8583 backend.cpp:76] Failed to create 'aufs' backend: AufsBackend requires
root privileges
W0825 17:04:40.892664  8583 backend.cpp:76] Failed to create 'bind' backend: BindBackend requires
root privileges
I0825 17:04:40.892696  8583 provisioner.cpp:255] Using default backend 'copy'
I0825 17:04:40.896359 29685 slave.cpp:252] Mesos agent started on (811)@172.17.0.7:45722
I0825 17:04:40.896399 29685 slave.cpp:253] Flags at startup: --acls="" --appc_simple_discovery_uri_prefix="http://"
--appc_store_dir="/tmp/Endpoint_SlaveEndpointTest_UnauthorizedRequest_2_V713PL/store/appc"
--authenticate_http_executors="true" --authenticate_http_readonly="true" --authenticate_http_readwrite="true"
--authenticatee="crammd5" --authentication_backoff_factor="1secs" --authorizer="local" --cgroups_cpu_enable_pids_and_tids_count="false"
--cgroups_enable_cfs="false" --cgroups_hierarchy="/sys/fs/cgroup" --cgroups_limit_swap="false"
--cgroups_root="mesos" --container_disk_watch_interval="15secs" --containerizers="mesos" --credential="/tmp/Endpoint_SlaveEndpointTest_UnauthorizedRequest_2_V713PL/credential"
--default_role="*" --disallow_sharing_agent_pid_namespace="false" --disk_watch_interval="1mins"
--docker="docker" --docker_kill_orphans="true" --docker_registry="https://registry-1.docker.io"
--docker_remove_delay="6hrs" --docker_socket="/var/run/docker.sock" --docker_stop_timeout="0ns"
--docker_store_dir="/tmp/Endpoint_SlaveEndpointTest_UnauthorizedRequest_2_V713PL/store/docker"
--docker_volume_checkpoint_dir="/var/run/mesos/isolators/docker/volume" --enforce_container_disk_quota="false"
--executor_registration_timeout="1mins" --executor_reregistration_timeout="2secs" --executor_secret_key="/tmp/Endpoint_SlaveEndpointTest_UnauthorizedRequest_2_V713PL/executor_secret_key"
--executor_shutdown_grace_period="5secs" --fetcher_cache_dir="/tmp/Endpoint_SlaveEndpointTest_UnauthorizedRequest_2_V713PL/fetch"
--fetcher_cache_size="2GB" --frameworks_home="" --gc_delay="1weeks" --gc_disk_headroom="0.1"
--hadoop_home="" --help="false" --hostname_lookup="true" --http_command_executor="false" --http_credentials="/tmp/Endpoint_SlaveEndpointTest_UnauthorizedRequest_2_V713PL/http_credentials"
--http_heartbeat_interval="30secs" --initialize_driver_logging="true" --isolation="posix/cpu,posix/mem"
--launcher="posix" --launcher_dir="/mesos/mesos-1.5.0/_build/src" --logbufsecs="0" --logging_level="INFO"
--max_completed_executors_per_framework="150" --oversubscribed_resources_interval="15secs"
--perf_duration="10secs" --perf_interval="1mins" --port="5051" --qos_correction_interval_min="0ns"
--quiet="false" --recover="reconnect" --recovery_timeout="15mins" --registration_backoff_factor="10ms"
--resources="cpus:2;gpus:0;mem:1024;disk:1024;ports:[31000-32000]" --revocable_cpu_low_priority="true"
--runtime_dir="/tmp/Endpoint_SlaveEndpointTest_UnauthorizedRequest_2_V713PL" --sandbox_directory="/mnt/mesos/sandbox"
--strict="true" --switch_user="true" --systemd_enable_support="true" --systemd_runtime_directory="/run/systemd/system"
--version="false" --work_dir="/tmp/Endpoint_SlaveEndpointTest_UnauthorizedRequest_2_WIyUiL"
I0825 17:04:40.896847 29685 credentials.hpp:86] Loading credential for authentication from
'/tmp/Endpoint_SlaveEndpointTest_UnauthorizedRequest_2_V713PL/credential'
I0825 17:04:40.897027 29685 slave.cpp:285] Agent using credential for: test-principal
I0825 17:04:40.897069 29685 credentials.hpp:37] Loading credentials for authentication from
'/tmp/Endpoint_SlaveEndpointTest_UnauthorizedRequest_2_V713PL/http_credentials'
I0825 17:04:40.897347 29685 http.cpp:1026] Creating default 'basic' HTTP authenticator for
realm 'mesos-agent-executor'
I0825 17:04:40.897469 29685 http.cpp:1047] Creating default 'jwt' HTTP authenticator for realm
'mesos-agent-executor'
I0825 17:04:40.897758 29685 http.cpp:1026] Creating default 'basic' HTTP authenticator for
realm 'mesos-agent-readonly'
I0825 17:04:40.897917 29685 http.cpp:1047] Creating default 'jwt' HTTP authenticator for realm
'mesos-agent-readonly'
I0825 17:04:40.898156 29685 http.cpp:1026] Creating default 'basic' HTTP authenticator for
realm 'mesos-agent-readwrite'
I0825 17:04:40.898252 29685 http.cpp:1047] Creating default 'jwt' HTTP authenticator for realm
'mesos-agent-readwrite'
I0825 17:04:40.900632 29685 slave.cpp:581] Agent resources: [{"name":"cpus","scalar":{"value":2.0},"type":"SCALAR"},{"name":"mem","scalar":{"value":1024.0},"type":"SCALAR"},{"name":"disk","scalar":{"value":1024.0},"type":"SCALAR"},{"name":"ports","ranges":{"range":[{"begin":31000,"end":32000}]},"type":"RANGES"}]
I0825 17:04:40.901052 29685 slave.cpp:589] Agent attributes: [  ]
I0825 17:04:40.901084 29685 slave.cpp:598] Agent hostname: 5723209b0262
I0825 17:04:40.901305 29684 status_update_manager.cpp:177] Pausing sending status updates
I0825 17:04:40.902762 29693 state.cpp:64] Recovering state from '/tmp/Endpoint_SlaveEndpointTest_UnauthorizedRequest_2_WIyUiL/meta'
I0825 17:04:40.903029 29701 status_update_manager.cpp:203] Recovering status update manager
I0825 17:04:40.903250 29692 containerizer.cpp:643] Recovering containerizer
I0825 17:04:40.904965 29683 provisioner.cpp:416] Provisioner recovery complete
I0825 17:04:40.905582 29686 slave.cpp:6264] Finished recovery
I0825 17:04:40.906033 29686 slave.cpp:6446] Querying resource estimator for oversubscribable
resources
I0825 17:04:40.906251 29699 slave.cpp:6460] Received oversubscribable resources {} from the
resource estimator
I0825 17:04:40.908782 29684 process.cpp:3933] Handling HTTP event for process 'slave(811)'
with path: '/slave(811)/containers'
I0825 17:04:40.910711 29693 http.cpp:1166] HTTP GET for /slave(811)/containers from 172.17.0.7:57772
I0825 17:04:40.910774 29693 http.cpp:957] Authorizing principal 'test-principal' to GET the
'/containers' endpoint
I0825 17:04:40.913311 29699 slave.cpp:859] Agent terminating
[       OK ] Endpoint/SlaveEndpointTest.UnauthorizedRequest/2 (34 ms)
[ RUN      ] Endpoint/SlaveEndpointTest.NoAuthorizer/0
I0825 17:04:40.927114  8583 containerizer.cpp:288] Using isolation { environment_secret, posix/cpu,
posix/mem, filesystem/posix, network/cni }
W0825 17:04:40.927727  8583 backend.cpp:76] Failed to create 'aufs' backend: AufsBackend requires
root privileges
W0825 17:04:40.927852  8583 backend.cpp:76] Failed to create 'bind' backend: BindBackend requires
root privileges
I0825 17:04:40.927897  8583 provisioner.cpp:255] Using default backend 'copy'
I0825 17:04:40.930007  8583 cluster.cpp:448] Creating default 'local' authorizer
I0825 17:04:40.932078 29691 slave.cpp:252] Mesos agent started on (812)@172.17.0.7:45722
I0825 17:04:40.932122 29691 slave.cpp:253] Flags at startup: --acls="" --appc_simple_discovery_uri_prefix="http://"
--appc_store_dir="/tmp/Endpoint_SlaveEndpointTest_NoAuthorizer_0_nzbcgO/store/appc" --authenticate_http_executors="true"
--authenticate_http_readonly="true" --authenticate_http_readwrite="true" --authenticatee="crammd5"
--authentication_backoff_factor="1secs" --authorizer="local" --cgroups_cpu_enable_pids_and_tids_count="false"
--cgroups_enable_cfs="false" --cgroups_hierarchy="/sys/fs/cgroup" --cgroups_limit_swap="false"
--cgroups_root="mesos" --container_disk_watch_interval="15secs" --containerizers="mesos" --credential="/tmp/Endpoint_SlaveEndpointTest_NoAuthorizer_0_nzbcgO/credential"
--default_role="*" --disallow_sharing_agent_pid_namespace="false" --disk_watch_interval="1mins"
--docker="docker" --docker_kill_orphans="true" --docker_registry="https://registry-1.docker.io"
--docker_remove_delay="6hrs" --docker_socket="/var/run/docker.sock" --docker_stop_timeout="0ns"
--docker_store_dir="/tmp/Endpoint_SlaveEndpointTest_NoAuthorizer_0_nzbcgO/store/docker" --docker_volume_checkpoint_dir="/var/run/mesos/isolators/docker/volume"
--enforce_container_disk_quota="false" --executor_registration_timeout="1mins" --executor_reregistration_timeout="2secs"
--executor_secret_key="/tmp/Endpoint_SlaveEndpointTest_NoAuthorizer_0_nzbcgO/executor_secret_key"
--executor_shutdown_grace_period="5secs" --fetcher_cache_dir="/tmp/Endpoint_SlaveEndpointTest_NoAuthorizer_0_nzbcgO/fetch"
--fetcher_cache_size="2GB" --frameworks_home="" --gc_delay="1weeks" --gc_disk_headroom="0.1"
--hadoop_home="" --help="false" --hostname_lookup="true" --http_command_executor="false" --http_credentials="/tmp/Endpoint_SlaveEndpointTest_NoAuthorizer_0_nzbcgO/http_credentials"
--http_heartbeat_interval="30secs" --initialize_driver_logging="true" --isolation="posix/cpu,posix/mem"
--launcher="posix" --launcher_dir="/mesos/mesos-1.5.0/_build/src" --logbufsecs="0" --logging_level="INFO"
--max_completed_executors_per_framework="150" --oversubscribed_resources_interval="15secs"
--perf_duration="10secs" --perf_interval="1mins" --port="5051" --qos_correction_interval_min="0ns"
--quiet="false" --recover="reconnect" --recovery_timeout="15mins" --registration_backoff_factor="10ms"
--resources="cpus:2;gpus:0;mem:1024;disk:1024;ports:[31000-32000]" --revocable_cpu_low_priority="true"
--runtime_dir="/tmp/Endpoint_SlaveEndpointTest_NoAuthorizer_0_nzbcgO" --sandbox_directory="/mnt/mesos/sandbox"
--strict="true" --switch_user="true" --systemd_enable_support="true" --systemd_runtime_directory="/run/systemd/system"
--version="false" --work_dir="/tmp/Endpoint_SlaveEndpointTest_NoAuthorizer_0_aN7TDN"
I0825 17:04:40.932639 29691 credentials.hpp:86] Loading credential for authentication from
'/tmp/Endpoint_SlaveEndpointTest_NoAuthorizer_0_nzbcgO/credential'
I0825 17:04:40.932867 29691 slave.cpp:285] Agent using credential for: test-principal
I0825 17:04:40.932888 29691 credentials.hpp:37] Loading credentials for authentication from
'/tmp/Endpoint_SlaveEndpointTest_NoAuthorizer_0_nzbcgO/http_credentials'
I0825 17:04:40.933243 29691 http.cpp:1026] Creating default 'basic' HTTP authenticator for
realm 'mesos-agent-executor'
I0825 17:04:40.933423 29691 http.cpp:1047] Creating default 'jwt' HTTP authenticator for realm
'mesos-agent-executor'
I0825 17:04:40.933676 29691 http.cpp:1026] Creating default 'basic' HTTP authenticator for
realm 'mesos-agent-readonly'
I0825 17:04:40.933787 29691 http.cpp:1047] Creating default 'jwt' HTTP authenticator for realm
'mesos-agent-readonly'
I0825 17:04:40.933972 29691 http.cpp:1026] Creating default 'basic' HTTP authenticator for
realm 'mesos-agent-readwrite'
I0825 17:04:40.934079 29691 http.cpp:1047] Creating default 'jwt' HTTP authenticator for realm
'mesos-agent-readwrite'
I0825 17:04:40.935742 29691 slave.cpp:581] Agent resources: [{"name":"cpus","scalar":{"value":2.0},"type":"SCALAR"},{"name":"mem","scalar":{"value":1024.0},"type":"SCALAR"},{"name":"disk","scalar":{"value":1024.0},"type":"SCALAR"},{"name":"ports","ranges":{"range":[{"begin":31000,"end":32000}]},"type":"RANGES"}]
I0825 17:04:40.935992 29691 slave.cpp:589] Agent attributes: [  ]
I0825 17:04:40.936007 29691 slave.cpp:598] Agent hostname: 5723209b0262
I0825 17:04:40.936187 29702 status_update_manager.cpp:177] Pausing sending status updates
I0825 17:04:40.938122 29690 state.cpp:64] Recovering state from '/tmp/Endpoint_SlaveEndpointTest_NoAuthorizer_0_aN7TDN/meta'
I0825 17:04:40.938416 29695 status_update_manager.cpp:203] Recovering status update manager
I0825 17:04:40.938648 29697 containerizer.cpp:643] Recovering containerizer
I0825 17:04:40.940198 29702 provisioner.cpp:416] Provisioner recovery complete
I0825 17:04:40.940609 29691 slave.cpp:6264] Finished recovery
I0825 17:04:40.941074 29691 slave.cpp:6446] Querying resource estimator for oversubscribable
resources
I0825 17:04:40.941402 29696 slave.cpp:6460] Received oversubscribable resources {} from the
resource estimator
I0825 17:04:40.944388 29693 process.cpp:3933] Handling HTTP event for process 'slave(812)'
with path: '/slave(812)/monitor/statistics'
I0825 17:04:40.946599 29686 http.cpp:1166] HTTP GET for /slave(812)/monitor/statistics from
172.17.0.7:57784
I0825 17:04:40.946672 29686 http.cpp:957] Authorizing principal 'test-principal' to GET the
'/monitor/statistics' endpoint
I0825 17:04:40.950037  8583 slave.cpp:859] Agent terminating
[       OK ] Endpoint/SlaveEndpointTest.NoAuthorizer/0 (35 ms)
[ RUN      ] Endpoint/SlaveEndpointTest.NoAuthorizer/1
I0825 17:04:40.963014  8583 containerizer.cpp:288] Using isolation { environment_secret, posix/cpu,
posix/mem, filesystem/posix, network/cni }
W0825 17:04:40.963634  8583 backend.cpp:76] Failed to create 'aufs' backend: AufsBackend requires
root privileges
W0825 17:04:40.963759  8583 backend.cpp:76] Failed to create 'bind' backend: BindBackend requires
root privileges
I0825 17:04:40.963795  8583 provisioner.cpp:255] Using default backend 'copy'
I0825 17:04:40.965901  8583 cluster.cpp:448] Creating default 'local' authorizer
I0825 17:04:40.968085 29697 slave.cpp:252] Mesos agent started on (813)@172.17.0.7:45722
I0825 17:04:40.968111 29697 slave.cpp:253] Flags at startup: --acls="" --appc_simple_discovery_uri_prefix="http://"
--appc_store_dir="/tmp/Endpoint_SlaveEndpointTest_NoAuthorizer_1_ZAdG1Q/store/appc" --authenticate_http_executors="true"
--authenticate_http_readonly="true" --authenticate_http_readwrite="true" --authenticatee="crammd5"
--authentication_backoff_factor="1secs" --authorizer="local" --cgroups_cpu_enable_pids_and_tids_count="false"
--cgroups_enable_cfs="false" --cgroups_hierarchy="/sys/fs/cgroup" --cgroups_limit_swap="false"
--cgroups_root="mesos" --container_disk_watch_interval="15secs" --containerizers="mesos" --credential="/tmp/Endpoint_SlaveEndpointTest_NoAuthorizer_1_ZAdG1Q/credential"
--default_role="*" --disallow_sharing_agent_pid_namespace="false" --disk_watch_interval="1mins"
--docker="docker" --docker_kill_orphans="true" --docker_registry="https://registry-1.docker.io"
--docker_remove_delay="6hrs" --docker_socket="/var/run/docker.sock" --docker_stop_timeout="0ns"
--docker_store_dir="/tmp/Endpoint_SlaveEndpointTest_NoAuthorizer_1_ZAdG1Q/store/docker" --docker_volume_checkpoint_dir="/var/run/mesos/isolators/docker/volume"
--enforce_container_disk_quota="false" --executor_registration_timeout="1mins" --executor_reregistration_timeout="2secs"
--executor_secret_key="/tmp/Endpoint_SlaveEndpointTest_NoAuthorizer_1_ZAdG1Q/executor_secret_key"
--executor_shutdown_grace_period="5secs" --fetcher_cache_dir="/tmp/Endpoint_SlaveEndpointTest_NoAuthorizer_1_ZAdG1Q/fetch"
--fetcher_cache_size="2GB" --frameworks_home="" --gc_delay="1weeks" --gc_disk_headroom="0.1"
--hadoop_home="" --help="false" --hostname_lookup="true" --http_command_executor="false" --http_credentials="/tmp/Endpoint_SlaveEndpointTest_NoAuthorizer_1_ZAdG1Q/http_credentials"
--http_heartbeat_interval="30secs" --initialize_driver_logging="true" --isolation="posix/cpu,posix/mem"
--launcher="posix" --launcher_dir="/mesos/mesos-1.5.0/_build/src" --logbufsecs="0" --logging_level="INFO"
--max_completed_executors_per_framework="150" --oversubscribed_resources_interval="15secs"
--perf_duration="10secs" --perf_interval="1mins" --port="5051" --qos_correction_interval_min="0ns"
--quiet="false" --recover="reconnect" --recovery_timeout="15mins" --registration_backoff_factor="10ms"
--resources="cpus:2;gpus:0;mem:1024;disk:1024;ports:[31000-32000]" --revocable_cpu_low_priority="true"
--runtime_dir="/tmp/Endpoint_SlaveEndpointTest_NoAuthorizer_1_ZAdG1Q" --sandbox_directory="/mnt/mesos/sandbox"
--strict="true" --switch_user="true" --systemd_enable_support="true" --systemd_runtime_directory="/run/systemd/system"
--version="false" --work_dir="/tmp/Endpoint_SlaveEndpointTest_NoAuthorizer_1_sFu1jQ"
I0825 17:04:40.968596 29697 credentials.hpp:86] Loading credential for authentication from
'/tmp/Endpoint_SlaveEndpointTest_NoAuthorizer_1_ZAdG1Q/credential'
I0825 17:04:40.968823 29697 slave.cpp:285] Agent using credential for: test-principal
I0825 17:04:40.968845 29697 credentials.hpp:37] Loading credentials for authentication from
'/tmp/Endpoint_SlaveEndpointTest_NoAuthorizer_1_ZAdG1Q/http_credentials'
I0825 17:04:40.969187 29697 http.cpp:1026] Creating default 'basic' HTTP authenticator for
realm 'mesos-agent-executor'
I0825 17:04:40.969354 29697 http.cpp:1047] Creating default 'jwt' HTTP authenticator for realm
'mesos-agent-executor'
I0825 17:04:40.969578 29697 http.cpp:1026] Creating default 'basic' HTTP authenticator for
realm 'mesos-agent-readonly'
I0825 17:04:40.969678 29697 http.cpp:1047] Creating default 'jwt' HTTP authenticator for realm
'mesos-agent-readonly'
I0825 17:04:40.969872 29697 http.cpp:1026] Creating default 'basic' HTTP authenticator for
realm 'mesos-agent-readwrite'
I0825 17:04:40.969975 29697 http.cpp:1047] Creating default 'jwt' HTTP authenticator for realm
'mesos-agent-readwrite'
I0825 17:04:40.971562 29697 slave.cpp:581] Agent resources: [{"name":"cpus","scalar":{"value":2.0},"type":"SCALAR"},{"name":"mem","scalar":{"value":1024.0},"type":"SCALAR"},{"name":"disk","scalar":{"value":1024.0},"type":"SCALAR"},{"name":"ports","ranges":{"range":[{"begin":31000,"end":32000}]},"type":"RANGES"}]
I0825 17:04:40.971814 29697 slave.cpp:589] Agent attributes: [  ]
I0825 17:04:40.971829 29697 slave.cpp:598] Agent hostname: 5723209b0262
I0825 17:04:40.972009 29687 status_update_manager.cpp:177] Pausing sending status updates
I0825 17:04:40.973847 29683 state.cpp:64] Recovering state from '/tmp/Endpoint_SlaveEndpointTest_NoAuthorizer_1_sFu1jQ/meta'
I0825 17:04:40.974246 29703 status_update_manager.cpp:203] Recovering status update manager
I0825 17:04:40.974486 29692 containerizer.cpp:643] Recovering containerizer
I0825 17:04:40.976107 29681 provisioner.cpp:416] Provisioner recovery complete
I0825 17:04:40.976475 29697 slave.cpp:6264] Finished recovery
I0825 17:04:40.977057 29697 slave.cpp:6446] Querying resource estimator for oversubscribable
resources
I0825 17:04:40.977367 29693 slave.cpp:6460] Received oversubscribable resources {} from the
resource estimator
I0825 17:04:40.980073 29698 process.cpp:3933] Handling HTTP event for process 'slave(813)'
with path: '/slave(813)/monitor/statistics.json'
I0825 17:04:40.982089 29701 http.cpp:1166] HTTP GET for /slave(813)/monitor/statistics.json
from 172.17.0.7:57786
I0825 17:04:40.982173 29701 http.cpp:957] Authorizing principal 'test-principal' to GET the
'/monitor/statistics.json' endpoint
I0825 17:04:40.985615  8583 slave.cpp:859] Agent terminating
[       OK ] Endpoint/SlaveEndpointTest.NoAuthorizer/1 (36 ms)
[ RUN      ] Endpoint/SlaveEndpointTest.NoAuthorizer/2
I0825 17:04:40.999385  8583 containerizer.cpp:288] Using isolation { environment_secret, posix/cpu,
posix/mem, filesystem/posix, network/cni }
W0825 17:04:40.999934  8583 backend.cpp:76] Failed to create 'aufs' backend: AufsBackend requires
root privileges
W0825 17:04:41.000057  8583 backend.cpp:76] Failed to create 'bind' backend: BindBackend requires
root privileges
I0825 17:04:41.000090  8583 provisioner.cpp:255] Using default backend 'copy'
I0825 17:04:41.002162  8583 cluster.cpp:448] Creating default 'local' authorizer
I0825 17:04:41.004397 29685 slave.cpp:252] Mesos agent started on (814)@172.17.0.7:45722
I0825 17:04:41.004422 29685 slave.cpp:253] Flags at startup: --acls="" --appc_simple_discovery_uri_prefix="http://"
--appc_store_dir="/tmp/Endpoint_SlaveEndpointTest_NoAuthorizer_2_zx8K8T/store/appc" --authenticate_http_executors="true"
--authenticate_http_readonly="true" --authenticate_http_readwrite="true" --authenticatee="crammd5"
--authentication_backoff_factor="1secs" --authorizer="local" --cgroups_cpu_enable_pids_and_tids_count="false"
--cgroups_enable_cfs="false" --cgroups_hierarchy="/sys/fs/cgroup" --cgroups_limit_swap="false"
--cgroups_root="mesos" --container_disk_watch_interval="15secs" --containerizers="mesos" --credential="/tmp/Endpoint_SlaveEndpointTest_NoAuthorizer_2_zx8K8T/credential"
--default_role="*" --disallow_sharing_agent_pid_namespace="false" --disk_watch_interval="1mins"
--docker="docker" --docker_kill_orphans="true" --docker_registry="https://registry-1.docker.io"
--docker_remove_delay="6hrs" --docker_socket="/var/run/docker.sock" --docker_stop_timeout="0ns"
--docker_store_dir="/tmp/Endpoint_SlaveEndpointTest_NoAuthorizer_2_zx8K8T/store/docker" --docker_volume_checkpoint_dir="/var/run/mesos/isolators/docker/volume"
--enforce_container_disk_quota="false" --executor_registration_timeout="1mins" --executor_reregistration_timeout="2secs"
--executor_secret_key="/tmp/Endpoint_SlaveEndpointTest_NoAuthorizer_2_zx8K8T/executor_secret_key"
--executor_shutdown_grace_period="5secs" --fetcher_cache_dir="/tmp/Endpoint_SlaveEndpointTest_NoAuthorizer_2_zx8K8T/fetch"
--fetcher_cache_size="2GB" --frameworks_home="" --gc_delay="1weeks" --gc_disk_headroom="0.1"
--hadoop_home="" --help="false" --hostname_lookup="true" --http_command_executor="false" --http_credentials="/tmp/Endpoint_SlaveEndpointTest_NoAuthorizer_2_zx8K8T/http_credentials"
--http_heartbeat_interval="30secs" --initialize_driver_logging="true" --isolation="posix/cpu,posix/mem"
--launcher="posix" --launcher_dir="/mesos/mesos-1.5.0/_build/src" --logbufsecs="0" --logging_level="INFO"
--max_completed_executors_per_framework="150" --oversubscribed_resources_interval="15secs"
--perf_duration="10secs" --perf_interval="1mins" --port="5051" --qos_correction_interval_min="0ns"
--quiet="false" --recover="reconnect" --recovery_timeout="15mins" --registration_backoff_factor="10ms"
--resources="cpus:2;gpus:0;mem:1024;disk:1024;ports:[31000-32000]" --revocable_cpu_low_priority="true"
--runtime_dir="/tmp/Endpoint_SlaveEndpointTest_NoAuthorizer_2_zx8K8T" --sandbox_directory="/mnt/mesos/sandbox"
--strict="true" --switch_user="true" --systemd_enable_support="true" --systemd_runtime_directory="/run/systemd/system"
--version="false" --work_dir="/tmp/Endpoint_SlaveEndpointTest_NoAuthorizer_2_0pIGlT"
I0825 17:04:41.004894 29685 credentials.hpp:86] Loading credential for authentication from
'/tmp/Endpoint_SlaveEndpointTest_NoAuthorizer_2_zx8K8T/credential'
I0825 17:04:41.005096 29685 slave.cpp:285] Agent using credential for: test-principal
I0825 17:04:41.005118 29685 credentials.hpp:37] Loading credentials for authentication from
'/tmp/Endpoint_SlaveEndpointTest_NoAuthorizer_2_zx8K8T/http_credentials'
I0825 17:04:41.005426 29685 http.cpp:1026] Creating default 'basic' HTTP authenticator for
realm 'mesos-agent-executor'
I0825 17:04:41.005554 29685 http.cpp:1047] Creating default 'jwt' HTTP authenticator for realm
'mesos-agent-executor'
I0825 17:04:41.005769 29685 http.cpp:1026] Creating default 'basic' HTTP authenticator for
realm 'mesos-agent-readonly'
I0825 17:04:41.005869 29685 http.cpp:1047] Creating default 'jwt' HTTP authenticator for realm
'mesos-agent-readonly'
I0825 17:04:41.006045 29685 http.cpp:1026] Creating default 'basic' HTTP authenticator for
realm 'mesos-agent-readwrite'
I0825 17:04:41.006144 29685 http.cpp:1047] Creating default 'jwt' HTTP authenticator for realm
'mesos-agent-readwrite'
I0825 17:04:41.007575 29685 slave.cpp:581] Agent resources: [{"name":"cpus","scalar":{"value":2.0},"type":"SCALAR"},{"name":"mem","scalar":{"value":1024.0},"type":"SCALAR"},{"name":"disk","scalar":{"value":1024.0},"type":"SCALAR"},{"name":"ports","ranges":{"range":[{"begin":31000,"end":32000}]},"type":"RANGES"}]
I0825 17:04:41.007800 29685 slave.cpp:589] Agent attributes: [  ]
I0825 17:04:41.007813 29685 slave.cpp:598] Agent hostname: 5723209b0262
I0825 17:04:41.008033 29687 status_update_manager.cpp:177] Pausing sending status updates
I0825 17:04:41.009438 29682 state.cpp:64] Recovering state from '/tmp/Endpoint_SlaveEndpointTest_NoAuthorizer_2_0pIGlT/meta'
I0825 17:04:41.009899 29689 status_update_manager.cpp:203] Recovering status update manager
I0825 17:04:41.010129 29698 containerizer.cpp:643] Recovering containerizer
I0825 17:04:41.011714 29687 provisioner.cpp:416] Provisioner recovery complete
I0825 17:04:41.012197 29692 slave.cpp:6264] Finished recovery
I0825 17:04:41.012683 29692 slave.cpp:6446] Querying resource estimator for oversubscribable
resources
I0825 17:04:41.013027 29691 slave.cpp:6460] Received oversubscribable resources {} from the
resource estimator
I0825 17:04:41.014771 29695 process.cpp:3933] Handling HTTP event for process 'slave(814)'
with path: '/slave(814)/containers'
I0825 17:04:41.016737 29703 http.cpp:1166] HTTP GET for /slave(814)/containers from 172.17.0.7:57794
I0825 17:04:41.016811 29703 http.cpp:957] Authorizing principal 'test-principal' to GET the
'/containers' endpoint
I0825 17:04:41.021000 29693 slave.cpp:859] Agent terminating
[       OK ] Endpoint/SlaveEndpointTest.NoAuthorizer/2 (35 ms)
[----------] 9 tests from Endpoint/SlaveEndpointTest (312 ms total)

[----------] 2 tests from ContainerizerType/DefaultContainerDNSFlagTest
[ RUN      ] ContainerizerType/DefaultContainerDNSFlagTest.ValidateFlag/0
[       OK ] ContainerizerType/DefaultContainerDNSFlagTest.ValidateFlag/0 (10 ms)
[ RUN      ] ContainerizerType/DefaultContainerDNSFlagTest.ValidateFlag/1
[       OK ] ContainerizerType/DefaultContainerDNSFlagTest.ValidateFlag/1 (10 ms)
[----------] 2 tests from ContainerizerType/DefaultContainerDNSFlagTest (20 ms total)

[----------] Global test environment tear-down
[==========] 1668 tests from 184 test cases ran. (610229 ms total)
[  PASSED  ] 1663 tests.
[  FAILED  ] 5 tests, listed below:
[  FAILED  ] DefaultExecutorCheckTest.CommandCheckDeliveredAndReconciled
[  FAILED  ] DefaultExecutorCheckTest.CommandCheckStatusChange
[  FAILED  ] DefaultExecutorCheckTest.CommandCheckSeesParentsEnv
[  FAILED  ] DefaultExecutorCheckTest.CommandCheckSharesWorkDirWithTask
[  FAILED  ] ExamplesTest.TestFramework

 5 FAILED TESTS
  YOU HAVE 20 DISABLED TESTS

I0825 17:04:41.107872 29704 process.cpp:1072] Failed to accept socket: future discarded
make[4]: *** [check-local] Error 1
make[4]: Leaving directory `/mesos/mesos-1.5.0/_build/src'
make[3]: *** [check-am] Error 2
make[3]: Leaving directory `/mesos/mesos-1.5.0/_build/src'
make[2]: *** [check] Error 2
make[2]: Leaving directory `/mesos/mesos-1.5.0/_build/src'
make[1]: *** [check-recursive] Error 1
make[1]: Leaving directory `/mesos/mesos-1.5.0/_build'
make: *** [distcheck] Error 1
+ docker rmi mesos-1503677339-14163
Untagged: mesos-1503677339-14163:latest
Deleted: sha256:4cca7ff81999e77e4907824fc0fbd107d431f2245dd7b047c2b95114a8d96b5a
Deleted: sha256:e6b369a2b4e31bab05c52702af501cc0a629c2e00bea14e5cc4ce9a968e94627
Deleted: sha256:a9473f22cff3f0bd48c62d7c153c6a4cbf612494f56b2b9a805d65de1755d430
Deleted: sha256:a3164496d0660bfc33c155f60be30c6dbeacc531cb70df03b992a21dbbbfec4b
Deleted: sha256:3899bc4dbc50d356084fd28d1e118e4d67368044fa4d3de037edc27176f91c73
Deleted: sha256:3416371c3a6a09d04469d809bd01307363fc1e7e88ce7852147af3158d62e225
Deleted: sha256:470edf6ef76a1e6481a30f932d4086b78106a76ed4ba01bcacb1792faa96357a
Deleted: sha256:4e47dbfcc24209969b18fb19f44e25bbd952fcda409b5e60824832afb2219937
Deleted: sha256:1fa8823f9d955f3d9778d6c90858e401919b61439e7edbb07e02181956a0f6bf
Deleted: sha256:79f8b4f8b8ec2b1688bba0fdbf47ede6ec079c61feffabc2e2dd9c3b8785f6fe
Deleted: sha256:08ee3ede79eece49a7ac4d4313db39b52b50a904c8b8ff80273ae199e5f71b45
Deleted: sha256:a829a6ed64bb10e60718c0efa9f4232192d1c76abc2c26f5c49c92b7e55e390f
Deleted: sha256:8b33722147486fb70a8d7abd63ec03ab4f23671e12eb810ee7cd06c2bd2c1b7a
Deleted: sha256:aee67bed0b279738ea9d6a4e91811ff80b062c29d082d90d99cb8c0ed19680be
Deleted: sha256:e51cd0ba6ec4aa78487727a78fbb32e51f511e56fc737c80fedc54bc9d34a7cb
Deleted: sha256:5ca9dd220e845e05ef2163a5d0f440e3449bb1aeeaccb761efa8f91e731f55ed
Deleted: sha256:bb04390a4f29a8a4b20d3e7a4cd554abd90c32b943f89e5de5e31d370e7b243d
Deleted: sha256:5239efbe05ee0a645d60ae005d11c1e82caa7b1d4f7ba42e3142c157c75f17bf
Deleted: sha256:1f8cd69a213dbfb860c1bf1ae550c7c440b467d6282fe622a2feaedb7f12f7b4
Deleted: sha256:53720f3bd1468acfa909b65bc73d542ed0f9aa807fa6bdb5afb7f9cb153f2e05
Deleted: sha256:157d1ab390c654c319abc31004f350aff9286bf71a8ddae41c5a8e6b110fc06b
Deleted: sha256:b917f25d10e850c9c212fb64aaefb56888d47105328d1fd68ebdde070706ee32
Deleted: sha256:b5a4a0e5f651d0a26deb5145b15d9bc2c1d3392c5b06e57fb09e7a2f55ed9168
Deleted: sha256:ce64b5093f774adb6d5fbb4b03fd408ffae14eeb3b43dec6261a0c56ef2e1c00
Build step 'Execute shell' marked build as failure

Mime
View raw message