mesos-builds mailing list archives

Site index · List index
Message view « Date » · « Thread »
Top « Date » · « Thread »
From Apache Jenkins Server <jenk...@builds.apache.org>
Subject Build failed in Jenkins: Mesos-Buildbot » autotools,clang,--verbose,GLOG_v=1 MESOS_VERBOSE=1,ubuntu:14.04,(ubuntu)&&(!ubuntu-us1)&&(!ubuntu-eu2) #4150
Date Fri, 25 Aug 2017 04:53:22 GMT
See <https://builds.apache.org/job/Mesos-Buildbot/BUILDTOOL=autotools,COMPILER=clang,CONFIGURATION=--verbose,ENVIRONMENT=GLOG_v=1%20MESOS_VERBOSE=1,OS=ubuntu%3A14.04,label_exp=(ubuntu)&&(!ubuntu-us1)&&(!ubuntu-eu2)/4150/display/redirect?page=changes>

Changes:

[bmahler] Added MESOS-7863 to the 1.2.3 CHANGELOG.

[bmahler] Added MESOS-7863 to the 1.1.3 CHANGELOG.

[xujyan] Propagate the error from os::rmdir.

[xujyan] Fix garbage collection metrics test failures.

[mpark] Fixed agent downgrades for reservation refinement.

------------------------------------------
[...truncated 30.79 MB...]
I0825 04:53:06.915879  3986 slave.cpp:285] Agent using credential for: test-principal
I0825 04:53:06.915904  3986 credentials.hpp:37] Loading credentials for authentication from
'/tmp/Endpoint_SlaveEndpointTest_AuthorizedRequest_2_8Csq0y/http_credentials'
I0825 04:53:06.916123  3986 http.cpp:1026] Creating default 'basic' HTTP authenticator for
realm 'mesos-agent-readonly'
I0825 04:53:06.916286  3986 http.cpp:1026] Creating default 'basic' HTTP authenticator for
realm 'mesos-agent-readwrite'
I0825 04:53:06.918380  3986 slave.cpp:581] Agent resources: [{"name":"cpus","scalar":{"value":2.0},"type":"SCALAR"},{"name":"mem","scalar":{"value":1024.0},"type":"SCALAR"},{"name":"disk","scalar":{"value":1024.0},"type":"SCALAR"},{"name":"ports","ranges":{"range":[{"begin":31000,"end":32000}]},"type":"RANGES"}]
I0825 04:53:06.918759  3986 slave.cpp:589] Agent attributes: [  ]
I0825 04:53:06.918784  3986 slave.cpp:598] Agent hostname: d01d92668f5e
I0825 04:53:06.919047  3994 status_update_manager.cpp:177] Pausing sending status updates
I0825 04:53:06.921216  3985 state.cpp:64] Recovering state from '/tmp/Endpoint_SlaveEndpointTest_AuthorizedRequest_2_f3Njgd/meta'
I0825 04:53:06.921524  3973 status_update_manager.cpp:203] Recovering status update manager
I0825 04:53:06.921716  3971 containerizer.cpp:643] Recovering containerizer
I0825 04:53:06.923454  3977 provisioner.cpp:416] Provisioner recovery complete
I0825 04:53:06.924006  3986 slave.cpp:6264] Finished recovery
I0825 04:53:06.924443  3986 slave.cpp:6446] Querying resource estimator for oversubscribable
resources
I0825 04:53:06.924737  3972 slave.cpp:6460] Received oversubscribable resources {} from the
resource estimator
I0825 04:53:06.926854  3982 process.cpp:3933] Handling HTTP event for process 'slave(802)'
with path: '/slave(802)/containers'
I0825 04:53:06.928673  3985 http.cpp:1166] HTTP GET for /slave(802)/containers from 172.17.0.3:53332
I0825 04:53:06.928817  3985 http.cpp:957] Authorizing principal 'test-principal' to GET the
'/containers' endpoint
I0825 04:53:06.933562  3953 slave.cpp:859] Agent terminating
[       OK ] Endpoint/SlaveEndpointTest.AuthorizedRequest/2 (37 ms)
[ RUN      ] Endpoint/SlaveEndpointTest.UnauthorizedRequest/0
I0825 04:53:06.946637  3953 containerizer.cpp:288] Using isolation { environment_secret, posix/cpu,
posix/mem, filesystem/posix, network/cni }
W0825 04:53:06.947099  3953 backend.cpp:76] Failed to create 'aufs' backend: AufsBackend requires
root privileges
W0825 04:53:06.947209  3953 backend.cpp:76] Failed to create 'bind' backend: BindBackend requires
root privileges
I0825 04:53:06.947243  3953 provisioner.cpp:255] Using default backend 'copy'
I0825 04:53:06.951690  3973 slave.cpp:252] Mesos agent started on (803)@172.17.0.3:44159
I0825 04:53:06.951736  3973 slave.cpp:253] Flags at startup: --acls="" --appc_simple_discovery_uri_prefix="http://"
--appc_store_dir="/tmp/Endpoint_SlaveEndpointTest_UnauthorizedRequest_0_M0PyhY/store/appc"
--authenticate_http_readonly="true" --authenticate_http_readwrite="true" --authenticatee="crammd5"
--authentication_backoff_factor="1secs" --authorizer="local" --cgroups_cpu_enable_pids_and_tids_count="false"
--cgroups_enable_cfs="false" --cgroups_hierarchy="/sys/fs/cgroup" --cgroups_limit_swap="false"
--cgroups_root="mesos" --container_disk_watch_interval="15secs" --containerizers="mesos" --credential="/tmp/Endpoint_SlaveEndpointTest_UnauthorizedRequest_0_M0PyhY/credential"
--default_role="*" --disallow_sharing_agent_pid_namespace="false" --disk_watch_interval="1mins"
--docker="docker" --docker_kill_orphans="true" --docker_registry="https://registry-1.docker.io"
--docker_remove_delay="6hrs" --docker_socket="/var/run/docker.sock" --docker_stop_timeout="0ns"
--docker_store_dir="/tmp/Endpoint_SlaveEndpointTest_UnauthorizedRequest_0_M0PyhY/store/docker"
--docker_volume_checkpoint_dir="/var/run/mesos/isolators/docker/volume" --enforce_container_disk_quota="false"
--executor_registration_timeout="1mins" --executor_reregistration_timeout="2secs" --executor_shutdown_grace_period="5secs"
--fetcher_cache_dir="/tmp/Endpoint_SlaveEndpointTest_UnauthorizedRequest_0_M0PyhY/fetch" --fetcher_cache_size="2GB"
--frameworks_home="" --gc_delay="1weeks" --gc_disk_headroom="0.1" --hadoop_home="" --help="false"
--hostname_lookup="true" --http_command_executor="false" --http_credentials="/tmp/Endpoint_SlaveEndpointTest_UnauthorizedRequest_0_M0PyhY/http_credentials"
--http_heartbeat_interval="30secs" --initialize_driver_logging="true" --isolation="posix/cpu,posix/mem"
--launcher="posix" --launcher_dir="/mesos/mesos-1.5.0/_build/src" --logbufsecs="0" --logging_level="INFO"
--max_completed_executors_per_framework="150" --oversubscribed_resources_interval="15secs"
--perf_duration="10secs" --perf_interval="1mins" --port="5051" --qos_correction_interval_min="0ns"
--quiet="false" --recover="reconnect" --recovery_timeout="15mins" --registration_backoff_factor="10ms"
--resources="cpus:2;gpus:0;mem:1024;disk:1024;ports:[31000-32000]" --revocable_cpu_low_priority="true"
--runtime_dir="/tmp/Endpoint_SlaveEndpointTest_UnauthorizedRequest_0_M0PyhY" --sandbox_directory="/mnt/mesos/sandbox"
--strict="true" --switch_user="true" --systemd_enable_support="true" --systemd_runtime_directory="/run/systemd/system"
--version="false" --work_dir="/tmp/Endpoint_SlaveEndpointTest_UnauthorizedRequest_0_NdAXrC"
I0825 04:53:06.952172  3973 credentials.hpp:86] Loading credential for authentication from
'/tmp/Endpoint_SlaveEndpointTest_UnauthorizedRequest_0_M0PyhY/credential'
I0825 04:53:06.952364  3973 slave.cpp:285] Agent using credential for: test-principal
I0825 04:53:06.952404  3973 credentials.hpp:37] Loading credentials for authentication from
'/tmp/Endpoint_SlaveEndpointTest_UnauthorizedRequest_0_M0PyhY/http_credentials'
I0825 04:53:06.952739  3973 http.cpp:1026] Creating default 'basic' HTTP authenticator for
realm 'mesos-agent-readonly'
I0825 04:53:06.952956  3973 http.cpp:1026] Creating default 'basic' HTTP authenticator for
realm 'mesos-agent-readwrite'
I0825 04:53:06.954550  3973 slave.cpp:581] Agent resources: [{"name":"cpus","scalar":{"value":2.0},"type":"SCALAR"},{"name":"mem","scalar":{"value":1024.0},"type":"SCALAR"},{"name":"disk","scalar":{"value":1024.0},"type":"SCALAR"},{"name":"ports","ranges":{"range":[{"begin":31000,"end":32000}]},"type":"RANGES"}]
I0825 04:53:06.954799  3973 slave.cpp:589] Agent attributes: [  ]
I0825 04:53:06.954814  3973 slave.cpp:598] Agent hostname: d01d92668f5e
I0825 04:53:06.955052  3977 status_update_manager.cpp:177] Pausing sending status updates
I0825 04:53:06.956640  3978 state.cpp:64] Recovering state from '/tmp/Endpoint_SlaveEndpointTest_UnauthorizedRequest_0_NdAXrC/meta'
I0825 04:53:06.956959  3989 status_update_manager.cpp:203] Recovering status update manager
I0825 04:53:06.957131  3989 containerizer.cpp:643] Recovering containerizer
I0825 04:53:06.958364  3977 provisioner.cpp:416] Provisioner recovery complete
I0825 04:53:06.959004  3993 slave.cpp:6264] Finished recovery
I0825 04:53:06.959556  3993 slave.cpp:6446] Querying resource estimator for oversubscribable
resources
I0825 04:53:06.959869  3975 slave.cpp:6460] Received oversubscribable resources {} from the
resource estimator
I0825 04:53:06.962189  3974 process.cpp:3933] Handling HTTP event for process 'slave(803)'
with path: '/slave(803)/monitor/statistics'
I0825 04:53:06.963534  3991 http.cpp:1166] HTTP GET for /slave(803)/monitor/statistics from
172.17.0.3:53334
I0825 04:53:06.963625  3991 http.cpp:957] Authorizing principal 'test-principal' to GET the
'/monitor/statistics' endpoint
I0825 04:53:06.965611  3978 slave.cpp:859] Agent terminating
[       OK ] Endpoint/SlaveEndpointTest.UnauthorizedRequest/0 (31 ms)
[ RUN      ] Endpoint/SlaveEndpointTest.UnauthorizedRequest/1
I0825 04:53:06.977365  3953 containerizer.cpp:288] Using isolation { environment_secret, posix/cpu,
posix/mem, filesystem/posix, network/cni }
W0825 04:53:06.977820  3953 backend.cpp:76] Failed to create 'aufs' backend: AufsBackend requires
root privileges
W0825 04:53:06.977928  3953 backend.cpp:76] Failed to create 'bind' backend: BindBackend requires
root privileges
I0825 04:53:06.977960  3953 provisioner.cpp:255] Using default backend 'copy'
I0825 04:53:06.981596  3986 slave.cpp:252] Mesos agent started on (804)@172.17.0.3:44159
I0825 04:53:06.981643  3986 slave.cpp:253] Flags at startup: --acls="" --appc_simple_discovery_uri_prefix="http://"
--appc_store_dir="/tmp/Endpoint_SlaveEndpointTest_UnauthorizedRequest_1_AQgHRn/store/appc"
--authenticate_http_readonly="true" --authenticate_http_readwrite="true" --authenticatee="crammd5"
--authentication_backoff_factor="1secs" --authorizer="local" --cgroups_cpu_enable_pids_and_tids_count="false"
--cgroups_enable_cfs="false" --cgroups_hierarchy="/sys/fs/cgroup" --cgroups_limit_swap="false"
--cgroups_root="mesos" --container_disk_watch_interval="15secs" --containerizers="mesos" --credential="/tmp/Endpoint_SlaveEndpointTest_UnauthorizedRequest_1_AQgHRn/credential"
--default_role="*" --disallow_sharing_agent_pid_namespace="false" --disk_watch_interval="1mins"
--docker="docker" --docker_kill_orphans="true" --docker_registry="https://registry-1.docker.io"
--docker_remove_delay="6hrs" --docker_socket="/var/run/docker.sock" --docker_stop_timeout="0ns"
--docker_store_dir="/tmp/Endpoint_SlaveEndpointTest_UnauthorizedRequest_1_AQgHRn/store/docker"
--docker_volume_checkpoint_dir="/var/run/mesos/isolators/docker/volume" --enforce_container_disk_quota="false"
--executor_registration_timeout="1mins" --executor_reregistration_timeout="2secs" --executor_shutdown_grace_period="5secs"
--fetcher_cache_dir="/tmp/Endpoint_SlaveEndpointTest_UnauthorizedRequest_1_AQgHRn/fetch" --fetcher_cache_size="2GB"
--frameworks_home="" --gc_delay="1weeks" --gc_disk_headroom="0.1" --hadoop_home="" --help="false"
--hostname_lookup="true" --http_command_executor="false" --http_credentials="/tmp/Endpoint_SlaveEndpointTest_UnauthorizedRequest_1_AQgHRn/http_credentials"
--http_heartbeat_interval="30secs" --initialize_driver_logging="true" --isolation="posix/cpu,posix/mem"
--launcher="posix" --launcher_dir="/mesos/mesos-1.5.0/_build/src" --logbufsecs="0" --logging_level="INFO"
--max_completed_executors_per_framework="150" --oversubscribed_resources_interval="15secs"
--perf_duration="10secs" --perf_interval="1mins" --port="5051" --qos_correction_interval_min="0ns"
--quiet="false" --recover="reconnect" --recovery_timeout="15mins" --registration_backoff_factor="10ms"
--resources="cpus:2;gpus:0;mem:1024;disk:1024;ports:[31000-32000]" --revocable_cpu_low_priority="true"
--runtime_dir="/tmp/Endpoint_SlaveEndpointTest_UnauthorizedRequest_1_AQgHRn" --sandbox_directory="/mnt/mesos/sandbox"
--strict="true" --switch_user="true" --systemd_enable_support="true" --systemd_runtime_directory="/run/systemd/system"
--version="false" --work_dir="/tmp/Endpoint_SlaveEndpointTest_UnauthorizedRequest_1_9DKvX1"
I0825 04:53:06.982092  3986 credentials.hpp:86] Loading credential for authentication from
'/tmp/Endpoint_SlaveEndpointTest_UnauthorizedRequest_1_AQgHRn/credential'
I0825 04:53:06.982246  3986 slave.cpp:285] Agent using credential for: test-principal
I0825 04:53:06.982272  3986 credentials.hpp:37] Loading credentials for authentication from
'/tmp/Endpoint_SlaveEndpointTest_UnauthorizedRequest_1_AQgHRn/http_credentials'
I0825 04:53:06.982535  3986 http.cpp:1026] Creating default 'basic' HTTP authenticator for
realm 'mesos-agent-readonly'
I0825 04:53:06.982708  3986 http.cpp:1026] Creating default 'basic' HTTP authenticator for
realm 'mesos-agent-readwrite'
I0825 04:53:06.984148  3986 slave.cpp:581] Agent resources: [{"name":"cpus","scalar":{"value":2.0},"type":"SCALAR"},{"name":"mem","scalar":{"value":1024.0},"type":"SCALAR"},{"name":"disk","scalar":{"value":1024.0},"type":"SCALAR"},{"name":"ports","ranges":{"range":[{"begin":31000,"end":32000}]},"type":"RANGES"}]
I0825 04:53:06.984380  3986 slave.cpp:589] Agent attributes: [  ]
I0825 04:53:06.984395  3986 slave.cpp:598] Agent hostname: d01d92668f5e
I0825 04:53:06.984596  3982 status_update_manager.cpp:177] Pausing sending status updates
I0825 04:53:06.986006  3991 state.cpp:64] Recovering state from '/tmp/Endpoint_SlaveEndpointTest_UnauthorizedRequest_1_9DKvX1/meta'
I0825 04:53:06.986543  3991 status_update_manager.cpp:203] Recovering status update manager
I0825 04:53:06.986721  3991 containerizer.cpp:643] Recovering containerizer
I0825 04:53:06.988268  3972 provisioner.cpp:416] Provisioner recovery complete
I0825 04:53:06.988759  3988 slave.cpp:6264] Finished recovery
I0825 04:53:06.989204  3988 slave.cpp:6446] Querying resource estimator for oversubscribable
resources
I0825 04:53:06.989513  3987 slave.cpp:6460] Received oversubscribable resources {} from the
resource estimator
I0825 04:53:06.991668  3978 process.cpp:3933] Handling HTTP event for process 'slave(804)'
with path: '/slave(804)/monitor/statistics.json'
I0825 04:53:06.993188  3975 http.cpp:1166] HTTP GET for /slave(804)/monitor/statistics.json
from 172.17.0.3:53336
I0825 04:53:06.993268  3975 http.cpp:957] Authorizing principal 'test-principal' to GET the
'/monitor/statistics.json' endpoint
I0825 04:53:06.996064  3990 slave.cpp:859] Agent terminating
[       OK ] Endpoint/SlaveEndpointTest.UnauthorizedRequest/1 (32 ms)
[ RUN      ] Endpoint/SlaveEndpointTest.UnauthorizedRequest/2
I0825 04:53:07.013440  3953 containerizer.cpp:288] Using isolation { environment_secret, posix/cpu,
posix/mem, filesystem/posix, network/cni }
W0825 04:53:07.014227  3953 backend.cpp:76] Failed to create 'aufs' backend: AufsBackend requires
root privileges
W0825 04:53:07.014415  3953 backend.cpp:76] Failed to create 'bind' backend: BindBackend requires
root privileges
I0825 04:53:07.014477  3953 provisioner.cpp:255] Using default backend 'copy'
I0825 04:53:07.020382  3982 slave.cpp:252] Mesos agent started on (805)@172.17.0.3:44159
I0825 04:53:07.020431  3982 slave.cpp:253] Flags at startup: --acls="" --appc_simple_discovery_uri_prefix="http://"
--appc_store_dir="/tmp/Endpoint_SlaveEndpointTest_UnauthorizedRequest_2_XI9iLN/store/appc"
--authenticate_http_readonly="true" --authenticate_http_readwrite="true" --authenticatee="crammd5"
--authentication_backoff_factor="1secs" --authorizer="local" --cgroups_cpu_enable_pids_and_tids_count="false"
--cgroups_enable_cfs="false" --cgroups_hierarchy="/sys/fs/cgroup" --cgroups_limit_swap="false"
--cgroups_root="mesos" --container_disk_watch_interval="15secs" --containerizers="mesos" --credential="/tmp/Endpoint_SlaveEndpointTest_UnauthorizedRequest_2_XI9iLN/credential"
--default_role="*" --disallow_sharing_agent_pid_namespace="false" --disk_watch_interval="1mins"
--docker="docker" --docker_kill_orphans="true" --docker_registry="https://registry-1.docker.io"
--docker_remove_delay="6hrs" --docker_socket="/var/run/docker.sock" --docker_stop_timeout="0ns"
--docker_store_dir="/tmp/Endpoint_SlaveEndpointTest_UnauthorizedRequest_2_XI9iLN/store/docker"
--docker_volume_checkpoint_dir="/var/run/mesos/isolators/docker/volume" --enforce_container_disk_quota="false"
--executor_registration_timeout="1mins" --executor_reregistration_timeout="2secs" --executor_shutdown_grace_period="5secs"
--fetcher_cache_dir="/tmp/Endpoint_SlaveEndpointTest_UnauthorizedRequest_2_XI9iLN/fetch" --fetcher_cache_size="2GB"
--frameworks_home="" --gc_delay="1weeks" --gc_disk_headroom="0.1" --hadoop_home="" --help="false"
--hostname_lookup="true" --http_command_executor="false" --http_credentials="/tmp/Endpoint_SlaveEndpointTest_UnauthorizedRequest_2_XI9iLN/http_credentials"
--http_heartbeat_interval="30secs" --initialize_driver_logging="true" --isolation="posix/cpu,posix/mem"
--launcher="posix" --launcher_dir="/mesos/mesos-1.5.0/_build/src" --logbufsecs="0" --logging_level="INFO"
--max_completed_executors_per_framework="150" --oversubscribed_resources_interval="15secs"
--perf_duration="10secs" --perf_interval="1mins" --port="5051" --qos_correction_interval_min="0ns"
--quiet="false" --recover="reconnect" --recovery_timeout="15mins" --registration_backoff_factor="10ms"
--resources="cpus:2;gpus:0;mem:1024;disk:1024;ports:[31000-32000]" --revocable_cpu_low_priority="true"
--runtime_dir="/tmp/Endpoint_SlaveEndpointTest_UnauthorizedRequest_2_XI9iLN" --sandbox_directory="/mnt/mesos/sandbox"
--strict="true" --switch_user="true" --systemd_enable_support="true" --systemd_runtime_directory="/run/systemd/system"
--version="false" --work_dir="/tmp/Endpoint_SlaveEndpointTest_UnauthorizedRequest_2_oIw1Lr"
I0825 04:53:07.021072  3982 credentials.hpp:86] Loading credential for authentication from
'/tmp/Endpoint_SlaveEndpointTest_UnauthorizedRequest_2_XI9iLN/credential'
I0825 04:53:07.021287  3982 slave.cpp:285] Agent using credential for: test-principal
I0825 04:53:07.021324  3982 credentials.hpp:37] Loading credentials for authentication from
'/tmp/Endpoint_SlaveEndpointTest_UnauthorizedRequest_2_XI9iLN/http_credentials'
I0825 04:53:07.021582  3982 http.cpp:1026] Creating default 'basic' HTTP authenticator for
realm 'mesos-agent-readonly'
I0825 04:53:07.021773  3982 http.cpp:1026] Creating default 'basic' HTTP authenticator for
realm 'mesos-agent-readwrite'
I0825 04:53:07.024006  3982 slave.cpp:581] Agent resources: [{"name":"cpus","scalar":{"value":2.0},"type":"SCALAR"},{"name":"mem","scalar":{"value":1024.0},"type":"SCALAR"},{"name":"disk","scalar":{"value":1024.0},"type":"SCALAR"},{"name":"ports","ranges":{"range":[{"begin":31000,"end":32000}]},"type":"RANGES"}]
I0825 04:53:07.024405  3982 slave.cpp:589] Agent attributes: [  ]
I0825 04:53:07.024430  3982 slave.cpp:598] Agent hostname: d01d92668f5e
I0825 04:53:07.024688  3974 status_update_manager.cpp:177] Pausing sending status updates
I0825 04:53:07.026818  3989 state.cpp:64] Recovering state from '/tmp/Endpoint_SlaveEndpointTest_UnauthorizedRequest_2_oIw1Lr/meta'
I0825 04:53:07.027320  3992 status_update_manager.cpp:203] Recovering status update manager
I0825 04:53:07.027554  3977 containerizer.cpp:643] Recovering containerizer
I0825 04:53:07.029315  3988 provisioner.cpp:416] Provisioner recovery complete
I0825 04:53:07.029899  3980 slave.cpp:6264] Finished recovery
I0825 04:53:07.030448  3980 slave.cpp:6446] Querying resource estimator for oversubscribable
resources
I0825 04:53:07.030818  3983 slave.cpp:6460] Received oversubscribable resources {} from the
resource estimator
I0825 04:53:07.033310  3984 process.cpp:3933] Handling HTTP event for process 'slave(805)'
with path: '/slave(805)/containers'
I0825 04:53:07.034674  3989 http.cpp:1166] HTTP GET for /slave(805)/containers from 172.17.0.3:53338
I0825 04:53:07.034752  3989 http.cpp:957] Authorizing principal 'test-principal' to GET the
'/containers' endpoint
I0825 04:53:07.037376  3983 slave.cpp:859] Agent terminating
[       OK ] Endpoint/SlaveEndpointTest.UnauthorizedRequest/2 (39 ms)
[ RUN      ] Endpoint/SlaveEndpointTest.NoAuthorizer/0
I0825 04:53:07.051363  3953 containerizer.cpp:288] Using isolation { environment_secret, posix/cpu,
posix/mem, filesystem/posix, network/cni }
W0825 04:53:07.051944  3953 backend.cpp:76] Failed to create 'aufs' backend: AufsBackend requires
root privileges
W0825 04:53:07.052090  3953 backend.cpp:76] Failed to create 'bind' backend: BindBackend requires
root privileges
I0825 04:53:07.052135  3953 provisioner.cpp:255] Using default backend 'copy'
I0825 04:53:07.054270  3953 cluster.cpp:448] Creating default 'local' authorizer
I0825 04:53:07.056809  3989 slave.cpp:252] Mesos agent started on (806)@172.17.0.3:44159
I0825 04:53:07.056856  3989 slave.cpp:253] Flags at startup: --acls="" --appc_simple_discovery_uri_prefix="http://"
--appc_store_dir="/tmp/Endpoint_SlaveEndpointTest_NoAuthorizer_0_3rbv2d/store/appc" --authenticate_http_readonly="true"
--authenticate_http_readwrite="true" --authenticatee="crammd5" --authentication_backoff_factor="1secs"
--authorizer="local" --cgroups_cpu_enable_pids_and_tids_count="false" --cgroups_enable_cfs="false"
--cgroups_hierarchy="/sys/fs/cgroup" --cgroups_limit_swap="false" --cgroups_root="mesos" --container_disk_watch_interval="15secs"
--containerizers="mesos" --credential="/tmp/Endpoint_SlaveEndpointTest_NoAuthorizer_0_3rbv2d/credential"
--default_role="*" --disallow_sharing_agent_pid_namespace="false" --disk_watch_interval="1mins"
--docker="docker" --docker_kill_orphans="true" --docker_registry="https://registry-1.docker.io"
--docker_remove_delay="6hrs" --docker_socket="/var/run/docker.sock" --docker_stop_timeout="0ns"
--docker_store_dir="/tmp/Endpoint_SlaveEndpointTest_NoAuthorizer_0_3rbv2d/store/docker" --docker_volume_checkpoint_dir="/var/run/mesos/isolators/docker/volume"
--enforce_container_disk_quota="false" --executor_registration_timeout="1mins" --executor_reregistration_timeout="2secs"
--executor_shutdown_grace_period="5secs" --fetcher_cache_dir="/tmp/Endpoint_SlaveEndpointTest_NoAuthorizer_0_3rbv2d/fetch"
--fetcher_cache_size="2GB" --frameworks_home="" --gc_delay="1weeks" --gc_disk_headroom="0.1"
--hadoop_home="" --help="false" --hostname_lookup="true" --http_command_executor="false" --http_credentials="/tmp/Endpoint_SlaveEndpointTest_NoAuthorizer_0_3rbv2d/http_credentials"
--http_heartbeat_interval="30secs" --initialize_driver_logging="true" --isolation="posix/cpu,posix/mem"
--launcher="posix" --launcher_dir="/mesos/mesos-1.5.0/_build/src" --logbufsecs="0" --logging_level="INFO"
--max_completed_executors_per_framework="150" --oversubscribed_resources_interval="15secs"
--perf_duration="10secs" --perf_interval="1mins" --port="5051" --qos_correction_interval_min="0ns"
--quiet="false" --recover="reconnect" --recovery_timeout="15mins" --registration_backoff_factor="10ms"
--resources="cpus:2;gpus:0;mem:1024;disk:1024;ports:[31000-32000]" --revocable_cpu_low_priority="true"
--runtime_dir="/tmp/Endpoint_SlaveEndpointTest_NoAuthorizer_0_3rbv2d" --sandbox_directory="/mnt/mesos/sandbox"
--strict="true" --switch_user="true" --systemd_enable_support="true" --systemd_runtime_directory="/run/systemd/system"
--version="false" --work_dir="/tmp/Endpoint_SlaveEndpointTest_NoAuthorizer_0_WdysXR"
I0825 04:53:07.057324  3989 credentials.hpp:86] Loading credential for authentication from
'/tmp/Endpoint_SlaveEndpointTest_NoAuthorizer_0_3rbv2d/credential'
I0825 04:53:07.057505  3989 slave.cpp:285] Agent using credential for: test-principal
I0825 04:53:07.057531  3989 credentials.hpp:37] Loading credentials for authentication from
'/tmp/Endpoint_SlaveEndpointTest_NoAuthorizer_0_3rbv2d/http_credentials'
I0825 04:53:07.057845  3989 http.cpp:1026] Creating default 'basic' HTTP authenticator for
realm 'mesos-agent-readonly'
I0825 04:53:07.058075  3989 http.cpp:1026] Creating default 'basic' HTTP authenticator for
realm 'mesos-agent-readwrite'
I0825 04:53:07.059743  3989 slave.cpp:581] Agent resources: [{"name":"cpus","scalar":{"value":2.0},"type":"SCALAR"},{"name":"mem","scalar":{"value":1024.0},"type":"SCALAR"},{"name":"disk","scalar":{"value":1024.0},"type":"SCALAR"},{"name":"ports","ranges":{"range":[{"begin":31000,"end":32000}]},"type":"RANGES"}]
I0825 04:53:07.059994  3989 slave.cpp:589] Agent attributes: [  ]
I0825 04:53:07.060010  3989 slave.cpp:598] Agent hostname: d01d92668f5e
I0825 04:53:07.060252  3977 status_update_manager.cpp:177] Pausing sending status updates
I0825 04:53:07.062312  3973 state.cpp:64] Recovering state from '/tmp/Endpoint_SlaveEndpointTest_NoAuthorizer_0_WdysXR/meta'
I0825 04:53:07.062705  3982 status_update_manager.cpp:203] Recovering status update manager
I0825 04:53:07.062888  3982 containerizer.cpp:643] Recovering containerizer
I0825 04:53:07.064504  3985 provisioner.cpp:416] Provisioner recovery complete
I0825 04:53:07.065116  3973 slave.cpp:6264] Finished recovery
I0825 04:53:07.065610  3973 slave.cpp:6446] Querying resource estimator for oversubscribable
resources
I0825 04:53:07.065847  3984 slave.cpp:6460] Received oversubscribable resources {} from the
resource estimator
I0825 04:53:07.068075  3977 process.cpp:3933] Handling HTTP event for process 'slave(806)'
with path: '/slave(806)/monitor/statistics'
I0825 04:53:07.069360  3990 http.cpp:1166] HTTP GET for /slave(806)/monitor/statistics from
172.17.0.3:53340
I0825 04:53:07.069502  3990 http.cpp:957] Authorizing principal 'test-principal' to GET the
'/monitor/statistics' endpoint
I0825 04:53:07.073158  3953 slave.cpp:859] Agent terminating
[       OK ] Endpoint/SlaveEndpointTest.NoAuthorizer/0 (35 ms)
[ RUN      ] Endpoint/SlaveEndpointTest.NoAuthorizer/1
I0825 04:53:07.086309  3953 containerizer.cpp:288] Using isolation { environment_secret, posix/cpu,
posix/mem, filesystem/posix, network/cni }
W0825 04:53:07.086836  3953 backend.cpp:76] Failed to create 'aufs' backend: AufsBackend requires
root privileges
W0825 04:53:07.086963  3953 backend.cpp:76] Failed to create 'bind' backend: BindBackend requires
root privileges
I0825 04:53:07.086999  3953 provisioner.cpp:255] Using default backend 'copy'
I0825 04:53:07.088968  3953 cluster.cpp:448] Creating default 'local' authorizer
I0825 04:53:07.091222  3975 slave.cpp:252] Mesos agent started on (807)@172.17.0.3:44159
I0825 04:53:07.091259  3975 slave.cpp:253] Flags at startup: --acls="" --appc_simple_discovery_uri_prefix="http://"
--appc_store_dir="/tmp/Endpoint_SlaveEndpointTest_NoAuthorizer_1_7EJKEE/store/appc" --authenticate_http_readonly="true"
--authenticate_http_readwrite="true" --authenticatee="crammd5" --authentication_backoff_factor="1secs"
--authorizer="local" --cgroups_cpu_enable_pids_and_tids_count="false" --cgroups_enable_cfs="false"
--cgroups_hierarchy="/sys/fs/cgroup" --cgroups_limit_swap="false" --cgroups_root="mesos" --container_disk_watch_interval="15secs"
--containerizers="mesos" --credential="/tmp/Endpoint_SlaveEndpointTest_NoAuthorizer_1_7EJKEE/credential"
--default_role="*" --disallow_sharing_agent_pid_namespace="false" --disk_watch_interval="1mins"
--docker="docker" --docker_kill_orphans="true" --docker_registry="https://registry-1.docker.io"
--docker_remove_delay="6hrs" --docker_socket="/var/run/docker.sock" --docker_stop_timeout="0ns"
--docker_store_dir="/tmp/Endpoint_SlaveEndpointTest_NoAuthorizer_1_7EJKEE/store/docker" --docker_volume_checkpoint_dir="/var/run/mesos/isolators/docker/volume"
--enforce_container_disk_quota="false" --executor_registration_timeout="1mins" --executor_reregistration_timeout="2secs"
--executor_shutdown_grace_period="5secs" --fetcher_cache_dir="/tmp/Endpoint_SlaveEndpointTest_NoAuthorizer_1_7EJKEE/fetch"
--fetcher_cache_size="2GB" --frameworks_home="" --gc_delay="1weeks" --gc_disk_headroom="0.1"
--hadoop_home="" --help="false" --hostname_lookup="true" --http_command_executor="false" --http_credentials="/tmp/Endpoint_SlaveEndpointTest_NoAuthorizer_1_7EJKEE/http_credentials"
--http_heartbeat_interval="30secs" --initialize_driver_logging="true" --isolation="posix/cpu,posix/mem"
--launcher="posix" --launcher_dir="/mesos/mesos-1.5.0/_build/src" --logbufsecs="0" --logging_level="INFO"
--max_completed_executors_per_framework="150" --oversubscribed_resources_interval="15secs"
--perf_duration="10secs" --perf_interval="1mins" --port="5051" --qos_correction_interval_min="0ns"
--quiet="false" --recover="reconnect" --recovery_timeout="15mins" --registration_backoff_factor="10ms"
--resources="cpus:2;gpus:0;mem:1024;disk:1024;ports:[31000-32000]" --revocable_cpu_low_priority="true"
--runtime_dir="/tmp/Endpoint_SlaveEndpointTest_NoAuthorizer_1_7EJKEE" --sandbox_directory="/mnt/mesos/sandbox"
--strict="true" --switch_user="true" --systemd_enable_support="true" --systemd_runtime_directory="/run/systemd/system"
--version="false" --work_dir="/tmp/Endpoint_SlaveEndpointTest_NoAuthorizer_1_ov7rui"
I0825 04:53:07.091727  3975 credentials.hpp:86] Loading credential for authentication from
'/tmp/Endpoint_SlaveEndpointTest_NoAuthorizer_1_7EJKEE/credential'
I0825 04:53:07.091897  3975 slave.cpp:285] Agent using credential for: test-principal
I0825 04:53:07.091920  3975 credentials.hpp:37] Loading credentials for authentication from
'/tmp/Endpoint_SlaveEndpointTest_NoAuthorizer_1_7EJKEE/http_credentials'
I0825 04:53:07.092150  3975 http.cpp:1026] Creating default 'basic' HTTP authenticator for
realm 'mesos-agent-readonly'
I0825 04:53:07.092310  3975 http.cpp:1026] Creating default 'basic' HTTP authenticator for
realm 'mesos-agent-readwrite'
I0825 04:53:07.094504  3975 slave.cpp:581] Agent resources: [{"name":"cpus","scalar":{"value":2.0},"type":"SCALAR"},{"name":"mem","scalar":{"value":1024.0},"type":"SCALAR"},{"name":"disk","scalar":{"value":1024.0},"type":"SCALAR"},{"name":"ports","ranges":{"range":[{"begin":31000,"end":32000}]},"type":"RANGES"}]
I0825 04:53:07.095018  3975 slave.cpp:589] Agent attributes: [  ]
I0825 04:53:07.095057  3975 slave.cpp:598] Agent hostname: d01d92668f5e
I0825 04:53:07.095305  3979 status_update_manager.cpp:177] Pausing sending status updates
I0825 04:53:07.097549  3985 state.cpp:64] Recovering state from '/tmp/Endpoint_SlaveEndpointTest_NoAuthorizer_1_ov7rui/meta'
I0825 04:53:07.097916  3988 status_update_manager.cpp:203] Recovering status update manager
I0825 04:53:07.098268  3989 containerizer.cpp:643] Recovering containerizer
I0825 04:53:07.100121  3994 provisioner.cpp:416] Provisioner recovery complete
I0825 04:53:07.100726  3994 slave.cpp:6264] Finished recovery
I0825 04:53:07.101274  3994 slave.cpp:6446] Querying resource estimator for oversubscribable
resources
I0825 04:53:07.101569  3977 slave.cpp:6460] Received oversubscribable resources {} from the
resource estimator
I0825 04:53:07.103826  3971 process.cpp:3933] Handling HTTP event for process 'slave(807)'
with path: '/slave(807)/monitor/statistics.json'
I0825 04:53:07.105602  3988 http.cpp:1166] HTTP GET for /slave(807)/monitor/statistics.json
from 172.17.0.3:53342
I0825 04:53:07.105696  3988 http.cpp:957] Authorizing principal 'test-principal' to GET the
'/monitor/statistics.json' endpoint
I0825 04:53:07.109232  3994 slave.cpp:859] Agent terminating
[       OK ] Endpoint/SlaveEndpointTest.NoAuthorizer/1 (38 ms)
[ RUN      ] Endpoint/SlaveEndpointTest.NoAuthorizer/2
I0825 04:53:07.125598  3953 containerizer.cpp:288] Using isolation { environment_secret, posix/cpu,
posix/mem, filesystem/posix, network/cni }
W0825 04:53:07.126266  3953 backend.cpp:76] Failed to create 'aufs' backend: AufsBackend requires
root privileges
W0825 04:53:07.126413  3953 backend.cpp:76] Failed to create 'bind' backend: BindBackend requires
root privileges
I0825 04:53:07.126457  3953 provisioner.cpp:255] Using default backend 'copy'
I0825 04:53:07.128837  3953 cluster.cpp:448] Creating default 'local' authorizer
I0825 04:53:07.131513  3981 slave.cpp:252] Mesos agent started on (808)@172.17.0.3:44159
I0825 04:53:07.131551  3981 slave.cpp:253] Flags at startup: --acls="" --appc_simple_discovery_uri_prefix="http://"
--appc_store_dir="/tmp/Endpoint_SlaveEndpointTest_NoAuthorizer_2_U7crD5/store/appc" --authenticate_http_readonly="true"
--authenticate_http_readwrite="true" --authenticatee="crammd5" --authentication_backoff_factor="1secs"
--authorizer="local" --cgroups_cpu_enable_pids_and_tids_count="false" --cgroups_enable_cfs="false"
--cgroups_hierarchy="/sys/fs/cgroup" --cgroups_limit_swap="false" --cgroups_root="mesos" --container_disk_watch_interval="15secs"
--containerizers="mesos" --credential="/tmp/Endpoint_SlaveEndpointTest_NoAuthorizer_2_U7crD5/credential"
--default_role="*" --disallow_sharing_agent_pid_namespace="false" --disk_watch_interval="1mins"
--docker="docker" --docker_kill_orphans="true" --docker_registry="https://registry-1.docker.io"
--docker_remove_delay="6hrs" --docker_socket="/var/run/docker.sock" --docker_stop_timeout="0ns"
--docker_store_dir="/tmp/Endpoint_SlaveEndpointTest_NoAuthorizer_2_U7crD5/store/docker" --docker_volume_checkpoint_dir="/var/run/mesos/isolators/docker/volume"
--enforce_container_disk_quota="false" --executor_registration_timeout="1mins" --executor_reregistration_timeout="2secs"
--executor_shutdown_grace_period="5secs" --fetcher_cache_dir="/tmp/Endpoint_SlaveEndpointTest_NoAuthorizer_2_U7crD5/fetch"
--fetcher_cache_size="2GB" --frameworks_home="" --gc_delay="1weeks" --gc_disk_headroom="0.1"
--hadoop_home="" --help="false" --hostname_lookup="true" --http_command_executor="false" --http_credentials="/tmp/Endpoint_SlaveEndpointTest_NoAuthorizer_2_U7crD5/http_credentials"
--http_heartbeat_interval="30secs" --initialize_driver_logging="true" --isolation="posix/cpu,posix/mem"
--launcher="posix" --launcher_dir="/mesos/mesos-1.5.0/_build/src" --logbufsecs="0" --logging_level="INFO"
--max_completed_executors_per_framework="150" --oversubscribed_resources_interval="15secs"
--perf_duration="10secs" --perf_interval="1mins" --port="5051" --qos_correction_interval_min="0ns"
--quiet="false" --recover="reconnect" --recovery_timeout="15mins" --registration_backoff_factor="10ms"
--resources="cpus:2;gpus:0;mem:1024;disk:1024;ports:[31000-32000]" --revocable_cpu_low_priority="true"
--runtime_dir="/tmp/Endpoint_SlaveEndpointTest_NoAuthorizer_2_U7crD5" --sandbox_directory="/mnt/mesos/sandbox"
--strict="true" --switch_user="true" --systemd_enable_support="true" --systemd_runtime_directory="/run/systemd/system"
--version="false" --work_dir="/tmp/Endpoint_SlaveEndpointTest_NoAuthorizer_2_IETonJ"
I0825 04:53:07.131927  3981 credentials.hpp:86] Loading credential for authentication from
'/tmp/Endpoint_SlaveEndpointTest_NoAuthorizer_2_U7crD5/credential'
I0825 04:53:07.132077  3981 slave.cpp:285] Agent using credential for: test-principal
I0825 04:53:07.132102  3981 credentials.hpp:37] Loading credentials for authentication from
'/tmp/Endpoint_SlaveEndpointTest_NoAuthorizer_2_U7crD5/http_credentials'
I0825 04:53:07.132349  3981 http.cpp:1026] Creating default 'basic' HTTP authenticator for
realm 'mesos-agent-readonly'
I0825 04:53:07.132519  3981 http.cpp:1026] Creating default 'basic' HTTP authenticator for
realm 'mesos-agent-readwrite'
I0825 04:53:07.133951  3981 slave.cpp:581] Agent resources: [{"name":"cpus","scalar":{"value":2.0},"type":"SCALAR"},{"name":"mem","scalar":{"value":1024.0},"type":"SCALAR"},{"name":"disk","scalar":{"value":1024.0},"type":"SCALAR"},{"name":"ports","ranges":{"range":[{"begin":31000,"end":32000}]},"type":"RANGES"}]
I0825 04:53:07.134181  3981 slave.cpp:589] Agent attributes: [  ]
I0825 04:53:07.134199  3981 slave.cpp:598] Agent hostname: d01d92668f5e
I0825 04:53:07.134351  3994 status_update_manager.cpp:177] Pausing sending status updates
I0825 04:53:07.135874  3974 state.cpp:64] Recovering state from '/tmp/Endpoint_SlaveEndpointTest_NoAuthorizer_2_IETonJ/meta'
I0825 04:53:07.136298  3973 status_update_manager.cpp:203] Recovering status update manager
I0825 04:53:07.136498  3988 containerizer.cpp:643] Recovering containerizer
I0825 04:53:07.138116  3994 provisioner.cpp:416] Provisioner recovery complete
I0825 04:53:07.138751  3991 slave.cpp:6264] Finished recovery
I0825 04:53:07.139250  3991 slave.cpp:6446] Querying resource estimator for oversubscribable
resources
I0825 04:53:07.139513  3977 slave.cpp:6460] Received oversubscribable resources {} from the
resource estimator
I0825 04:53:07.142345  3978 process.cpp:3933] Handling HTTP event for process 'slave(808)'
with path: '/slave(808)/containers'
I0825 04:53:07.143602  3992 http.cpp:1166] HTTP GET for /slave(808)/containers from 172.17.0.3:53344
I0825 04:53:07.143713  3992 http.cpp:957] Authorizing principal 'test-principal' to GET the
'/containers' endpoint
I0825 04:53:07.147949  3953 slave.cpp:859] Agent terminating
[       OK ] Endpoint/SlaveEndpointTest.NoAuthorizer/2 (36 ms)
[----------] 9 tests from Endpoint/SlaveEndpointTest (325 ms total)

[----------] 2 tests from ContainerizerType/DefaultContainerDNSFlagTest
[ RUN      ] ContainerizerType/DefaultContainerDNSFlagTest.ValidateFlag/0
[       OK ] ContainerizerType/DefaultContainerDNSFlagTest.ValidateFlag/0 (11 ms)
[ RUN      ] ContainerizerType/DefaultContainerDNSFlagTest.ValidateFlag/1
[       OK ] ContainerizerType/DefaultContainerDNSFlagTest.ValidateFlag/1 (10 ms)
[----------] 2 tests from ContainerizerType/DefaultContainerDNSFlagTest (21 ms total)

[----------] Global test environment tear-down
[==========] 1660 tests from 182 test cases ran. (608730 ms total)
[  PASSED  ] 1658 tests.
[  FAILED  ] 2 tests, listed below:
[  FAILED  ] ExamplesTest.NoExecutorFramework
[  FAILED  ] ExamplesTest.PythonFramework

 2 FAILED TESTS
  YOU HAVE 20 DISABLED TESTS

I0825 04:53:07.241482  3995 process.cpp:1072] Failed to accept socket: future discarded
make[4]: *** [check-local] Error 1
make[4]: Leaving directory `/mesos/mesos-1.5.0/_build/src'
make[3]: *** [check-am] Error 2
make[3]: Leaving directory `/mesos/mesos-1.5.0/_build/src'
make[2]: *** [check] Error 2
make[2]: Leaving directory `/mesos/mesos-1.5.0/_build/src'
make[1]: *** [check-recursive] Error 1
make[1]: Leaving directory `/mesos/mesos-1.5.0/_build'
make: *** [distcheck] Error 1
+ docker rmi mesos-1503633663-18064
Untagged: mesos-1503633663-18064:latest
Deleted: sha256:e717bbabc0b13d92da4a2455cd4c83882b1e1a14ccc3cf58fd8d6a83972efb67
Deleted: sha256:6f1702159709a81ca539dd4c2ee5658abdb9197274c077c03cd28ecf260f2faa
Deleted: sha256:dd4ca2e4804e5b89ac322db67238740a73f42f41b19454bb44891c8757147ec3
Deleted: sha256:5818fd2a24dc73015dfa254c4e28695671bacb7b3433c1a45a0f001c96c6fdc5
Deleted: sha256:f3eacf44efa02e699045343d3ca20b33521397a61debccf25847caf0e2fe217f
Deleted: sha256:cec7ec923fabfc32e16e4083c37fa3715cfc399b3ebd98eea0aaf6e3f7ccc828
Deleted: sha256:4da7e694bf86530e9a0bd4a499820fcd0ffb591903e1450f69bf8bb0e3b7c366
Deleted: sha256:dace323e58a3cdbe6fe025cd0b448181251cdc6a5ad955cb602dd9b5ebc45671
Deleted: sha256:66c588f3d09a9ce1d58a4f82346812d4fcdb768586c94436b8b3f75065bd6b2a
Deleted: sha256:7e09253eda7db7e552827df2ded66b8590eb959c3fe9d36db321707eb5457c51
Deleted: sha256:396ba3209fbc258d4e2897e3646b1c13d286fd1c54b94c174af2e904e6833afe
Deleted: sha256:fc7aee52567abf112040eaba36b2db8e44f2d15365019b458b372c54981c715d
Deleted: sha256:cc8dee24f75557b0381757900d3e83c319555c20ea8df69808429e3a7e40ba80
Deleted: sha256:516ff278240b153837e1c732e083b89da1f58b47cf348ae3cc3fcd17498f3709
Deleted: sha256:5ce83318ba051596843e0a5a09bdf608d14523a01c7af3bf4baa5a111599a425
Deleted: sha256:57cc52d377dd816cb6127550b109b207f84ee31fc8e286413eb8404cbaa1967b
Deleted: sha256:883ca5eba8dce0e60fd121fa2d763ebd983ba8d8e71bb094e24ff48d98e47536
Deleted: sha256:5eb729b829e19d0e80e4968b79f22fa0b18c9afab91ae1f6773e266fe7e9df9b
Deleted: sha256:7675a8e93f3e69fcb136044921c1f9d845702fba0260c67e544a5e75e411cd5d
Deleted: sha256:021a3b5dcadaa23651c6ccf59b752ab2cdf4943d9a0141f4f9c1d6566617880d
Deleted: sha256:d50ef973c55625afa53125a12b26699e0927c443b1bb08e643d3dfa251818bb8
Deleted: sha256:dce1b93e30d2f103c37865a396eb12350a03179d8a356858162741571132b095
Deleted: sha256:ca22a332ee53cf9a089b63756e555fc6df8a9a74b6bbaf0a95b1ed962f5e4315
Deleted: sha256:ab976489876fe9e76e5709a0b953b9915f76ef549fd2c435fbaa0aab83cd7b6e
Build step 'Execute shell' marked build as failure
Not sending mail to unregistered user yujie.jay@gmail.com
Not sending mail to unregistered user xujyan@apple.com

Mime
View raw message