mesos-builds mailing list archives

Site index · List index
Message view « Date » · « Thread »
Top « Date » · « Thread »
From Apache Jenkins Server <jenk...@builds.apache.org>
Subject Build failed in Jenkins: Mesos-Reviewbot #18876
Date Tue, 15 Aug 2017 10:23:09 GMT
See <https://builds.apache.org/job/Mesos-Reviewbot/18876/display/redirect>

------------------------------------------
[...truncated 31.01 MB...]
I0815 10:23:01.418109  5278 slave.cpp:283] Agent using credential for: test-principal
I0815 10:23:01.418138  5278 credentials.hpp:37] Loading credentials for authentication from
'/tmp/Endpoint_SlaveEndpointTest_AuthorizedRequest_2_CcQ4qe/http_credentials'
I0815 10:23:01.418668  5278 http.cpp:1026] Creating default 'basic' HTTP authenticator for
realm 'mesos-agent-readonly'
I0815 10:23:01.419054  5278 http.cpp:1026] Creating default 'basic' HTTP authenticator for
realm 'mesos-agent-readwrite'
I0815 10:23:01.421372  5278 slave.cpp:565] Agent resources: [{"name":"cpus","scalar":{"value":2.0},"type":"SCALAR"},{"name":"mem","scalar":{"value":1024.0},"type":"SCALAR"},{"name":"disk","scalar":{"value":1024.0},"type":"SCALAR"},{"name":"ports","ranges":{"range":[{"begin":31000,"end":32000}]},"type":"RANGES"}]
I0815 10:23:01.421798  5278 slave.cpp:573] Agent attributes: [  ]
I0815 10:23:01.421820  5278 slave.cpp:582] Agent hostname: 3e8535be347c
I0815 10:23:01.422201  5279 status_update_manager.cpp:177] Pausing sending status updates
I0815 10:23:01.424377  5276 state.cpp:64] Recovering state from '/tmp/Endpoint_SlaveEndpointTest_AuthorizedRequest_2_yR8GUC/meta'
I0815 10:23:01.439888  5278 status_update_manager.cpp:203] Recovering status update manager
I0815 10:23:01.440124  5278 containerizer.cpp:598] Recovering containerizer
I0815 10:23:01.442668  5278 provisioner.cpp:416] Provisioner recovery complete
I0815 10:23:01.443303  5275 slave.cpp:6210] Finished recovery
I0815 10:23:01.444279  5275 slave.cpp:6392] Querying resource estimator for oversubscribable
resources
I0815 10:23:01.444679  5277 slave.cpp:6406] Received oversubscribable resources {} from the
resource estimator
I0815 10:23:01.448842  5277 process.cpp:3933] Handling HTTP event for process 'slave(799)'
with path: '/slave(799)/containers'
I0815 10:23:01.450920  5275 http.cpp:1166] HTTP GET for /slave(799)/containers from 172.17.0.2:60336
I0815 10:23:01.451187  5275 http.cpp:957] Authorizing principal 'test-principal' to GET the
'/containers' endpoint
I0815 10:23:01.457103  5280 slave.cpp:843] Agent terminating
[       OK ] Endpoint/SlaveEndpointTest.AuthorizedRequest/2 (78 ms)
[ RUN      ] Endpoint/SlaveEndpointTest.UnauthorizedRequest/0
I0815 10:23:01.487252  5254 containerizer.cpp:246] Using isolation: posix/cpu,posix/mem,filesystem/posix,network/cni,environment_secret
W0815 10:23:01.488149  5254 backend.cpp:76] Failed to create 'overlay' backend: OverlayBackend
requires root privileges
W0815 10:23:01.488353  5254 backend.cpp:76] Failed to create 'bind' backend: BindBackend requires
root privileges
I0815 10:23:01.488472  5254 provisioner.cpp:255] Using default backend 'copy'
I0815 10:23:01.494688  5274 slave.cpp:250] Mesos agent started on (800)@172.17.0.2:40857
I0815 10:23:01.494729  5274 slave.cpp:251] Flags at startup: --acls="" --appc_simple_discovery_uri_prefix="http://"
--appc_store_dir="/tmp/Endpoint_SlaveEndpointTest_UnauthorizedRequest_0_krOreF/store/appc"
--authenticate_http_readonly="true" --authenticate_http_readwrite="true" --authenticatee="crammd5"
--authentication_backoff_factor="1secs" --authorizer="local" --cgroups_cpu_enable_pids_and_tids_count="false"
--cgroups_enable_cfs="false" --cgroups_hierarchy="/sys/fs/cgroup" --cgroups_limit_swap="false"
--cgroups_root="mesos" --container_disk_watch_interval="15secs" --containerizers="mesos" --credential="/tmp/Endpoint_SlaveEndpointTest_UnauthorizedRequest_0_krOreF/credential"
--default_role="*" --disallow_sharing_agent_pid_namespace="false" --disk_watch_interval="1mins"
--docker="docker" --docker_kill_orphans="true" --docker_registry="https://registry-1.docker.io"
--docker_remove_delay="6hrs" --docker_socket="/var/run/docker.sock" --docker_stop_timeout="0ns"
--docker_store_dir="/tmp/Endpoint_SlaveEndpointTest_UnauthorizedRequest_0_krOreF/store/docker"
--docker_volume_checkpoint_dir="/var/run/mesos/isolators/docker/volume" --enforce_container_disk_quota="false"
--executor_registration_timeout="1mins" --executor_reregistration_timeout="2secs" --executor_shutdown_grace_period="5secs"
--fetcher_cache_dir="/tmp/Endpoint_SlaveEndpointTest_UnauthorizedRequest_0_krOreF/fetch" --fetcher_cache_size="2GB"
--frameworks_home="" --gc_delay="1weeks" --gc_disk_headroom="0.1" --hadoop_home="" --help="false"
--hostname_lookup="true" --http_command_executor="false" --http_credentials="/tmp/Endpoint_SlaveEndpointTest_UnauthorizedRequest_0_krOreF/http_credentials"
--http_heartbeat_interval="30secs" --initialize_driver_logging="true" --isolation="posix/cpu,posix/mem"
--launcher="posix" --launcher_dir="/mesos/mesos-1.4.0/_build/src" --logbufsecs="0" --logging_level="INFO"
--max_completed_executors_per_framework="150" --oversubscribed_resources_interval="15secs"
--perf_duration="10secs" --perf_interval="1mins" --port="5051" --qos_correction_interval_min="0ns"
--quiet="false" --recover="reconnect" --recovery_timeout="15mins" --registration_backoff_factor="10ms"
--resources="cpus:2;gpus:0;mem:1024;disk:1024;ports:[31000-32000]" --revocable_cpu_low_priority="true"
--runtime_dir="/tmp/Endpoint_SlaveEndpointTest_UnauthorizedRequest_0_krOreF" --sandbox_directory="/mnt/mesos/sandbox"
--strict="true" --switch_user="true" --systemd_enable_support="true" --systemd_runtime_directory="/run/systemd/system"
--version="false" --work_dir="/tmp/Endpoint_SlaveEndpointTest_UnauthorizedRequest_0_KXApv3"
I0815 10:23:01.495463  5274 credentials.hpp:86] Loading credential for authentication from
'/tmp/Endpoint_SlaveEndpointTest_UnauthorizedRequest_0_krOreF/credential'
I0815 10:23:01.495733  5274 slave.cpp:283] Agent using credential for: test-principal
I0815 10:23:01.495762  5274 credentials.hpp:37] Loading credentials for authentication from
'/tmp/Endpoint_SlaveEndpointTest_UnauthorizedRequest_0_krOreF/http_credentials'
I0815 10:23:01.496161  5274 http.cpp:1026] Creating default 'basic' HTTP authenticator for
realm 'mesos-agent-readonly'
I0815 10:23:01.496453  5274 http.cpp:1026] Creating default 'basic' HTTP authenticator for
realm 'mesos-agent-readwrite'
I0815 10:23:01.498667  5274 slave.cpp:565] Agent resources: [{"name":"cpus","scalar":{"value":2.0},"type":"SCALAR"},{"name":"mem","scalar":{"value":1024.0},"type":"SCALAR"},{"name":"disk","scalar":{"value":1024.0},"type":"SCALAR"},{"name":"ports","ranges":{"range":[{"begin":31000,"end":32000}]},"type":"RANGES"}]
I0815 10:23:01.499097  5274 slave.cpp:573] Agent attributes: [  ]
I0815 10:23:01.499120  5274 slave.cpp:582] Agent hostname: 3e8535be347c
I0815 10:23:01.499382  5275 status_update_manager.cpp:177] Pausing sending status updates
I0815 10:23:01.501346  5279 state.cpp:64] Recovering state from '/tmp/Endpoint_SlaveEndpointTest_UnauthorizedRequest_0_KXApv3/meta'
I0815 10:23:01.501845  5276 status_update_manager.cpp:203] Recovering status update manager
I0815 10:23:01.502245  5274 containerizer.cpp:598] Recovering containerizer
I0815 10:23:01.504622  5277 provisioner.cpp:416] Provisioner recovery complete
I0815 10:23:01.505517  5275 slave.cpp:6210] Finished recovery
I0815 10:23:01.506316  5275 slave.cpp:6392] Querying resource estimator for oversubscribable
resources
I0815 10:23:01.506841  5273 slave.cpp:6406] Received oversubscribable resources {} from the
resource estimator
I0815 10:23:01.510967  5277 process.cpp:3933] Handling HTTP event for process 'slave(800)'
with path: '/slave(800)/monitor/statistics'
I0815 10:23:01.513166  5273 http.cpp:1166] HTTP GET for /slave(800)/monitor/statistics from
172.17.0.2:60338
I0815 10:23:01.513293  5273 http.cpp:957] Authorizing principal 'test-principal' to GET the
'/monitor/statistics' endpoint
I0815 10:23:01.517235  5254 slave.cpp:843] Agent terminating
[       OK ] Endpoint/SlaveEndpointTest.UnauthorizedRequest/0 (47 ms)
[ RUN      ] Endpoint/SlaveEndpointTest.UnauthorizedRequest/1
I0815 10:23:01.535907  5254 containerizer.cpp:246] Using isolation: posix/cpu,posix/mem,filesystem/posix,network/cni,environment_secret
W0815 10:23:01.536803  5254 backend.cpp:76] Failed to create 'overlay' backend: OverlayBackend
requires root privileges
W0815 10:23:01.537010  5254 backend.cpp:76] Failed to create 'bind' backend: BindBackend requires
root privileges
I0815 10:23:01.537053  5254 provisioner.cpp:255] Using default backend 'copy'
I0815 10:23:01.543223  5274 slave.cpp:250] Mesos agent started on (801)@172.17.0.2:40857
I0815 10:23:01.543267  5274 slave.cpp:251] Flags at startup: --acls="" --appc_simple_discovery_uri_prefix="http://"
--appc_store_dir="/tmp/Endpoint_SlaveEndpointTest_UnauthorizedRequest_1_qUlgz6/store/appc"
--authenticate_http_readonly="true" --authenticate_http_readwrite="true" --authenticatee="crammd5"
--authentication_backoff_factor="1secs" --authorizer="local" --cgroups_cpu_enable_pids_and_tids_count="false"
--cgroups_enable_cfs="false" --cgroups_hierarchy="/sys/fs/cgroup" --cgroups_limit_swap="false"
--cgroups_root="mesos" --container_disk_watch_interval="15secs" --containerizers="mesos" --credential="/tmp/Endpoint_SlaveEndpointTest_UnauthorizedRequest_1_qUlgz6/credential"
--default_role="*" --disallow_sharing_agent_pid_namespace="false" --disk_watch_interval="1mins"
--docker="docker" --docker_kill_orphans="true" --docker_registry="https://registry-1.docker.io"
--docker_remove_delay="6hrs" --docker_socket="/var/run/docker.sock" --docker_stop_timeout="0ns"
--docker_store_dir="/tmp/Endpoint_SlaveEndpointTest_UnauthorizedRequest_1_qUlgz6/store/docker"
--docker_volume_checkpoint_dir="/var/run/mesos/isolators/docker/volume" --enforce_container_disk_quota="false"
--executor_registration_timeout="1mins" --executor_reregistration_timeout="2secs" --executor_shutdown_grace_period="5secs"
--fetcher_cache_dir="/tmp/Endpoint_SlaveEndpointTest_UnauthorizedRequest_1_qUlgz6/fetch" --fetcher_cache_size="2GB"
--frameworks_home="" --gc_delay="1weeks" --gc_disk_headroom="0.1" --hadoop_home="" --help="false"
--hostname_lookup="true" --http_command_executor="false" --http_credentials="/tmp/Endpoint_SlaveEndpointTest_UnauthorizedRequest_1_qUlgz6/http_credentials"
--http_heartbeat_interval="30secs" --initialize_driver_logging="true" --isolation="posix/cpu,posix/mem"
--launcher="posix" --launcher_dir="/mesos/mesos-1.4.0/_build/src" --logbufsecs="0" --logging_level="INFO"
--max_completed_executors_per_framework="150" --oversubscribed_resources_interval="15secs"
--perf_duration="10secs" --perf_interval="1mins" --port="5051" --qos_correction_interval_min="0ns"
--quiet="false" --recover="reconnect" --recovery_timeout="15mins" --registration_backoff_factor="10ms"
--resources="cpus:2;gpus:0;mem:1024;disk:1024;ports:[31000-32000]" --revocable_cpu_low_priority="true"
--runtime_dir="/tmp/Endpoint_SlaveEndpointTest_UnauthorizedRequest_1_qUlgz6" --sandbox_directory="/mnt/mesos/sandbox"
--strict="true" --switch_user="true" --systemd_enable_support="true" --systemd_runtime_directory="/run/systemd/system"
--version="false" --work_dir="/tmp/Endpoint_SlaveEndpointTest_UnauthorizedRequest_1_62DoIu"
I0815 10:23:01.544023  5274 credentials.hpp:86] Loading credential for authentication from
'/tmp/Endpoint_SlaveEndpointTest_UnauthorizedRequest_1_qUlgz6/credential'
I0815 10:23:01.544286  5274 slave.cpp:283] Agent using credential for: test-principal
I0815 10:23:01.544314  5274 credentials.hpp:37] Loading credentials for authentication from
'/tmp/Endpoint_SlaveEndpointTest_UnauthorizedRequest_1_qUlgz6/http_credentials'
I0815 10:23:01.544708  5274 http.cpp:1026] Creating default 'basic' HTTP authenticator for
realm 'mesos-agent-readonly'
I0815 10:23:01.544999  5274 http.cpp:1026] Creating default 'basic' HTTP authenticator for
realm 'mesos-agent-readwrite'
I0815 10:23:01.547219  5274 slave.cpp:565] Agent resources: [{"name":"cpus","scalar":{"value":2.0},"type":"SCALAR"},{"name":"mem","scalar":{"value":1024.0},"type":"SCALAR"},{"name":"disk","scalar":{"value":1024.0},"type":"SCALAR"},{"name":"ports","ranges":{"range":[{"begin":31000,"end":32000}]},"type":"RANGES"}]
I0815 10:23:01.547646  5274 slave.cpp:573] Agent attributes: [  ]
I0815 10:23:01.547667  5274 slave.cpp:582] Agent hostname: 3e8535be347c
I0815 10:23:01.547984  5277 status_update_manager.cpp:177] Pausing sending status updates
I0815 10:23:01.549906  5280 state.cpp:64] Recovering state from '/tmp/Endpoint_SlaveEndpointTest_UnauthorizedRequest_1_62DoIu/meta'
I0815 10:23:01.550457  5276 status_update_manager.cpp:203] Recovering status update manager
I0815 10:23:01.550765  5276 containerizer.cpp:598] Recovering containerizer
I0815 10:23:01.552960  5279 provisioner.cpp:416] Provisioner recovery complete
I0815 10:23:01.553684  5278 slave.cpp:6210] Finished recovery
I0815 10:23:01.554597  5278 slave.cpp:6392] Querying resource estimator for oversubscribable
resources
I0815 10:23:01.555202  5276 slave.cpp:6406] Received oversubscribable resources {} from the
resource estimator
I0815 10:23:01.559253  5275 process.cpp:3933] Handling HTTP event for process 'slave(801)'
with path: '/slave(801)/monitor/statistics.json'
I0815 10:23:01.565438  5276 http.cpp:1166] HTTP GET for /slave(801)/monitor/statistics.json
from 172.17.0.2:60340
I0815 10:23:01.565556  5276 http.cpp:957] Authorizing principal 'test-principal' to GET the
'/monitor/statistics.json' endpoint
I0815 10:23:01.578999  5254 slave.cpp:843] Agent terminating
[       OK ] Endpoint/SlaveEndpointTest.UnauthorizedRequest/1 (61 ms)
[ RUN      ] Endpoint/SlaveEndpointTest.UnauthorizedRequest/2
I0815 10:23:01.596779  5254 containerizer.cpp:246] Using isolation: posix/cpu,posix/mem,filesystem/posix,network/cni,environment_secret
W0815 10:23:01.597671  5254 backend.cpp:76] Failed to create 'overlay' backend: OverlayBackend
requires root privileges
W0815 10:23:01.597873  5254 backend.cpp:76] Failed to create 'bind' backend: BindBackend requires
root privileges
I0815 10:23:01.597916  5254 provisioner.cpp:255] Using default backend 'copy'
I0815 10:23:01.604102  5273 slave.cpp:250] Mesos agent started on (802)@172.17.0.2:40857
I0815 10:23:01.604146  5273 slave.cpp:251] Flags at startup: --acls="" --appc_simple_discovery_uri_prefix="http://"
--appc_store_dir="/tmp/Endpoint_SlaveEndpointTest_UnauthorizedRequest_2_gLTzvy/store/appc"
--authenticate_http_readonly="true" --authenticate_http_readwrite="true" --authenticatee="crammd5"
--authentication_backoff_factor="1secs" --authorizer="local" --cgroups_cpu_enable_pids_and_tids_count="false"
--cgroups_enable_cfs="false" --cgroups_hierarchy="/sys/fs/cgroup" --cgroups_limit_swap="false"
--cgroups_root="mesos" --container_disk_watch_interval="15secs" --containerizers="mesos" --credential="/tmp/Endpoint_SlaveEndpointTest_UnauthorizedRequest_2_gLTzvy/credential"
--default_role="*" --disallow_sharing_agent_pid_namespace="false" --disk_watch_interval="1mins"
--docker="docker" --docker_kill_orphans="true" --docker_registry="https://registry-1.docker.io"
--docker_remove_delay="6hrs" --docker_socket="/var/run/docker.sock" --docker_stop_timeout="0ns"
--docker_store_dir="/tmp/Endpoint_SlaveEndpointTest_UnauthorizedRequest_2_gLTzvy/store/docker"
--docker_volume_checkpoint_dir="/var/run/mesos/isolators/docker/volume" --enforce_container_disk_quota="false"
--executor_registration_timeout="1mins" --executor_reregistration_timeout="2secs" --executor_shutdown_grace_period="5secs"
--fetcher_cache_dir="/tmp/Endpoint_SlaveEndpointTest_UnauthorizedRequest_2_gLTzvy/fetch" --fetcher_cache_size="2GB"
--frameworks_home="" --gc_delay="1weeks" --gc_disk_headroom="0.1" --hadoop_home="" --help="false"
--hostname_lookup="true" --http_command_executor="false" --http_credentials="/tmp/Endpoint_SlaveEndpointTest_UnauthorizedRequest_2_gLTzvy/http_credentials"
--http_heartbeat_interval="30secs" --initialize_driver_logging="true" --isolation="posix/cpu,posix/mem"
--launcher="posix" --launcher_dir="/mesos/mesos-1.4.0/_build/src" --logbufsecs="0" --logging_level="INFO"
--max_completed_executors_per_framework="150" --oversubscribed_resources_interval="15secs"
--perf_duration="10secs" --perf_interval="1mins" --port="5051" --qos_correction_interval_min="0ns"
--quiet="false" --recover="reconnect" --recovery_timeout="15mins" --registration_backoff_factor="10ms"
--resources="cpus:2;gpus:0;mem:1024;disk:1024;ports:[31000-32000]" --revocable_cpu_low_priority="true"
--runtime_dir="/tmp/Endpoint_SlaveEndpointTest_UnauthorizedRequest_2_gLTzvy" --sandbox_directory="/mnt/mesos/sandbox"
--strict="true" --switch_user="true" --systemd_enable_support="true" --systemd_runtime_directory="/run/systemd/system"
--version="false" --work_dir="/tmp/Endpoint_SlaveEndpointTest_UnauthorizedRequest_2_UwIQuW"
I0815 10:23:01.604867  5273 credentials.hpp:86] Loading credential for authentication from
'/tmp/Endpoint_SlaveEndpointTest_UnauthorizedRequest_2_gLTzvy/credential'
I0815 10:23:01.605126  5273 slave.cpp:283] Agent using credential for: test-principal
I0815 10:23:01.605152  5273 credentials.hpp:37] Loading credentials for authentication from
'/tmp/Endpoint_SlaveEndpointTest_UnauthorizedRequest_2_gLTzvy/http_credentials'
I0815 10:23:01.605518  5273 http.cpp:1026] Creating default 'basic' HTTP authenticator for
realm 'mesos-agent-readonly'
I0815 10:23:01.605778  5273 http.cpp:1026] Creating default 'basic' HTTP authenticator for
realm 'mesos-agent-readwrite'
I0815 10:23:01.607920  5273 slave.cpp:565] Agent resources: [{"name":"cpus","scalar":{"value":2.0},"type":"SCALAR"},{"name":"mem","scalar":{"value":1024.0},"type":"SCALAR"},{"name":"disk","scalar":{"value":1024.0},"type":"SCALAR"},{"name":"ports","ranges":{"range":[{"begin":31000,"end":32000}]},"type":"RANGES"}]
I0815 10:23:01.608346  5273 slave.cpp:573] Agent attributes: [  ]
I0815 10:23:01.608369  5273 slave.cpp:582] Agent hostname: 3e8535be347c
I0815 10:23:01.608780  5275 status_update_manager.cpp:177] Pausing sending status updates
I0815 10:23:01.610692  5279 state.cpp:64] Recovering state from '/tmp/Endpoint_SlaveEndpointTest_UnauthorizedRequest_2_UwIQuW/meta'
I0815 10:23:01.611263  5278 status_update_manager.cpp:203] Recovering status update manager
I0815 10:23:01.611641  5277 containerizer.cpp:598] Recovering containerizer
I0815 10:23:01.613886  5280 provisioner.cpp:416] Provisioner recovery complete
I0815 10:23:01.614624  5274 slave.cpp:6210] Finished recovery
I0815 10:23:01.615247  5274 slave.cpp:6392] Querying resource estimator for oversubscribable
resources
I0815 10:23:01.615711  5276 slave.cpp:6406] Received oversubscribable resources {} from the
resource estimator
I0815 10:23:01.619717  5280 process.cpp:3933] Handling HTTP event for process 'slave(802)'
with path: '/slave(802)/containers'
I0815 10:23:01.621773  5279 http.cpp:1166] HTTP GET for /slave(802)/containers from 172.17.0.2:60342
I0815 10:23:01.622104  5279 http.cpp:957] Authorizing principal 'test-principal' to GET the
'/containers' endpoint
I0815 10:23:01.625986  5279 slave.cpp:843] Agent terminating
[       OK ] Endpoint/SlaveEndpointTest.UnauthorizedRequest/2 (48 ms)
[ RUN      ] Endpoint/SlaveEndpointTest.NoAuthorizer/0
I0815 10:23:01.646258  5254 containerizer.cpp:246] Using isolation: posix/cpu,posix/mem,filesystem/posix,network/cni,environment_secret
W0815 10:23:01.647155  5254 backend.cpp:76] Failed to create 'overlay' backend: OverlayBackend
requires root privileges
W0815 10:23:01.647431  5254 backend.cpp:76] Failed to create 'bind' backend: BindBackend requires
root privileges
I0815 10:23:01.647475  5254 provisioner.cpp:255] Using default backend 'copy'
I0815 10:23:01.650326  5254 cluster.cpp:448] Creating default 'local' authorizer
I0815 10:23:01.653947  5276 slave.cpp:250] Mesos agent started on (803)@172.17.0.2:40857
I0815 10:23:01.653991  5276 slave.cpp:251] Flags at startup: --acls="" --appc_simple_discovery_uri_prefix="http://"
--appc_store_dir="/tmp/Endpoint_SlaveEndpointTest_NoAuthorizer_0_y0KrZ0/store/appc" --authenticate_http_readonly="true"
--authenticate_http_readwrite="true" --authenticatee="crammd5" --authentication_backoff_factor="1secs"
--authorizer="local" --cgroups_cpu_enable_pids_and_tids_count="false" --cgroups_enable_cfs="false"
--cgroups_hierarchy="/sys/fs/cgroup" --cgroups_limit_swap="false" --cgroups_root="mesos" --container_disk_watch_interval="15secs"
--containerizers="mesos" --credential="/tmp/Endpoint_SlaveEndpointTest_NoAuthorizer_0_y0KrZ0/credential"
--default_role="*" --disallow_sharing_agent_pid_namespace="false" --disk_watch_interval="1mins"
--docker="docker" --docker_kill_orphans="true" --docker_registry="https://registry-1.docker.io"
--docker_remove_delay="6hrs" --docker_socket="/var/run/docker.sock" --docker_stop_timeout="0ns"
--docker_store_dir="/tmp/Endpoint_SlaveEndpointTest_NoAuthorizer_0_y0KrZ0/store/docker" --docker_volume_checkpoint_dir="/var/run/mesos/isolators/docker/volume"
--enforce_container_disk_quota="false" --executor_registration_timeout="1mins" --executor_reregistration_timeout="2secs"
--executor_shutdown_grace_period="5secs" --fetcher_cache_dir="/tmp/Endpoint_SlaveEndpointTest_NoAuthorizer_0_y0KrZ0/fetch"
--fetcher_cache_size="2GB" --frameworks_home="" --gc_delay="1weeks" --gc_disk_headroom="0.1"
--hadoop_home="" --help="false" --hostname_lookup="true" --http_command_executor="false" --http_credentials="/tmp/Endpoint_SlaveEndpointTest_NoAuthorizer_0_y0KrZ0/http_credentials"
--http_heartbeat_interval="30secs" --initialize_driver_logging="true" --isolation="posix/cpu,posix/mem"
--launcher="posix" --launcher_dir="/mesos/mesos-1.4.0/_build/src" --logbufsecs="0" --logging_level="INFO"
--max_completed_executors_per_framework="150" --oversubscribed_resources_interval="15secs"
--perf_duration="10secs" --perf_interval="1mins" --port="5051" --qos_correction_interval_min="0ns"
--quiet="false" --recover="reconnect" --recovery_timeout="15mins" --registration_backoff_factor="10ms"
--resources="cpus:2;gpus:0;mem:1024;disk:1024;ports:[31000-32000]" --revocable_cpu_low_priority="true"
--runtime_dir="/tmp/Endpoint_SlaveEndpointTest_NoAuthorizer_0_y0KrZ0" --sandbox_directory="/mnt/mesos/sandbox"
--strict="true" --switch_user="true" --systemd_enable_support="true" --systemd_runtime_directory="/run/systemd/system"
--version="false" --work_dir="/tmp/Endpoint_SlaveEndpointTest_NoAuthorizer_0_AmyNQo"
I0815 10:23:01.654846  5276 credentials.hpp:86] Loading credential for authentication from
'/tmp/Endpoint_SlaveEndpointTest_NoAuthorizer_0_y0KrZ0/credential'
I0815 10:23:01.655318  5276 slave.cpp:283] Agent using credential for: test-principal
I0815 10:23:01.655349  5276 credentials.hpp:37] Loading credentials for authentication from
'/tmp/Endpoint_SlaveEndpointTest_NoAuthorizer_0_y0KrZ0/http_credentials'
I0815 10:23:01.655783  5276 http.cpp:1026] Creating default 'basic' HTTP authenticator for
realm 'mesos-agent-readonly'
I0815 10:23:01.656175  5276 http.cpp:1026] Creating default 'basic' HTTP authenticator for
realm 'mesos-agent-readwrite'
I0815 10:23:01.658479  5276 slave.cpp:565] Agent resources: [{"name":"cpus","scalar":{"value":2.0},"type":"SCALAR"},{"name":"mem","scalar":{"value":1024.0},"type":"SCALAR"},{"name":"disk","scalar":{"value":1024.0},"type":"SCALAR"},{"name":"ports","ranges":{"range":[{"begin":31000,"end":32000}]},"type":"RANGES"}]
I0815 10:23:01.658902  5276 slave.cpp:573] Agent attributes: [  ]
I0815 10:23:01.658923  5276 slave.cpp:582] Agent hostname: 3e8535be347c
I0815 10:23:01.659193  5277 status_update_manager.cpp:177] Pausing sending status updates
I0815 10:23:01.661310  5280 state.cpp:64] Recovering state from '/tmp/Endpoint_SlaveEndpointTest_NoAuthorizer_0_AmyNQo/meta'
I0815 10:23:01.661981  5280 status_update_manager.cpp:203] Recovering status update manager
I0815 10:23:01.662394  5274 containerizer.cpp:598] Recovering containerizer
I0815 10:23:01.664691  5278 provisioner.cpp:416] Provisioner recovery complete
I0815 10:23:01.665428  5277 slave.cpp:6210] Finished recovery
I0815 10:23:01.666213  5277 slave.cpp:6392] Querying resource estimator for oversubscribable
resources
I0815 10:23:01.666678  5279 slave.cpp:6406] Received oversubscribable resources {} from the
resource estimator
I0815 10:23:01.670944  5276 process.cpp:3933] Handling HTTP event for process 'slave(803)'
with path: '/slave(803)/monitor/statistics'
I0815 10:23:01.673259  5279 http.cpp:1166] HTTP GET for /slave(803)/monitor/statistics from
172.17.0.2:60344
I0815 10:23:01.673501  5279 http.cpp:957] Authorizing principal 'test-principal' to GET the
'/monitor/statistics' endpoint
I0815 10:23:01.678926  5274 slave.cpp:843] Agent terminating
[       OK ] Endpoint/SlaveEndpointTest.NoAuthorizer/0 (52 ms)
[ RUN      ] Endpoint/SlaveEndpointTest.NoAuthorizer/1
I0815 10:23:01.698531  5254 containerizer.cpp:246] Using isolation: posix/cpu,posix/mem,filesystem/posix,network/cni,environment_secret
W0815 10:23:01.699430  5254 backend.cpp:76] Failed to create 'overlay' backend: OverlayBackend
requires root privileges
W0815 10:23:01.699635  5254 backend.cpp:76] Failed to create 'bind' backend: BindBackend requires
root privileges
I0815 10:23:01.699756  5254 provisioner.cpp:255] Using default backend 'copy'
I0815 10:23:01.702600  5254 cluster.cpp:448] Creating default 'local' authorizer
I0815 10:23:01.706466  5280 slave.cpp:250] Mesos agent started on (804)@172.17.0.2:40857
I0815 10:23:01.706540  5280 slave.cpp:251] Flags at startup: --acls="" --appc_simple_discovery_uri_prefix="http://"
--appc_store_dir="/tmp/Endpoint_SlaveEndpointTest_NoAuthorizer_1_QnMY0t/store/appc" --authenticate_http_readonly="true"
--authenticate_http_readwrite="true" --authenticatee="crammd5" --authentication_backoff_factor="1secs"
--authorizer="local" --cgroups_cpu_enable_pids_and_tids_count="false" --cgroups_enable_cfs="false"
--cgroups_hierarchy="/sys/fs/cgroup" --cgroups_limit_swap="false" --cgroups_root="mesos" --container_disk_watch_interval="15secs"
--containerizers="mesos" --credential="/tmp/Endpoint_SlaveEndpointTest_NoAuthorizer_1_QnMY0t/credential"
--default_role="*" --disallow_sharing_agent_pid_namespace="false" --disk_watch_interval="1mins"
--docker="docker" --docker_kill_orphans="true" --docker_registry="https://registry-1.docker.io"
--docker_remove_delay="6hrs" --docker_socket="/var/run/docker.sock" --docker_stop_timeout="0ns"
--docker_store_dir="/tmp/Endpoint_SlaveEndpointTest_NoAuthorizer_1_QnMY0t/store/docker" --docker_volume_checkpoint_dir="/var/run/mesos/isolators/docker/volume"
--enforce_container_disk_quota="false" --executor_registration_timeout="1mins" --executor_reregistration_timeout="2secs"
--executor_shutdown_grace_period="5secs" --fetcher_cache_dir="/tmp/Endpoint_SlaveEndpointTest_NoAuthorizer_1_QnMY0t/fetch"
--fetcher_cache_size="2GB" --frameworks_home="" --gc_delay="1weeks" --gc_disk_headroom="0.1"
--hadoop_home="" --help="false" --hostname_lookup="true" --http_command_executor="false" --http_credentials="/tmp/Endpoint_SlaveEndpointTest_NoAuthorizer_1_QnMY0t/http_credentials"
--http_heartbeat_interval="30secs" --initialize_driver_logging="true" --isolation="posix/cpu,posix/mem"
--launcher="posix" --launcher_dir="/mesos/mesos-1.4.0/_build/src" --logbufsecs="0" --logging_level="INFO"
--max_completed_executors_per_framework="150" --oversubscribed_resources_interval="15secs"
--perf_duration="10secs" --perf_interval="1mins" --port="5051" --qos_correction_interval_min="0ns"
--quiet="false" --recover="reconnect" --recovery_timeout="15mins" --registration_backoff_factor="10ms"
--resources="cpus:2;gpus:0;mem:1024;disk:1024;ports:[31000-32000]" --revocable_cpu_low_priority="true"
--runtime_dir="/tmp/Endpoint_SlaveEndpointTest_NoAuthorizer_1_QnMY0t" --sandbox_directory="/mnt/mesos/sandbox"
--strict="true" --switch_user="true" --systemd_enable_support="true" --systemd_runtime_directory="/run/systemd/system"
--version="false" --work_dir="/tmp/Endpoint_SlaveEndpointTest_NoAuthorizer_1_EahRJR"
I0815 10:23:01.708487  5280 credentials.hpp:86] Loading credential for authentication from
'/tmp/Endpoint_SlaveEndpointTest_NoAuthorizer_1_QnMY0t/credential'
I0815 10:23:01.708832  5280 slave.cpp:283] Agent using credential for: test-principal
I0815 10:23:01.708884  5280 credentials.hpp:37] Loading credentials for authentication from
'/tmp/Endpoint_SlaveEndpointTest_NoAuthorizer_1_QnMY0t/http_credentials'
I0815 10:23:01.709357  5280 http.cpp:1026] Creating default 'basic' HTTP authenticator for
realm 'mesos-agent-readonly'
I0815 10:23:01.709715  5280 http.cpp:1026] Creating default 'basic' HTTP authenticator for
realm 'mesos-agent-readwrite'
I0815 10:23:01.712021  5280 slave.cpp:565] Agent resources: [{"name":"cpus","scalar":{"value":2.0},"type":"SCALAR"},{"name":"mem","scalar":{"value":1024.0},"type":"SCALAR"},{"name":"disk","scalar":{"value":1024.0},"type":"SCALAR"},{"name":"ports","ranges":{"range":[{"begin":31000,"end":32000}]},"type":"RANGES"}]
I0815 10:23:01.712630  5280 slave.cpp:573] Agent attributes: [  ]
I0815 10:23:01.712723  5280 slave.cpp:582] Agent hostname: 3e8535be347c
I0815 10:23:01.713093  5273 status_update_manager.cpp:177] Pausing sending status updates
I0815 10:23:01.715138  5276 state.cpp:64] Recovering state from '/tmp/Endpoint_SlaveEndpointTest_NoAuthorizer_1_EahRJR/meta'
I0815 10:23:01.715793  5273 status_update_manager.cpp:203] Recovering status update manager
I0815 10:23:01.716220  5278 containerizer.cpp:598] Recovering containerizer
I0815 10:23:01.718564  5278 provisioner.cpp:416] Provisioner recovery complete
I0815 10:23:01.719180  5275 slave.cpp:6210] Finished recovery
I0815 10:23:01.719996  5275 slave.cpp:6392] Querying resource estimator for oversubscribable
resources
I0815 10:23:01.720592  5274 slave.cpp:6406] Received oversubscribable resources {} from the
resource estimator
I0815 10:23:01.724818  5275 process.cpp:3933] Handling HTTP event for process 'slave(804)'
with path: '/slave(804)/monitor/statistics.json'
I0815 10:23:01.727138  5279 http.cpp:1166] HTTP GET for /slave(804)/monitor/statistics.json
from 172.17.0.2:60346
I0815 10:23:01.727381  5279 http.cpp:957] Authorizing principal 'test-principal' to GET the
'/monitor/statistics.json' endpoint
I0815 10:23:01.732689  5279 slave.cpp:843] Agent terminating
[       OK ] Endpoint/SlaveEndpointTest.NoAuthorizer/1 (53 ms)
[ RUN      ] Endpoint/SlaveEndpointTest.NoAuthorizer/2
I0815 10:23:01.752408  5254 containerizer.cpp:246] Using isolation: posix/cpu,posix/mem,filesystem/posix,network/cni,environment_secret
W0815 10:23:01.753307  5254 backend.cpp:76] Failed to create 'overlay' backend: OverlayBackend
requires root privileges
W0815 10:23:01.753509  5254 backend.cpp:76] Failed to create 'bind' backend: BindBackend requires
root privileges
I0815 10:23:01.753634  5254 provisioner.cpp:255] Using default backend 'copy'
I0815 10:23:01.756501  5254 cluster.cpp:448] Creating default 'local' authorizer
I0815 10:23:01.759977  5280 slave.cpp:250] Mesos agent started on (805)@172.17.0.2:40857
I0815 10:23:01.760049  5280 slave.cpp:251] Flags at startup: --acls="" --appc_simple_discovery_uri_prefix="http://"
--appc_store_dir="/tmp/Endpoint_SlaveEndpointTest_NoAuthorizer_2_23wpBX/store/appc" --authenticate_http_readonly="true"
--authenticate_http_readwrite="true" --authenticatee="crammd5" --authentication_backoff_factor="1secs"
--authorizer="local" --cgroups_cpu_enable_pids_and_tids_count="false" --cgroups_enable_cfs="false"
--cgroups_hierarchy="/sys/fs/cgroup" --cgroups_limit_swap="false" --cgroups_root="mesos" --container_disk_watch_interval="15secs"
--containerizers="mesos" --credential="/tmp/Endpoint_SlaveEndpointTest_NoAuthorizer_2_23wpBX/credential"
--default_role="*" --disallow_sharing_agent_pid_namespace="false" --disk_watch_interval="1mins"
--docker="docker" --docker_kill_orphans="true" --docker_registry="https://registry-1.docker.io"
--docker_remove_delay="6hrs" --docker_socket="/var/run/docker.sock" --docker_stop_timeout="0ns"
--docker_store_dir="/tmp/Endpoint_SlaveEndpointTest_NoAuthorizer_2_23wpBX/store/docker" --docker_volume_checkpoint_dir="/var/run/mesos/isolators/docker/volume"
--enforce_container_disk_quota="false" --executor_registration_timeout="1mins" --executor_reregistration_timeout="2secs"
--executor_shutdown_grace_period="5secs" --fetcher_cache_dir="/tmp/Endpoint_SlaveEndpointTest_NoAuthorizer_2_23wpBX/fetch"
--fetcher_cache_size="2GB" --frameworks_home="" --gc_delay="1weeks" --gc_disk_headroom="0.1"
--hadoop_home="" --help="false" --hostname_lookup="true" --http_command_executor="false" --http_credentials="/tmp/Endpoint_SlaveEndpointTest_NoAuthorizer_2_23wpBX/http_credentials"
--http_heartbeat_interval="30secs" --initialize_driver_logging="true" --isolation="posix/cpu,posix/mem"
--launcher="posix" --launcher_dir="/mesos/mesos-1.4.0/_build/src" --logbufsecs="0" --logging_level="INFO"
--max_completed_executors_per_framework="150" --oversubscribed_resources_interval="15secs"
--perf_duration="10secs" --perf_interval="1mins" --port="5051" --qos_correction_interval_min="0ns"
--quiet="false" --recover="reconnect" --recovery_timeout="15mins" --registration_backoff_factor="10ms"
--resources="cpus:2;gpus:0;mem:1024;disk:1024;ports:[31000-32000]" --revocable_cpu_low_priority="true"
--runtime_dir="/tmp/Endpoint_SlaveEndpointTest_NoAuthorizer_2_23wpBX" --sandbox_directory="/mnt/mesos/sandbox"
--strict="true" --switch_user="true" --systemd_enable_support="true" --systemd_runtime_directory="/run/systemd/system"
--version="false" --work_dir="/tmp/Endpoint_SlaveEndpointTest_NoAuthorizer_2_SHCybl"
I0815 10:23:01.760848  5280 credentials.hpp:86] Loading credential for authentication from
'/tmp/Endpoint_SlaveEndpointTest_NoAuthorizer_2_23wpBX/credential'
I0815 10:23:01.761189  5280 slave.cpp:283] Agent using credential for: test-principal
I0815 10:23:01.761243  5280 credentials.hpp:37] Loading credentials for authentication from
'/tmp/Endpoint_SlaveEndpointTest_NoAuthorizer_2_23wpBX/http_credentials'
I0815 10:23:01.761724  5280 http.cpp:1026] Creating default 'basic' HTTP authenticator for
realm 'mesos-agent-readonly'
I0815 10:23:01.762099  5280 http.cpp:1026] Creating default 'basic' HTTP authenticator for
realm 'mesos-agent-readwrite'
I0815 10:23:01.764400  5280 slave.cpp:565] Agent resources: [{"name":"cpus","scalar":{"value":2.0},"type":"SCALAR"},{"name":"mem","scalar":{"value":1024.0},"type":"SCALAR"},{"name":"disk","scalar":{"value":1024.0},"type":"SCALAR"},{"name":"ports","ranges":{"range":[{"begin":31000,"end":32000}]},"type":"RANGES"}]
I0815 10:23:01.764878  5280 slave.cpp:573] Agent attributes: [  ]
I0815 10:23:01.764926  5280 slave.cpp:582] Agent hostname: 3e8535be347c
I0815 10:23:01.765338  5278 status_update_manager.cpp:177] Pausing sending status updates
I0815 10:23:01.767541  5273 state.cpp:64] Recovering state from '/tmp/Endpoint_SlaveEndpointTest_NoAuthorizer_2_SHCybl/meta'
I0815 10:23:01.768067  5277 status_update_manager.cpp:203] Recovering status update manager
I0815 10:23:01.768450  5279 containerizer.cpp:598] Recovering containerizer
I0815 10:23:01.770799  5276 provisioner.cpp:416] Provisioner recovery complete
I0815 10:23:01.771345  5273 slave.cpp:6210] Finished recovery
I0815 10:23:01.771972  5273 slave.cpp:6392] Querying resource estimator for oversubscribable
resources
I0815 10:23:01.772517  5279 slave.cpp:6406] Received oversubscribable resources {} from the
resource estimator
I0815 10:23:01.776588  5276 process.cpp:3933] Handling HTTP event for process 'slave(805)'
with path: '/slave(805)/containers'
I0815 10:23:01.778734  5280 http.cpp:1166] HTTP GET for /slave(805)/containers from 172.17.0.2:60348
I0815 10:23:01.778894  5280 http.cpp:957] Authorizing principal 'test-principal' to GET the
'/containers' endpoint
I0815 10:23:01.785148  5254 slave.cpp:843] Agent terminating
[       OK ] Endpoint/SlaveEndpointTest.NoAuthorizer/2 (52 ms)
[----------] 9 tests from Endpoint/SlaveEndpointTest (497 ms total)

[----------] 2 tests from ContainerizerType/DefaultContainerDNSFlagTest
[ RUN      ] ContainerizerType/DefaultContainerDNSFlagTest.ValidateFlag/0
[       OK ] ContainerizerType/DefaultContainerDNSFlagTest.ValidateFlag/0 (19 ms)
[ RUN      ] ContainerizerType/DefaultContainerDNSFlagTest.ValidateFlag/1
[       OK ] ContainerizerType/DefaultContainerDNSFlagTest.ValidateFlag/1 (20 ms)
[----------] 2 tests from ContainerizerType/DefaultContainerDNSFlagTest (39 ms total)

[----------] Global test environment tear-down
[==========] 1651 tests from 181 test cases ran. (775239 ms total)
[  PASSED  ] 1647 tests.
[  FAILED  ] 4 tests, listed below:
[  FAILED  ] DefaultExecutorCheckTest.CommandCheckDeliveredAndReconciled
[  FAILED  ] DefaultExecutorCheckTest.CommandCheckStatusChange
[  FAILED  ] DefaultExecutorCheckTest.CommandCheckSeesParentsEnv
[  FAILED  ] DefaultExecutorCheckTest.CommandCheckSharesWorkDirWithTask

 4 FAILED TESTS
  YOU HAVE 20 DISABLED TESTS

I0815 10:23:01.971077  5281 process.cpp:1072] Failed to accept socket: future discarded
make[4]: *** [check-local] Error 1
make[4]: Leaving directory `/mesos/mesos-1.4.0/_build/src'
make[3]: *** [check-am] Error 2
make[3]: Leaving directory `/mesos/mesos-1.4.0/_build/src'
make[2]: *** [check] Error 2
make[2]: Leaving directory `/mesos/mesos-1.4.0/_build/src'
make[1]: *** [check-recursive] Error 1
make[1]: Leaving directory `/mesos/mesos-1.4.0/_build'
make: *** [distcheck] Error 1
+ docker rmi mesos-1502786085-15339
Untagged: mesos-1502786085-15339:latest
Deleted: sha256:d09b2444a21dbafe463d0b84eb0a60c2cc5328962dd02001eaba35410103a9f8
Deleted: sha256:67d157901969f5877d6f34f39b77e8ef89ddcf3e57a65d0aac35be61fafa5873
Deleted: sha256:5d5129c2f557c805e38b8ac8a7d2946dfb1e3eac31ec0e5fd1af005fb7093237
Deleted: sha256:b62ac9b31a3efef6bff6b1c8ce50c0fbaf39978e7e42eeec51b0b7b0dfc00cf9
Deleted: sha256:0dde041c0745a05e3b2e9fc7b19efe8e3af3df8d4e1a4d90e42a6a97340d190f
Deleted: sha256:cf90a35500871003398256575b39333a3f0cd8700bf03f6f12b010a85f106c27
Deleted: sha256:d03b68a7841953899fe915dfec3c1223dfeca49da88f5e7f3c4f9c313c072d42
Deleted: sha256:9e9b8db81c7622f42cbd3a5678c83e0737d3224525a0660525e96b08f495d562
Deleted: sha256:d0440c8df806e105b6de90276d3061f2b3f61b120f9774b4dbc4c57469399287
Deleted: sha256:2e91e05d59434eb6c51bb34674f133feba041c5a9414635a7f98597f8d63bbe0
Deleted: sha256:f1c17064a5e038d1346cfa69f1dfe04b9476cdea6ebda2cae83f5770db964bc8
Deleted: sha256:919f8608d4cceb341d8d61d173d57e7f68fc50783b1ee1bc3ad7f717360fac00
Deleted: sha256:8e633efe7df315ed548a1d7eeccba9430a40de37354a66576c75f6a5c9a3ec5e
Deleted: sha256:dd19eb04d50a80d35e78da38c06a568ded1ec65611cd3210b48a5400fb36a02a
Deleted: sha256:7d0ecb7f0aa70aeee4d3fcc5c6c798bac1a41248f61b6517a8f0a5790e8993bc
Deleted: sha256:40bcac64ec31723d9aeac44da35ad339028398e72f803be6a46346646ce3546b
Deleted: sha256:9c7c1706f0fd48bc28a2e8c427d9dd33a7eca531af63189e13002893e86d3405
Deleted: sha256:1925b61ce65ed81ac1dcba496deacb48eb3195bf0249a97e1391fcfbfee678c5
Deleted: sha256:059ba18929e727a2774557646c6bbbbe29310ae78b4fcb5f3fdeebe597998c51
Deleted: sha256:32ee9cffbc5fce4124d38917c596c12a5994c032b6b6e85d09b79139185f8e44
Deleted: sha256:904a1ba611e6f0a3a747f1190380f6735ff6d4f6195c4fdd4e9f65e4e83745e7
Deleted: sha256:9e6cab52f39ec4011a04482f259a688d75b8ddc96c5deca192bdd3a41985bd05
Deleted: sha256:50536d848cadbc6e4d862ef7434e37b8a82061e9179206a0ad87f6aa17a36004
Deleted: sha256:182b81294f693d52a3b800243472280d09eb9df92c2399f200d68972a31969f1
Build step 'Execute shell' marked build as failure

Mime
View raw message